myfaces-commits mailing list archives

Site index · List index
Message view « Date » · « Thread »
Top « Date » · « Thread »
From Apache Jenkins Server <jenk...@builds.apache.org>
Subject Build failed in Jenkins: myfaces-maven2-plugins #2044
Date Sat, 26 Sep 2015 13:03:37 GMT
See <https://builds.apache.org/job/myfaces-maven2-plugins/2044/>

------------------------------------------
[...truncated 588 lines...]
[JENKINS] Recording test results
[INFO] [jar:jar {execution: default-jar}]
[INFO] Building jar: <https://builds.apache.org/job/myfaces-maven2-plugins/ws/maven2-plugins/myfaces-wagon-plugin/target/myfaces-wagon-plugin-1.0.1-SNAPSHOT.jar>
[INFO] [plugin:addPluginArtifactMetadata {execution: default-addPluginArtifactMetadata}]
[INFO] [install:install {execution: default-install}]
[INFO] Installing <https://builds.apache.org/job/myfaces-maven2-plugins/ws/maven2-plugins/myfaces-wagon-plugin/target/myfaces-wagon-plugin-1.0.1-SNAPSHOT.jar>
to /home/jenkins/jenkins-slave/maven-repositories/1/org/apache/myfaces/buildtools/myfaces-wagon-plugin/1.0.1-SNAPSHOT/myfaces-wagon-plugin-1.0.1-SNAPSHOT.jar
[INFO] ------------------------------------------------------------------------
[INFO] Building Apache MyFaces Buildtools Maven2 XRTS Plugin
[INFO]    task-segment: [install]
[INFO] ------------------------------------------------------------------------
[INFO] [antrun:run {execution: javadoc.resources}]
[INFO] Executing tasks
[INFO] Executed tasks
[INFO] [plugin:descriptor {execution: default-descriptor}]
[INFO] Using 2 extractors.
[INFO] Applying extractor for language: java
[INFO] Extractor for language: java found 2 mojo descriptors.
[INFO] Applying extractor for language: bsh
[INFO] Extractor for language: bsh found 0 mojo descriptors.
[INFO] [remote-resources:process {execution: default}]
[INFO] [resources:resources {execution: default-resources}]
[INFO] Using 'UTF-8' encoding to copy filtered resources.
[INFO] Copying 0 resource
[INFO] Copying 3 resources
[INFO] [compiler:compile {execution: default-compile}]
[INFO] Nothing to compile - all classes are up to date
[INFO] [resources:testResources {execution: default-testResources}]
[INFO] Using 'UTF-8' encoding to copy filtered resources.
[INFO] skip non existing resourceDirectory <https://builds.apache.org/job/myfaces-maven2-plugins/ws/maven2-plugins/myfaces-xrts-plugin/src/test/resources>
[INFO] Copying 3 resources
[INFO] [compiler:testCompile {execution: default-testCompile}]
[INFO] No sources to compile
[INFO] [surefire:test {execution: default-test}]
[INFO] Surefire report directory: <https://builds.apache.org/job/myfaces-maven2-plugins/ws/maven2-plugins/myfaces-xrts-plugin/target/surefire-reports>

-------------------------------------------------------
 T E S T S
-------------------------------------------------------
There are no tests to run.

Results :

Tests run: 0, Failures: 0, Errors: 0, Skipped: 0

[JENKINS] Recording test results
[INFO] [jar:jar {execution: default-jar}]
[INFO] Building jar: <https://builds.apache.org/job/myfaces-maven2-plugins/ws/maven2-plugins/myfaces-xrts-plugin/target/myfaces-xrts-plugin-1.0.1-SNAPSHOT.jar>
[INFO] [plugin:addPluginArtifactMetadata {execution: default-addPluginArtifactMetadata}]
[INFO] [install:install {execution: default-install}]
[INFO] Installing <https://builds.apache.org/job/myfaces-maven2-plugins/ws/maven2-plugins/myfaces-xrts-plugin/target/myfaces-xrts-plugin-1.0.1-SNAPSHOT.jar>
to /home/jenkins/jenkins-slave/maven-repositories/1/org/apache/myfaces/buildtools/myfaces-xrts-plugin/1.0.1-SNAPSHOT/myfaces-xrts-plugin-1.0.1-SNAPSHOT.jar
[INFO] ------------------------------------------------------------------------
[INFO] Building Apache MyFaces Buildtools Maven2 Plugin Module
[INFO]    task-segment: [install]
[INFO] ------------------------------------------------------------------------
[INFO] [remote-resources:process {execution: default}]
[INFO] [site:attach-descriptor {execution: default-attach-descriptor}]
[INFO] [install:install {execution: default-install}]
[INFO] Installing <https://builds.apache.org/job/myfaces-maven2-plugins/ws/maven2-plugins/pom.xml>
to /home/jenkins/jenkins-slave/maven-repositories/1/org/apache/myfaces/buildtools/myfaces-plugin-module/1-SNAPSHOT/myfaces-plugin-module-1-SNAPSHOT.pom
[INFO] 
[INFO] 
[INFO] ------------------------------------------------------------------------
[INFO] Reactor Summary:
[INFO] ------------------------------------------------------------------------
[INFO] Apache MyFaces Buildtools Maven2 Plugin Parent ........ SUCCESS [5.592s]
[INFO] Apache MyFaces Buildtools Maven2 Builder Annotations .. SUCCESS [2.603s]
[INFO] Apache MyFaces Buildtools Maven2 Builder Plugin ....... SUCCESS [10.182s]
[INFO] Apache MyFaces Buildtools Maven2 Faces Plugin ......... SUCCESS [4.149s]
[INFO] Apache MyFaces Buildtools Maven2 i18n Plugin .......... SUCCESS [0.766s]
[INFO] Apache MyFaces Buildtools Maven2 Javacc Plugin ........ SUCCESS [0.710s]
[INFO] Apache MyFaces Buildtools Maven2 Javascript Plugin .... SUCCESS [5.619s]
[INFO] Apache MyFaces Buildtools Maven2 Javascript Documentation Plugin  SUCCESS [0.611s]
[INFO] Apache MyFaces Buildtools Maven2 JDev Plugin .......... SUCCESS [0.406s]
[INFO] Apache MyFaces Buildtools Maven2 Tag Documentation Report  SUCCESS [1.773s]
[INFO] Apache MyFaces Buildtools Maven2 Wagon Plugin ......... SUCCESS [0.489s]
[INFO] Apache MyFaces Buildtools Maven2 XRTS Plugin .......... SUCCESS [0.360s]
[INFO] Apache MyFaces Buildtools Maven2 Plugin Module ........ SUCCESS [1.123s]
[INFO] ------------------------------------------------------------------------
[INFO] ------------------------------------------------------------------------
[INFO] BUILD SUCCESSFUL
[INFO] ------------------------------------------------------------------------
[INFO] Total time: 44 seconds
[INFO] Finished at: Sat Sep 26 12:56:26 UTC 2015
[INFO] Final Memory: 97M/785M
[INFO] ------------------------------------------------------------------------
[JENKINS] Archiving <https://builds.apache.org/job/myfaces-maven2-plugins/ws/maven2-plugins/myfaces-i18n-plugin/pom.xml>
to org.apache.myfaces.buildtools/myfaces-i18n-plugin/1.0.1-SNAPSHOT/myfaces-i18n-plugin-1.0.1-SNAPSHOT.pom
[JENKINS] Archiving <https://builds.apache.org/job/myfaces-maven2-plugins/ws/maven2-plugins/myfaces-i18n-plugin/target/myfaces-i18n-plugin-1.0.1-SNAPSHOT.jar>
to org.apache.myfaces.buildtools/myfaces-i18n-plugin/1.0.1-SNAPSHOT/myfaces-i18n-plugin-1.0.1-SNAPSHOT.jar
Sending artifact delta relative to myfaces-maven2-plugins » Apache MyFaces Buildtools Maven2
i18n Plugin #2043
Archived 2 artifacts
Archive block size is 32768
Received 0 blocks and 26493 bytes
Compression is 0.0%
Took 39 ms
[JENKINS] Archiving <https://builds.apache.org/job/myfaces-maven2-plugins/ws/maven2-plugins/myfaces-wagon-plugin/pom.xml>
to org.apache.myfaces.buildtools/myfaces-wagon-plugin/1.0.1-SNAPSHOT/myfaces-wagon-plugin-1.0.1-SNAPSHOT.pom
[JENKINS] Archiving <https://builds.apache.org/job/myfaces-maven2-plugins/ws/maven2-plugins/myfaces-wagon-plugin/target/myfaces-wagon-plugin-1.0.1-SNAPSHOT.jar>
to org.apache.myfaces.buildtools/myfaces-wagon-plugin/1.0.1-SNAPSHOT/myfaces-wagon-plugin-1.0.1-SNAPSHOT.jar
Sending artifact delta relative to myfaces-maven2-plugins » Apache MyFaces Buildtools Maven2
Wagon Plugin #2043
Archived 2 artifacts
Archive block size is 32768
Received 0 blocks and 22014 bytes
Compression is 0.0%
Took 54 ms
[JENKINS] Archiving <https://builds.apache.org/job/myfaces-maven2-plugins/ws/maven2-plugins/myfaces-faces-plugin/pom.xml>
to org.apache.myfaces.buildtools/myfaces-faces-plugin/1.0.1-SNAPSHOT/myfaces-faces-plugin-1.0.1-SNAPSHOT.pom
[JENKINS] Archiving <https://builds.apache.org/job/myfaces-maven2-plugins/ws/maven2-plugins/myfaces-faces-plugin/target/myfaces-faces-plugin-1.0.1-SNAPSHOT.jar>
to org.apache.myfaces.buildtools/myfaces-faces-plugin/1.0.1-SNAPSHOT/myfaces-faces-plugin-1.0.1-SNAPSHOT.jar
Sending artifact delta relative to myfaces-maven2-plugins » Apache MyFaces Buildtools Maven2
Faces Plugin #2043
Archived 2 artifacts
Archive block size is 32768
Received 0 blocks and 206017 bytes
Compression is 0.0%
Took 0.26 sec
[JENKINS] Archiving <https://builds.apache.org/job/myfaces-maven2-plugins/ws/maven2-plugins/myfaces-builder-annotations/pom.xml>
to org.apache.myfaces.buildtools/myfaces-builder-annotations/1.0.10-SNAPSHOT/myfaces-builder-annotations-1.0.10-SNAPSHOT.pom
[JENKINS] Archiving <https://builds.apache.org/job/myfaces-maven2-plugins/ws/maven2-plugins/myfaces-builder-annotations/target/myfaces-builder-annotations-1.0.10-SNAPSHOT.jar>
to org.apache.myfaces.buildtools/myfaces-builder-annotations/1.0.10-SNAPSHOT/myfaces-builder-annotations-1.0.10-SNAPSHOT.jar
Sending artifact delta relative to myfaces-maven2-plugins » Apache MyFaces Buildtools Maven2
Builder Annotations #2043
Archived 2 artifacts
Archive block size is 32768
Received 0 blocks and 26512 bytes
Compression is 0.0%
Took 48 ms
[JENKINS] Archiving <https://builds.apache.org/job/myfaces-maven2-plugins/ws/maven2-plugins/myfaces-tagdoc-plugin/pom.xml>
to org.apache.myfaces.buildtools/myfaces-tagdoc-plugin/1.0.1-SNAPSHOT/myfaces-tagdoc-plugin-1.0.1-SNAPSHOT.pom
[JENKINS] Archiving <https://builds.apache.org/job/myfaces-maven2-plugins/ws/maven2-plugins/myfaces-tagdoc-plugin/target/myfaces-tagdoc-plugin-1.0.1-SNAPSHOT.jar>
to org.apache.myfaces.buildtools/myfaces-tagdoc-plugin/1.0.1-SNAPSHOT/myfaces-tagdoc-plugin-1.0.1-SNAPSHOT.jar
Sending artifact delta relative to myfaces-maven2-plugins » Apache MyFaces Buildtools Maven2
Tag Documentation Report #2043
Archived 2 artifacts
Archive block size is 32768
Received 0 blocks and 38581 bytes
Compression is 0.0%
Took 58 ms
[JENKINS] Archiving <https://builds.apache.org/job/myfaces-maven2-plugins/ws/maven2-plugins/myfaces-jsdoc-plugin/pom.xml>
to org.apache.myfaces.buildtools/myfaces-jsdoc-plugin/1.0-beta-2-SNAPSHOT/myfaces-jsdoc-plugin-1.0-beta-2-SNAPSHOT.pom
[JENKINS] Archiving <https://builds.apache.org/job/myfaces-maven2-plugins/ws/maven2-plugins/myfaces-jsdoc-plugin/target/myfaces-jsdoc-plugin-1.0-beta-2-SNAPSHOT.jar>
to org.apache.myfaces.buildtools/myfaces-jsdoc-plugin/1.0-beta-2-SNAPSHOT/myfaces-jsdoc-plugin-1.0-beta-2-SNAPSHOT.jar
Sending artifact delta relative to myfaces-maven2-plugins » Apache MyFaces Buildtools Maven2
Javascript Documentation Plugin #2043
Archived 2 artifacts
Archive block size is 32768
Received 0 blocks and 42326 bytes
Compression is 0.0%
Took 60 ms
[JENKINS] Archiving <https://builds.apache.org/job/myfaces-maven2-plugins/ws/maven2-plugins/myfaces-builder-plugin/pom.xml>
to org.apache.myfaces.buildtools/myfaces-builder-plugin/1.0.11-SNAPSHOT/myfaces-builder-plugin-1.0.11-SNAPSHOT.pom
[JENKINS] Archiving <https://builds.apache.org/job/myfaces-maven2-plugins/ws/maven2-plugins/myfaces-builder-plugin/target/myfaces-builder-plugin-1.0.11-SNAPSHOT.jar>
to org.apache.myfaces.buildtools/myfaces-builder-plugin/1.0.11-SNAPSHOT/myfaces-builder-plugin-1.0.11-SNAPSHOT.jar
Sending artifact delta relative to myfaces-maven2-plugins » Apache MyFaces Buildtools Maven2
Builder Plugin #2043
Archived 2 artifacts
Archive block size is 32768
Received 0 blocks and 385644 bytes
Compression is 0.0%
Took 0.28 sec
[JENKINS] Archiving <https://builds.apache.org/job/myfaces-maven2-plugins/ws/maven2-plugins/myfaces-xrts-plugin/pom.xml>
to org.apache.myfaces.buildtools/myfaces-xrts-plugin/1.0.1-SNAPSHOT/myfaces-xrts-plugin-1.0.1-SNAPSHOT.pom
[JENKINS] Archiving <https://builds.apache.org/job/myfaces-maven2-plugins/ws/maven2-plugins/myfaces-xrts-plugin/target/myfaces-xrts-plugin-1.0.1-SNAPSHOT.jar>
to org.apache.myfaces.buildtools/myfaces-xrts-plugin/1.0.1-SNAPSHOT/myfaces-xrts-plugin-1.0.1-SNAPSHOT.jar
Sending artifact delta relative to myfaces-maven2-plugins » Apache MyFaces Buildtools Maven2
XRTS Plugin #2043
Archived 2 artifacts
Archive block size is 32768
Received 0 blocks and 25630 bytes
Compression is 0.0%
Took 81 ms
[JENKINS] Archiving <https://builds.apache.org/job/myfaces-maven2-plugins/ws/maven2-plugins/myfaces-jdev-plugin/pom.xml>
to org.apache.myfaces.buildtools/myfaces-jdev-plugin/1.0.1-SNAPSHOT/myfaces-jdev-plugin-1.0.1-SNAPSHOT.pom
[JENKINS] Archiving <https://builds.apache.org/job/myfaces-maven2-plugins/ws/maven2-plugins/myfaces-jdev-plugin/target/myfaces-jdev-plugin-1.0.1-SNAPSHOT.jar>
to org.apache.myfaces.buildtools/myfaces-jdev-plugin/1.0.1-SNAPSHOT/myfaces-jdev-plugin-1.0.1-SNAPSHOT.jar
Sending artifact delta relative to myfaces-maven2-plugins » Apache MyFaces Buildtools Maven2
JDev Plugin #2043
Archived 2 artifacts
Archive block size is 32768
Received 0 blocks and 41859 bytes
Compression is 0.0%
Took 51 ms
[JENKINS] Archiving <https://builds.apache.org/job/myfaces-maven2-plugins/ws/maven2-plugins/myfaces-javacc-plugin/pom.xml>
to org.apache.myfaces.buildtools/myfaces-javacc-plugin/1.0.2-SNAPSHOT/myfaces-javacc-plugin-1.0.2-SNAPSHOT.pom
[JENKINS] Archiving <https://builds.apache.org/job/myfaces-maven2-plugins/ws/maven2-plugins/myfaces-javacc-plugin/target/myfaces-javacc-plugin-1.0.2-SNAPSHOT.jar>
to org.apache.myfaces.buildtools/myfaces-javacc-plugin/1.0.2-SNAPSHOT/myfaces-javacc-plugin-1.0.2-SNAPSHOT.jar
Sending artifact delta relative to myfaces-maven2-plugins » Apache MyFaces Buildtools Maven2
Javacc Plugin #2043
Archived 2 artifacts
Archive block size is 32768
Received 0 blocks and 17283 bytes
Compression is 0.0%
Took 36 ms
[JENKINS] Archiving /home/jenkins/jenkins-slave/maven-repositories/1/org/apache/myfaces/buildtools/myfaces-plugin-parent/1.0.7-SNAPSHOT/myfaces-plugin-parent-1.0.7-SNAPSHOT.pom
to org.apache.myfaces.buildtools/myfaces-plugin-parent/1.0.7-SNAPSHOT/myfaces-plugin-parent-1.0.7-SNAPSHOT.pom
[JENKINS] Archiving <https://builds.apache.org/job/myfaces-maven2-plugins/ws/maven2-plugins/myfaces-plugin-parent/target/myfaces-plugin-parent-1.0.7-SNAPSHOT-site.xml>
to org.apache.myfaces.buildtools/myfaces-plugin-parent/1.0.7-SNAPSHOT/myfaces-plugin-parent-1.0.7-SNAPSHOT-site.xml
/home/jenkins/jenkins-slave/maven-repositories/1/org/apache/myfaces/buildtools/myfaces-plugin-parent/1.0.7-SNAPSHOT/myfaces-plugin-parent-1.0.7-SNAPSHOT.pom
is not inside <https://builds.apache.org/job/myfaces-maven2-plugins/ws/maven2-plugins/myfaces-plugin-parent/;>
will archive in a separate pass
Sending artifact delta relative to myfaces-maven2-plugins » Apache MyFaces Buildtools Maven2
Plugin Parent #2043
Archived 1 artifacts
Archive block size is 32768
Received 0 blocks and 4075 bytes
Compression is 0.0%
Took 33 ms
Sending artifact delta relative to myfaces-maven2-plugins » Apache MyFaces Buildtools Maven2
Plugin Parent #2043
Archived 1 artifacts
Archive block size is 32768
Received 0 blocks and 5991 bytes
Compression is 0.0%
Took 25 ms
[JENKINS] Archiving /home/jenkins/jenkins-slave/maven-repositories/1/org/apache/myfaces/buildtools/myfaces-plugin-module/1-SNAPSHOT/myfaces-plugin-module-1-SNAPSHOT.pom
to org.apache.myfaces.buildtools/myfaces-plugin-module/1-SNAPSHOT/myfaces-plugin-module-1-SNAPSHOT.pom
/home/jenkins/jenkins-slave/maven-repositories/1/org/apache/myfaces/buildtools/myfaces-plugin-module/1-SNAPSHOT/myfaces-plugin-module-1-SNAPSHOT.pom
is not inside <https://builds.apache.org/job/myfaces-maven2-plugins/ws/maven2-plugins/;>
will archive in a separate pass
Sending artifact delta relative to myfaces-maven2-plugins » Apache MyFaces Buildtools Maven2
Plugin Module #2043
Archived 1 artifacts
Archive block size is 32768
Received 0 blocks and 3059 bytes
Compression is 0.0%
Took 26 ms
[JENKINS] Archiving <https://builds.apache.org/job/myfaces-maven2-plugins/ws/maven2-plugins/myfaces-javascript-plugin/pom.xml>
to org.apache.myfaces.buildtools/myfaces-javascript-plugin/1.0.3-SNAPSHOT/myfaces-javascript-plugin-1.0.3-SNAPSHOT.pom
[JENKINS] Archiving <https://builds.apache.org/job/myfaces-maven2-plugins/ws/maven2-plugins/myfaces-javascript-plugin/target/myfaces-javascript-plugin-1.0.3-SNAPSHOT.jar>
to org.apache.myfaces.buildtools/myfaces-javascript-plugin/1.0.3-SNAPSHOT/myfaces-javascript-plugin-1.0.3-SNAPSHOT.jar
Sending artifact delta relative to myfaces-maven2-plugins » Apache MyFaces Buildtools Maven2
Javascript Plugin #2043
Archived 2 artifacts
Archive block size is 32768
Received 1 blocks and 350401 bytes
Compression is 8.6%
Took 0.22 sec
channel stopped
Maven RedeployPublisher use remote H11 maven settings from : /home/jenkins/.m2/settings.xml
[INFO] Deployment in https://repository.apache.org/content/repositories/snapshots (id=apache.snapshots.https,uniqueVersion=false)
Deploying the main artifact myfaces-builder-annotations-1.0.10-SNAPSHOT.jar
[INFO] Deployment in https://repository.apache.org/content/repositories/snapshots (id=apache.snapshots.https,uniqueVersion=false)
Deploying the main artifact myfaces-builder-plugin-1.0.11-SNAPSHOT.jar
[INFO] Deployment in https://repository.apache.org/content/repositories/snapshots (id=apache.snapshots.https,uniqueVersion=false)
Deploying the main artifact myfaces-faces-plugin-1.0.1-SNAPSHOT.jar
[INFO] Deployment in https://repository.apache.org/content/repositories/snapshots (id=apache.snapshots.https,uniqueVersion=false)
Deploying the main artifact myfaces-i18n-plugin-1.0.1-SNAPSHOT.jar
[INFO] Deployment in https://repository.apache.org/content/repositories/snapshots (id=apache.snapshots.https,uniqueVersion=false)
Deploying the main artifact myfaces-javacc-plugin-1.0.2-SNAPSHOT.jar
[INFO] Deployment in https://repository.apache.org/content/repositories/snapshots (id=apache.snapshots.https,uniqueVersion=false)
Deploying the main artifact myfaces-javascript-plugin-1.0.3-SNAPSHOT.jar
[INFO] Deployment in https://repository.apache.org/content/repositories/snapshots (id=apache.snapshots.https,uniqueVersion=false)
Deploying the main artifact myfaces-jdev-plugin-1.0.1-SNAPSHOT.jar
[INFO] Deployment in https://repository.apache.org/content/repositories/snapshots (id=apache.snapshots.https,uniqueVersion=false)
Deploying the main artifact myfaces-jsdoc-plugin-1.0-beta-2-SNAPSHOT.jar
[INFO] Deployment in https://repository.apache.org/content/repositories/snapshots (id=apache.snapshots.https,uniqueVersion=false)
Deploying the main artifact myfaces-plugin-module-1-SNAPSHOT.pom
[INFO] Deployment in https://repository.apache.org/content/repositories/snapshots (id=apache.snapshots.https,uniqueVersion=false)
Deploying the main artifact myfaces-plugin-parent-1.0.7-SNAPSHOT.pom
Deploying the main artifact myfaces-plugin-parent-1.0.7-SNAPSHOT-site.xml
[INFO] Deployment in https://repository.apache.org/content/repositories/snapshots (id=apache.snapshots.https,uniqueVersion=false)
Deploying the main artifact myfaces-tagdoc-plugin-1.0.1-SNAPSHOT.jar
ERROR: Error installing artifact's metadata: Error while deploying metadata: Failed to transfer
file: https://repository.apache.org/content/repositories/snapshots/org/apache/myfaces/buildtools/maven-metadata.xml.md5.
Return code is: 502, ReasonPhrase: Proxy Error.
org.apache.maven.artifact.deployer.ArtifactDeploymentException: Error installing artifact's
metadata: Error while deploying metadata: Failed to transfer file: https://repository.apache.org/content/repositories/snapshots/org/apache/myfaces/buildtools/maven-metadata.xml.md5.
Return code is: 502, ReasonPhrase: Proxy Error.
	at hudson.maven.artifact.deployer.DefaultArtifactDeployer.deploy(DefaultArtifactDeployer.java:183)
	at hudson.maven.reporters.MavenArtifactRecord.deploy(MavenArtifactRecord.java:193)
	at hudson.maven.RedeployPublisher.perform(RedeployPublisher.java:176)
	at hudson.tasks.BuildStepMonitor$1.perform(BuildStepMonitor.java:20)
	at hudson.model.AbstractBuild$AbstractBuildExecution.perform(AbstractBuild.java:756)
	at hudson.model.AbstractBuild$AbstractBuildExecution.performAllBuildSteps(AbstractBuild.java:720)
	at hudson.maven.MavenModuleSetBuild$MavenModuleSetBuildExecution.post2(MavenModuleSetBuild.java:1037)
	at hudson.model.AbstractBuild$AbstractBuildExecution.post(AbstractBuild.java:669)
	at hudson.model.Run.execute(Run.java:1731)
	at hudson.maven.MavenModuleSetBuild.run(MavenModuleSetBuild.java:529)
	at hudson.model.ResourceController.execute(ResourceController.java:88)
	at hudson.model.Executor.run(Executor.java:232)
Caused by: org.apache.maven.artifact.repository.metadata.RepositoryMetadataDeploymentException:
Error while deploying metadata: Failed to transfer file: https://repository.apache.org/content/repositories/snapshots/org/apache/myfaces/buildtools/maven-metadata.xml.md5.
Return code is: 502, ReasonPhrase: Proxy Error.
	at org.apache.maven.artifact.repository.metadata.DefaultRepositoryMetadataManager.deploy(DefaultRepositoryMetadataManager.java:492)
	at hudson.maven.artifact.deployer.DefaultArtifactDeployer.deploy(DefaultArtifactDeployer.java:167)
	... 11 more
Caused by: org.apache.maven.wagon.TransferFailedException: Failed to transfer file: https://repository.apache.org/content/repositories/snapshots/org/apache/myfaces/buildtools/maven-metadata.xml.md5.
Return code is: 502, ReasonPhrase: Proxy Error.
	at org.apache.maven.wagon.shared.http4.AbstractHttpClientWagon.put(AbstractHttpClientWagon.java:626)
	at org.apache.maven.wagon.shared.http4.AbstractHttpClientWagon.put(AbstractHttpClientWagon.java:524)
	at org.apache.maven.wagon.shared.http4.AbstractHttpClientWagon.put(AbstractHttpClientWagon.java:505)
	at org.apache.maven.wagon.shared.http4.AbstractHttpClientWagon.put(AbstractHttpClientWagon.java:485)
	at org.apache.maven.repository.legacy.DefaultWagonManager.putRemoteFile(DefaultWagonManager.java:569)
	at org.apache.maven.repository.legacy.DefaultWagonManager.putArtifactMetadata(DefaultWagonManager.java:501)
	at org.apache.maven.artifact.repository.metadata.DefaultRepositoryMetadataManager.deploy(DefaultRepositoryMetadataManager.java:488)
	... 12 more
[INFO] Deployment failed after 7 min 30 sec
Build step 'Deploy artifacts to Maven repository' changed build result to FAILURE

Mime
View raw message