myfaces-commits mailing list archives

Site index · List index
Message view « Date » · « Thread »
Top « Date » · « Thread »
From Apache Jenkins Server <jenk...@builds.apache.org>
Subject Build failed in Jenkins: myfaces-current21_949 #2815
Date Sat, 26 Sep 2015 13:03:38 GMT
See <https://builds.apache.org/job/myfaces-current21_949/2815/>

------------------------------------------
[...truncated 3655 lines...]
[INFO] Installing <https://builds.apache.org/job/myfaces-current21_949/ws/2.1.x-client-window/bundle/target/myfaces-bundle-2.1.9-CLIENT-WINDOW-SNAPSHOT.jar>
to /home/jenkins/jenkins-slave/maven-repositories/1/org/apache/myfaces/core/myfaces-bundle/2.1.9-CLIENT-WINDOW-SNAPSHOT/myfaces-bundle-2.1.9-CLIENT-WINDOW-SNAPSHOT.jar
[INFO] Installing <https://builds.apache.org/job/myfaces-current21_949/ws/2.1.x-client-window/bundle/target/myfaces-bundle-2.1.9-CLIENT-WINDOW-SNAPSHOT-sources.jar>
to /home/jenkins/jenkins-slave/maven-repositories/1/org/apache/myfaces/core/myfaces-bundle/2.1.9-CLIENT-WINDOW-SNAPSHOT/myfaces-bundle-2.1.9-CLIENT-WINDOW-SNAPSHOT-sources.jar
[INFO] [bundle:install {execution: default-install}]
[WARNING] Exception while updating local OBR: Unable to read repository xml: file:/home/jenkins/jenkins-slave/maven-repositories/1/repository.xml
org.apache.maven.plugin.MojoExecutionException: Unable to read repository xml: file:/home/jenkins/jenkins-slave/maven-repositories/1/repository.xml
	at org.apache.felix.obrplugin.ObrUpdate.parseRepositoryXml(ObrUpdate.java:295)
	at org.apache.felix.obrplugin.ObrInstall.execute(ObrInstall.java:140)
	at org.apache.maven.plugin.DefaultPluginManager.executeMojo(DefaultPluginManager.java:490)
	at hudson.maven.agent.PluginManagerInterceptor.executeMojo(PluginManagerInterceptor.java:182)
	at org.apache.maven.lifecycle.DefaultLifecycleExecutor.executeGoals(DefaultLifecycleExecutor.java:694)
	at org.apache.maven.lifecycle.DefaultLifecycleExecutor.executeGoalWithLifecycle(DefaultLifecycleExecutor.java:556)
	at org.apache.maven.lifecycle.DefaultLifecycleExecutor.executeGoal(DefaultLifecycleExecutor.java:535)
	at org.apache.maven.lifecycle.DefaultLifecycleExecutor.executeGoalAndHandleFailures(DefaultLifecycleExecutor.java:387)
	at org.apache.maven.lifecycle.DefaultLifecycleExecutor.executeTaskSegments(DefaultLifecycleExecutor.java:348)
	at org.apache.maven.lifecycle.DefaultLifecycleExecutor.execute(DefaultLifecycleExecutor.java:180)
	at org.apache.maven.lifecycle.LifecycleExecutorInterceptor.execute(LifecycleExecutorInterceptor.java:65)
	at org.apache.maven.DefaultMaven.doExecute(DefaultMaven.java:328)
	at org.apache.maven.DefaultMaven.execute(DefaultMaven.java:138)
	at org.apache.maven.cli.MavenCli.main(MavenCli.java:362)
	at sun.reflect.NativeMethodAccessorImpl.invoke0(Native Method)
	at sun.reflect.NativeMethodAccessorImpl.invoke(NativeMethodAccessorImpl.java:39)
	at sun.reflect.DelegatingMethodAccessorImpl.invoke(DelegatingMethodAccessorImpl.java:25)
	at java.lang.reflect.Method.invoke(Method.java:597)
	at org.codehaus.classworlds.Launcher.launchEnhanced(Launcher.java:315)
	at org.codehaus.classworlds.Launcher.launch(Launcher.java:255)
	at hudson.maven.agent.Main.launch(Main.java:205)
	at hudson.maven.MavenBuilder.call(MavenBuilder.java:154)
	at hudson.maven.Maven2Builder.call(Maven2Builder.java:79)
	at hudson.maven.Maven2Builder.call(Maven2Builder.java:55)
	at hudson.remoting.UserRequest.perform(UserRequest.java:118)
	at hudson.remoting.UserRequest.perform(UserRequest.java:48)
	at hudson.remoting.Request$2.run(Request.java:328)
	at hudson.remoting.InterceptingExecutorService$1.call(InterceptingExecutorService.java:72)
	at java.util.concurrent.FutureTask$Sync.innerRun(FutureTask.java:303)
	at java.util.concurrent.FutureTask.run(FutureTask.java:138)
	at java.util.concurrent.ThreadPoolExecutor$Worker.runTask(ThreadPoolExecutor.java:895)
	at java.util.concurrent.ThreadPoolExecutor$Worker.run(ThreadPoolExecutor.java:918)
	at java.lang.Thread.run(Thread.java:662)
Caused by: org.xmlpull.v1.XmlPullParserException: unexpected type (position:END_DOCUMENT null@3:1
in java.io.InputStreamReader@af8cbc) 
	at org.kxml2.io.KXmlParser.exception(Unknown Source)
	at org.kxml2.io.KXmlParser.nextTag(Unknown Source)
	at org.apache.felix.bundlerepository.impl.PullParser.parseRepository(PullParser.java:43)
	at org.apache.felix.bundlerepository.impl.DataModelHelperImpl.repository(DataModelHelperImpl.java:147)
	at org.apache.felix.bundlerepository.impl.DataModelHelperImpl.repository(DataModelHelperImpl.java:118)
	at org.apache.felix.obrplugin.ObrUpdate.parseRepositoryXml(ObrUpdate.java:291)
	... 32 more
[INFO] ------------------------------------------------------------------------
[INFO] Building Apache MyFaces JSF-2.1 Core Module
[INFO]    task-segment: [install]
[INFO] ------------------------------------------------------------------------
[INFO] [remote-resources:process {execution: default}]
[INFO] [site:attach-descriptor {execution: default-attach-descriptor}]
[INFO] [checkstyle:check {execution: verify-style}]
[INFO] 
[INFO] [install:install {execution: default-install}]
[INFO] Installing <https://builds.apache.org/job/myfaces-current21_949/ws/2.1.x-client-window/pom.xml>
to /home/jenkins/jenkins-slave/maven-repositories/1/org/apache/myfaces/core/myfaces-core-module/2.1.9-CLIENT-WINDOW-SNAPSHOT/myfaces-core-module-2.1.9-CLIENT-WINDOW-SNAPSHOT.pom
[INFO] ------------------------------------------------------------------------
[INFO] Building client-window-example
[INFO]    task-segment: [install]
[INFO] ------------------------------------------------------------------------
[INFO] [remote-resources:process {execution: default}]
[debug] execute contextualize
[INFO] [resources:resources {execution: default-resources}]
[INFO] Using 'UTF-8' encoding to copy filtered resources.
[INFO] Copying 0 resource
[INFO] Copying 3 resources
[INFO] [compiler:compile {execution: default-compile}]
[INFO] Compiling 9 source files to <https://builds.apache.org/job/myfaces-current21_949/ws/2.1.x-client-window/client-window-example/target/classes>
[INFO] [build-helper:add-test-resource {execution: add-webapp-folder-as-test}]
[debug] execute contextualize
[INFO] [resources:testResources {execution: default-testResources}]
[INFO] Using 'UTF-8' encoding to copy filtered resources.
[INFO] Copying 1 resource
[INFO] Copying 3 resources
[INFO] Copying 25 resources to webapp
[INFO] [compiler:testCompile {execution: default-testCompile}]
[INFO] Compiling 1 source file to <https://builds.apache.org/job/myfaces-current21_949/ws/2.1.x-client-window/client-window-example/target/test-classes>
[INFO] [surefire:test {execution: default-test}]
[INFO] Surefire report directory: <https://builds.apache.org/job/myfaces-current21_949/ws/2.1.x-client-window/client-window-example/target/surefire-reports>

-------------------------------------------------------
 T E S T S
-------------------------------------------------------
Running org.apache.myfaces.example.clientWindow.CheckFaceletsFileTestCase
Sep 26, 2015 12:58:23 PM org.apache.myfaces.util.ExternalSpecifications isUnifiedELAvailable
INFO: MyFaces Unified EL support enabled
Tests run: 3, Failures: 0, Errors: 0, Skipped: 0, Time elapsed: 1.033 sec

Results :

Tests run: 3, Failures: 0, Errors: 0, Skipped: 0

[JENKINS] Recording test results
[INFO] [war:war {execution: default-war}]
[INFO] Packaging webapp
[INFO] Assembling webapp[client-window-example] in [<https://builds.apache.org/job/myfaces-current21_949/ws/2.1.x-client-window/client-window-example/target/client-window-example]>
[INFO] Processing war project
[INFO] Copying webapp resources[<https://builds.apache.org/job/myfaces-current21_949/ws/2.1.x-client-window/client-window-example/src/main/webapp]>
[INFO] Webapp assembled in[108 msecs]
[INFO] Building war: <https://builds.apache.org/job/myfaces-current21_949/ws/2.1.x-client-window/client-window-example/target/client-window-example.war>
[INFO] [checkstyle:check {execution: verify-style}]
[INFO] 
[INFO] [install:install {execution: default-install}]
[INFO] Installing <https://builds.apache.org/job/myfaces-current21_949/ws/2.1.x-client-window/client-window-example/target/client-window-example.war>
to /home/jenkins/jenkins-slave/maven-repositories/1/org/apache/myfaces/example/clientWindow/client-window-example/2.1.9-CLIENT-WINDOW-SNAPSHOT/client-window-example-2.1.9-CLIENT-WINDOW-SNAPSHOT.war
[INFO] 
[INFO] 
[INFO] ------------------------------------------------------------------------
[INFO] Reactor Summary:
[INFO] ------------------------------------------------------------------------
[INFO] Apache MyFaces JSF-2.1 Core Project ................... SUCCESS [15.766s]
[INFO] Apache MyFaces JSF-2.1 Core API ....................... SUCCESS [35.747s]
[INFO] Apache MyFaces Shared Public API For JSF 2.1 - Core ... SUCCESS [9.076s]
[INFO] Apache MyFaces Core For JSF 2.1 - Shared .............. SUCCESS [13.460s]
[INFO] Apache MyFaces JSF-2.1 Core Impl ...................... SUCCESS [1:07.626s]
[INFO] Apache MyFaces JSF-2.1 Core OSGi Bundle ............... SUCCESS [2.427s]
[INFO] Apache MyFaces JSF-2.1 Core Module .................... SUCCESS [0.336s]
[INFO] client-window-example ................................. SUCCESS [4.172s]
[INFO] ------------------------------------------------------------------------
[INFO] ------------------------------------------------------------------------
[INFO] BUILD SUCCESSFUL
[INFO] ------------------------------------------------------------------------
[INFO] Total time: 2 minutes 37 seconds
[INFO] Finished at: Sat Sep 26 12:58:25 UTC 2015
[INFO] Final Memory: 159M/599M
[INFO] ------------------------------------------------------------------------
[JENKINS] Archiving <https://builds.apache.org/job/myfaces-current21_949/ws/2.1.x-client-window/client-window-example/pom.xml>
to org.apache.myfaces.example.clientWindow/client-window-example/2.1.9-CLIENT-WINDOW-SNAPSHOT/client-window-example-2.1.9-CLIENT-WINDOW-SNAPSHOT.pom
[JENKINS] Archiving <https://builds.apache.org/job/myfaces-current21_949/ws/2.1.x-client-window/client-window-example/target/client-window-example.war>
to org.apache.myfaces.example.clientWindow/client-window-example/2.1.9-CLIENT-WINDOW-SNAPSHOT/client-window-example-2.1.9-CLIENT-WINDOW-SNAPSHOT.war
Sending artifact delta relative to myfaces-current21_949 ? client-window-example #2814
Archived 2 artifacts
Archive block size is 32768
Received 11 blocks and 76138 bytes
Compression is 82.6%
Took 48 ms
[JENKINS] Archiving <https://builds.apache.org/job/myfaces-current21_949/ws/2.1.x-client-window/shared-public/pom.xml>
to org.apache.myfaces.core.internal/myfaces-impl-shared-public/2.1.9-CLIENT-WINDOW-SNAPSHOT/myfaces-impl-shared-public-2.1.9-CLIENT-WINDOW-SNAPSHOT.pom
[JENKINS] Archiving <https://builds.apache.org/job/myfaces-current21_949/ws/2.1.x-client-window/shared-public/target/myfaces-impl-shared-public-2.1.9-CLIENT-WINDOW-SNAPSHOT.jar>
to org.apache.myfaces.core.internal/myfaces-impl-shared-public/2.1.9-CLIENT-WINDOW-SNAPSHOT/myfaces-impl-shared-public-2.1.9-CLIENT-WINDOW-SNAPSHOT.jar
[JENKINS] Archiving <https://builds.apache.org/job/myfaces-current21_949/ws/2.1.x-client-window/shared-public/target/myfaces-impl-shared-public-2.1.9-CLIENT-WINDOW-SNAPSHOT-sources.jar>
to org.apache.myfaces.core.internal/myfaces-impl-shared-public/2.1.9-CLIENT-WINDOW-SNAPSHOT/myfaces-impl-shared-public-2.1.9-CLIENT-WINDOW-SNAPSHOT-sources.jar
Sending artifact delta relative to myfaces-current21_949 ? Apache MyFaces Shared Public API
For JSF 2.1 - Core #2814
Archived 3 artifacts
Archive block size is 32768
Received 0 blocks and 186235 bytes
Compression is 0.0%
Took 77 ms
[JENKINS] Archiving <https://builds.apache.org/job/myfaces-current21_949/ws/2.1.x-client-window/impl/pom.xml>
to org.apache.myfaces.core/myfaces-impl/2.1.9-CLIENT-WINDOW-SNAPSHOT/myfaces-impl-2.1.9-CLIENT-WINDOW-SNAPSHOT.pom
[JENKINS] Archiving <https://builds.apache.org/job/myfaces-current21_949/ws/2.1.x-client-window/impl/target/myfaces-impl-2.1.9-CLIENT-WINDOW-SNAPSHOT.jar>
to org.apache.myfaces.core/myfaces-impl/2.1.9-CLIENT-WINDOW-SNAPSHOT/myfaces-impl-2.1.9-CLIENT-WINDOW-SNAPSHOT.jar
[JENKINS] Archiving <https://builds.apache.org/job/myfaces-current21_949/ws/2.1.x-client-window/impl/target/myfaces-impl-2.1.9-CLIENT-WINDOW-SNAPSHOT-sources.jar>
to org.apache.myfaces.core/myfaces-impl/2.1.9-CLIENT-WINDOW-SNAPSHOT/myfaces-impl-2.1.9-CLIENT-WINDOW-SNAPSHOT-sources.jar
[JENKINS] Archiving <https://builds.apache.org/job/myfaces-current21_949/ws/2.1.x-client-window/impl/target/myfaces-impl-2.1.9-CLIENT-WINDOW-SNAPSHOT-tests.jar>
to org.apache.myfaces.core/myfaces-impl/2.1.9-CLIENT-WINDOW-SNAPSHOT/myfaces-impl-2.1.9-CLIENT-WINDOW-SNAPSHOT-tests.jar
Sending artifact delta relative to myfaces-current21_949 ? Apache MyFaces JSF-2.1 Core Impl
#2814
Archived 4 artifacts
Archive block size is 32768
Received 3 blocks and 4860405 bytes
Compression is 2.0%
Took 1.1 sec
[JENKINS] Archiving <https://builds.apache.org/job/myfaces-current21_949/ws/2.1.x-client-window/bundle/pom.xml>
to org.apache.myfaces.core/myfaces-bundle/2.1.9-CLIENT-WINDOW-SNAPSHOT/myfaces-bundle-2.1.9-CLIENT-WINDOW-SNAPSHOT.pom
[JENKINS] Archiving <https://builds.apache.org/job/myfaces-current21_949/ws/2.1.x-client-window/bundle/target/myfaces-bundle-2.1.9-CLIENT-WINDOW-SNAPSHOT.jar>
to org.apache.myfaces.core/myfaces-bundle/2.1.9-CLIENT-WINDOW-SNAPSHOT/myfaces-bundle-2.1.9-CLIENT-WINDOW-SNAPSHOT.jar
[JENKINS] Archiving <https://builds.apache.org/job/myfaces-current21_949/ws/2.1.x-client-window/bundle/target/myfaces-bundle-2.1.9-CLIENT-WINDOW-SNAPSHOT-sources.jar>
to org.apache.myfaces.core/myfaces-bundle/2.1.9-CLIENT-WINDOW-SNAPSHOT/myfaces-bundle-2.1.9-CLIENT-WINDOW-SNAPSHOT-sources.jar
Sending artifact delta relative to myfaces-current21_949 ? Apache MyFaces JSF-2.1 Core OSGi
Bundle #2814
Archived 3 artifacts
Archive block size is 32768
Received 2 blocks and 3121537 bytes
Compression is 2.1%
Took 0.71 sec
[JENKINS] Archiving <https://builds.apache.org/job/myfaces-current21_949/ws/2.1.x-client-window/api/pom.xml>
to org.apache.myfaces.core/myfaces-api/2.1.9-CLIENT-WINDOW-SNAPSHOT/myfaces-api-2.1.9-CLIENT-WINDOW-SNAPSHOT.pom
[JENKINS] Archiving <https://builds.apache.org/job/myfaces-current21_949/ws/2.1.x-client-window/api/target/myfaces-api-2.1.9-CLIENT-WINDOW-SNAPSHOT.jar>
to org.apache.myfaces.core/myfaces-api/2.1.9-CLIENT-WINDOW-SNAPSHOT/myfaces-api-2.1.9-CLIENT-WINDOW-SNAPSHOT.jar
[JENKINS] Archiving <https://builds.apache.org/job/myfaces-current21_949/ws/2.1.x-client-window/api/target/myfaces-api-2.1.9-CLIENT-WINDOW-SNAPSHOT-sources.jar>
to org.apache.myfaces.core/myfaces-api/2.1.9-CLIENT-WINDOW-SNAPSHOT/myfaces-api-2.1.9-CLIENT-WINDOW-SNAPSHOT-sources.jar
[JENKINS] Archiving <https://builds.apache.org/job/myfaces-current21_949/ws/2.1.x-client-window/api/target/myfaces-api-2.1.9-CLIENT-WINDOW-SNAPSHOT-tests.jar>
to org.apache.myfaces.core/myfaces-api/2.1.9-CLIENT-WINDOW-SNAPSHOT/myfaces-api-2.1.9-CLIENT-WINDOW-SNAPSHOT-tests.jar
Sending artifact delta relative to myfaces-current21_949 ? Apache MyFaces JSF-2.1 Core API
#2814
Archived 4 artifacts
Archive block size is 32768
Received 19 blocks and 1710443 bytes
Compression is 26.7%
Took 0.44 sec
[JENKINS] Archiving /home/jenkins/jenkins-slave/maven-repositories/1/org/apache/myfaces/core/myfaces-core-project/2.1.9-CLIENT-WINDOW-SNAPSHOT/myfaces-core-project-2.1.9-CLIENT-WINDOW-SNAPSHOT.pom
to org.apache.myfaces.core/myfaces-core-project/2.1.9-CLIENT-WINDOW-SNAPSHOT/myfaces-core-project-2.1.9-CLIENT-WINDOW-SNAPSHOT.pom
[JENKINS] Archiving <https://builds.apache.org/job/myfaces-current21_949/ws/2.1.x-client-window/parent/target/myfaces-core-project-2.1.9-CLIENT-WINDOW-SNAPSHOT-site.xml>
to org.apache.myfaces.core/myfaces-core-project/2.1.9-CLIENT-WINDOW-SNAPSHOT/myfaces-core-project-2.1.9-CLIENT-WINDOW-SNAPSHOT-site.xml
/x1/jenkins/jenkins-slave/maven-repositories/1/org/apache/myfaces/core/myfaces-core-project/2.1.9-CLIENT-WINDOW-SNAPSHOT/myfaces-core-project-2.1.9-CLIENT-WINDOW-SNAPSHOT.pom
is not inside /x1/jenkins/jenkins-slave/workspace/myfaces-current21_949/2.1.x-client-window/parent/;
will archive in a separate pass
Sending artifact delta relative to myfaces-current21_949 ? Apache MyFaces JSF-2.1 Core Project
#2814
Archived 1 artifacts
Archive block size is 32768
Received 0 blocks and 6140 bytes
Compression is 0.0%
Took 6 ms
Sending artifact delta relative to myfaces-current21_949 ? Apache MyFaces JSF-2.1 Core Project
#2814
Archived 1 artifacts
Archive block size is 32768
Received 0 blocks and 23567 bytes
Compression is 0.0%
Took 8 ms
[JENKINS] Archiving /home/jenkins/jenkins-slave/maven-repositories/1/org/apache/myfaces/core/myfaces-core-module/2.1.9-CLIENT-WINDOW-SNAPSHOT/myfaces-core-module-2.1.9-CLIENT-WINDOW-SNAPSHOT.pom
to org.apache.myfaces.core/myfaces-core-module/2.1.9-CLIENT-WINDOW-SNAPSHOT/myfaces-core-module-2.1.9-CLIENT-WINDOW-SNAPSHOT.pom
/x1/jenkins/jenkins-slave/maven-repositories/1/org/apache/myfaces/core/myfaces-core-module/2.1.9-CLIENT-WINDOW-SNAPSHOT/myfaces-core-module-2.1.9-CLIENT-WINDOW-SNAPSHOT.pom
is not inside /x1/jenkins/jenkins-slave/workspace/myfaces-current21_949/2.1.x-client-window/;
will archive in a separate pass
Sending artifact delta relative to myfaces-current21_949 ? Apache MyFaces JSF-2.1 Core Module
#2814
Archived 1 artifacts
Archive block size is 32768
Received 0 blocks and 7973 bytes
Compression is 0.0%
Took 14 ms
[JENKINS] Archiving <https://builds.apache.org/job/myfaces-current21_949/ws/2.1.x-client-window/shared/pom.xml>
to org.apache.myfaces.core.internal/myfaces-impl-shared/2.1.9-CLIENT-WINDOW-SNAPSHOT/myfaces-impl-shared-2.1.9-CLIENT-WINDOW-SNAPSHOT.pom
[JENKINS] Archiving <https://builds.apache.org/job/myfaces-current21_949/ws/2.1.x-client-window/shared/target/myfaces-impl-shared-2.1.9-CLIENT-WINDOW-SNAPSHOT.jar>
to org.apache.myfaces.core.internal/myfaces-impl-shared/2.1.9-CLIENT-WINDOW-SNAPSHOT/myfaces-impl-shared-2.1.9-CLIENT-WINDOW-SNAPSHOT.jar
[JENKINS] Archiving <https://builds.apache.org/job/myfaces-current21_949/ws/2.1.x-client-window/shared/target/myfaces-impl-shared-2.1.9-CLIENT-WINDOW-SNAPSHOT-sources.jar>
to org.apache.myfaces.core.internal/myfaces-impl-shared/2.1.9-CLIENT-WINDOW-SNAPSHOT/myfaces-impl-shared-2.1.9-CLIENT-WINDOW-SNAPSHOT-sources.jar
Sending artifact delta relative to myfaces-current21_949 ? Apache MyFaces Core For JSF 2.1
- Shared #2814
Archived 3 artifacts
Archive block size is 32768
Received 0 blocks and 904186 bytes
Compression is 0.0%
Took 0.24 sec
channel stopped
Maven RedeployPublisher use remote ubuntu3 maven settings from : /home/jenkins/.m2/settings.xml
[INFO] Deployment in https://repository.apache.org/content/repositories/snapshots (id=apache.snapshots.https,uniqueVersion=false)
Deploying the main artifact myfaces-api-2.1.9-CLIENT-WINDOW-SNAPSHOT.jar
Deploying the main artifact myfaces-api-2.1.9-CLIENT-WINDOW-SNAPSHOT-sources.jar
Deploying the main artifact myfaces-api-2.1.9-CLIENT-WINDOW-SNAPSHOT-tests.jar
[INFO] Deployment in https://repository.apache.org/content/repositories/snapshots (id=apache.snapshots.https,uniqueVersion=false)
Deploying the main artifact myfaces-bundle-2.1.9-CLIENT-WINDOW-SNAPSHOT.jar
Deploying the main artifact myfaces-bundle-2.1.9-CLIENT-WINDOW-SNAPSHOT-sources.jar
[INFO] Deployment in https://repository.apache.org/content/repositories/snapshots (id=apache.snapshots.https,uniqueVersion=false)
Deploying the main artifact myfaces-core-module-2.1.9-CLIENT-WINDOW-SNAPSHOT.pom
[INFO] Deployment in https://repository.apache.org/content/repositories/snapshots (id=apache.snapshots.https,uniqueVersion=false)
Deploying the main artifact myfaces-core-project-2.1.9-CLIENT-WINDOW-SNAPSHOT.pom
Deploying the main artifact myfaces-core-project-2.1.9-CLIENT-WINDOW-SNAPSHOT-site.xml
[INFO] Deployment in https://repository.apache.org/content/repositories/snapshots (id=apache.snapshots.https,uniqueVersion=false)
Deploying the main artifact myfaces-impl-2.1.9-CLIENT-WINDOW-SNAPSHOT.jar
Deploying the main artifact myfaces-impl-2.1.9-CLIENT-WINDOW-SNAPSHOT-sources.jar
ERROR: Error installing artifact's metadata: Error while deploying metadata: Failed to transfer
file: https://repository.apache.org/content/repositories/snapshots/org/apache/myfaces/core/myfaces-impl/2.1.9-CLIENT-WINDOW-SNAPSHOT/maven-metadata.xml.sha1.
Return code is: 502, ReasonPhrase: Proxy Error.
org.apache.maven.artifact.deployer.ArtifactDeploymentException: Error installing artifact's
metadata: Error while deploying metadata: Failed to transfer file: https://repository.apache.org/content/repositories/snapshots/org/apache/myfaces/core/myfaces-impl/2.1.9-CLIENT-WINDOW-SNAPSHOT/maven-metadata.xml.sha1.
Return code is: 502, ReasonPhrase: Proxy Error.
	at hudson.maven.artifact.deployer.DefaultArtifactDeployer.deploy(DefaultArtifactDeployer.java:183)
	at hudson.maven.reporters.MavenArtifactRecord.deploy(MavenArtifactRecord.java:208)
	at hudson.maven.RedeployPublisher.perform(RedeployPublisher.java:176)
	at hudson.tasks.BuildStepMonitor$1.perform(BuildStepMonitor.java:20)
	at hudson.model.AbstractBuild$AbstractBuildExecution.perform(AbstractBuild.java:756)
	at hudson.model.AbstractBuild$AbstractBuildExecution.performAllBuildSteps(AbstractBuild.java:720)
	at hudson.maven.MavenModuleSetBuild$MavenModuleSetBuildExecution.post2(MavenModuleSetBuild.java:1037)
	at hudson.model.AbstractBuild$AbstractBuildExecution.post(AbstractBuild.java:669)
	at hudson.model.Run.execute(Run.java:1731)
	at hudson.maven.MavenModuleSetBuild.run(MavenModuleSetBuild.java:529)
	at hudson.model.ResourceController.execute(ResourceController.java:88)
	at hudson.model.Executor.run(Executor.java:232)
Caused by: org.apache.maven.artifact.repository.metadata.RepositoryMetadataDeploymentException:
Error while deploying metadata: Failed to transfer file: https://repository.apache.org/content/repositories/snapshots/org/apache/myfaces/core/myfaces-impl/2.1.9-CLIENT-WINDOW-SNAPSHOT/maven-metadata.xml.sha1.
Return code is: 502, ReasonPhrase: Proxy Error.
	at org.apache.maven.artifact.repository.metadata.DefaultRepositoryMetadataManager.deploy(DefaultRepositoryMetadataManager.java:492)
	at hudson.maven.artifact.deployer.DefaultArtifactDeployer.deploy(DefaultArtifactDeployer.java:167)
	... 11 more
Caused by: org.apache.maven.wagon.TransferFailedException: Failed to transfer file: https://repository.apache.org/content/repositories/snapshots/org/apache/myfaces/core/myfaces-impl/2.1.9-CLIENT-WINDOW-SNAPSHOT/maven-metadata.xml.sha1.
Return code is: 502, ReasonPhrase: Proxy Error.
	at org.apache.maven.wagon.shared.http4.AbstractHttpClientWagon.put(AbstractHttpClientWagon.java:626)
	at org.apache.maven.wagon.shared.http4.AbstractHttpClientWagon.put(AbstractHttpClientWagon.java:524)
	at org.apache.maven.wagon.shared.http4.AbstractHttpClientWagon.put(AbstractHttpClientWagon.java:505)
	at org.apache.maven.wagon.shared.http4.AbstractHttpClientWagon.put(AbstractHttpClientWagon.java:485)
	at org.apache.maven.repository.legacy.DefaultWagonManager.putRemoteFile(DefaultWagonManager.java:569)
	at org.apache.maven.repository.legacy.DefaultWagonManager.putArtifactMetadata(DefaultWagonManager.java:501)
	at org.apache.maven.artifact.repository.metadata.DefaultRepositoryMetadataManager.deploy(DefaultRepositoryMetadataManager.java:488)
	... 12 more
[INFO] Deployment failed after 5 min 31 sec
Build step 'Deploy artifacts to Maven repository' changed build result to FAILURE

Mime
View raw message