myfaces-commits mailing list archives

Site index · List index
Message view « Date » · « Thread »
Top « Date » · « Thread »
From Apache Jenkins Server <jenk...@builds.apache.org>
Subject Build failed in Jenkins: myfaces-current21 #2953
Date Sat, 26 Sep 2015 13:03:38 GMT
See <https://builds.apache.org/job/myfaces-current21/2953/>

------------------------------------------
[...truncated 3963 lines...]
[debug] execute contextualize
[INFO] [resources:resources {execution: default-resources}]
[INFO] Using 'UTF-8' encoding to copy filtered resources.
[INFO] skip non existing resourceDirectory <https://builds.apache.org/job/myfaces-current21/ws/current21/core/bundle/src/main/resources>
[INFO] Copying 3 resources
[INFO] [compiler:compile {execution: default-compile}]
[INFO] No sources to compile
[debug] execute contextualize
[INFO] [resources:testResources {execution: default-testResources}]
[INFO] Using 'UTF-8' encoding to copy filtered resources.
[INFO] skip non existing resourceDirectory <https://builds.apache.org/job/myfaces-current21/ws/current21/core/bundle/src/test/resources>
[INFO] Copying 3 resources
[INFO] [compiler:testCompile {execution: default-testCompile}]
[INFO] No sources to compile
[INFO] [surefire:test {execution: default-test}]
[INFO] Surefire report directory: <https://builds.apache.org/job/myfaces-current21/ws/current21/core/bundle/target/surefire-reports>

-------------------------------------------------------
 T E S T S
-------------------------------------------------------

Results :

Tests run: 0, Failures: 0, Errors: 0, Skipped: 0

[JENKINS] Recording test results
[INFO] [bundle:bundle {execution: default-bundle}]
[WARNING] Bundle org.apache.myfaces.core:myfaces-bundle:bundle:2.1.18-SNAPSHOT : Unused Private-Package
instructions, no such package(s) on the class path: [!*]
[WARNING] Bundle org.apache.myfaces.core:myfaces-bundle:bundle:2.1.18-SNAPSHOT : Export org.apache.myfaces.webapp,
 has 2,  private references [org.apache.myfaces.el.unified, org.apache.myfaces.config], 
[INFO] Preparing source:jar
[WARNING] Removing: jar from forked lifecycle, to prevent recursive invocation.
[INFO] No goals needed for project - skipping
[INFO] [source:jar {execution: attach-source}]
[INFO] Building jar: <https://builds.apache.org/job/myfaces-current21/ws/current21/core/bundle/target/myfaces-bundle-2.1.18-SNAPSHOT-sources.jar>
[INFO] [checkstyle:check {execution: verify-style}]
[INFO] Starting audit...
Audit done.

[INFO] [install:install {execution: default-install}]
[INFO] Installing <https://builds.apache.org/job/myfaces-current21/ws/current21/core/bundle/target/myfaces-bundle-2.1.18-SNAPSHOT.jar>
to /home/jenkins/jenkins-slave/maven-repositories/2/org/apache/myfaces/core/myfaces-bundle/2.1.18-SNAPSHOT/myfaces-bundle-2.1.18-SNAPSHOT.jar
[INFO] Installing <https://builds.apache.org/job/myfaces-current21/ws/current21/core/bundle/target/myfaces-bundle-2.1.18-SNAPSHOT-sources.jar>
to /home/jenkins/jenkins-slave/maven-repositories/2/org/apache/myfaces/core/myfaces-bundle/2.1.18-SNAPSHOT/myfaces-bundle-2.1.18-SNAPSHOT-sources.jar
[INFO] [bundle:install {execution: default-install}]
[INFO] Installing org/apache/myfaces/core/myfaces-bundle/2.1.18-SNAPSHOT/myfaces-bundle-2.1.18-SNAPSHOT.jar
[INFO] Writing OBR metadata
[INFO] ------------------------------------------------------------------------
[INFO] Building Apache MyFaces JSF-2.1 Core Module
[INFO]    task-segment: [install]
[INFO] ------------------------------------------------------------------------
[INFO] [remote-resources:process {execution: default}]
[INFO] [site:attach-descriptor {execution: default-attach-descriptor}]
[INFO] [checkstyle:check {execution: verify-style}]
[INFO] Starting audit...
Audit done.

[INFO] [install:install {execution: default-install}]
[INFO] Installing <https://builds.apache.org/job/myfaces-current21/ws/current21/core/pom.xml>
to /home/jenkins/jenkins-slave/maven-repositories/2/org/apache/myfaces/core/myfaces-core-module/2.1.18-SNAPSHOT/myfaces-core-module-2.1.18-SNAPSHOT.pom
[INFO] ------------------------------------------------------------------------
[INFO] Building Apache MyFaces Composite Build
[INFO]    task-segment: [install]
[INFO] ------------------------------------------------------------------------
[INFO] [remote-resources:process {execution: default}]
[INFO] [site:attach-descriptor {execution: default-attach-descriptor}]
[INFO] [checkstyle:check {execution: verify-style}]
[INFO] 
[INFO] [install:install {execution: default-install}]
[INFO] Installing <https://builds.apache.org/job/myfaces-current21/ws/current21/pom.xml>
to /home/jenkins/jenkins-slave/maven-repositories/2/org/apache/myfaces/myfaces-base/2.1.0-SNAPSHOT/myfaces-base-2.1.0-SNAPSHOT.pom
[INFO] 
[INFO] 
[INFO] ------------------------------------------------------------------------
[INFO] Reactor Summary:
[INFO] ------------------------------------------------------------------------
[INFO] Apache MyFaces JSF-2.1 Core Project ................... SUCCESS [4.319s]
[INFO] Apache MyFaces JSF-2.1 Core API ....................... SUCCESS [38.034s]
[INFO] Apache MyFaces Shared For JSF 2.1 - Project ........... SUCCESS [1.804s]
[INFO] Apache MyFaces Shared For JSF 2.1 - Core Mirror ....... SUCCESS [7.622s]
[INFO] MyFaces Shared Tomahawk ............................... SUCCESS [5.362s]
[INFO] Apache MyFaces Shared Public API For JSF 2.1 - Core ... SUCCESS [6.700s]
[INFO] Apache MyFaces Core For JSF 2.1 - Shared .............. SUCCESS [14.384s]
[INFO] Apache MyFaces JSF-2.1 Core Impl ...................... SUCCESS [53.762s]
[INFO] Apache MyFaces JSF-2.1 Core OSGi Bundle ............... SUCCESS [3.785s]
[INFO] Apache MyFaces JSF-2.1 Core Module .................... SUCCESS [0.337s]
[INFO] Apache MyFaces Composite Build ........................ SUCCESS [1.459s]
[INFO] ------------------------------------------------------------------------
[INFO] ------------------------------------------------------------------------
[INFO] BUILD SUCCESSFUL
[INFO] ------------------------------------------------------------------------
[INFO] Total time: 2 minutes 23 seconds
[INFO] Finished at: Sat Sep 26 12:57:58 UTC 2015
[INFO] Final Memory: 195M/881M
[INFO] ------------------------------------------------------------------------
[JENKINS] Archiving <https://builds.apache.org/job/myfaces-current21/ws/current21/shared/shared-tomahawk/pom.xml>
to org.apache.myfaces.shared/myfaces-shared-tomahawk/4.1.15-SNAPSHOT/myfaces-shared-tomahawk-4.1.15-SNAPSHOT.pom
[JENKINS] Archiving <https://builds.apache.org/job/myfaces-current21/ws/current21/shared/shared-tomahawk/target/myfaces-shared-tomahawk-4.1.15-SNAPSHOT.jar>
to org.apache.myfaces.shared/myfaces-shared-tomahawk/4.1.15-SNAPSHOT/myfaces-shared-tomahawk-4.1.15-SNAPSHOT.jar
[JENKINS] Archiving <https://builds.apache.org/job/myfaces-current21/ws/current21/shared/shared-tomahawk/target/myfaces-shared-tomahawk-4.1.15-SNAPSHOT-sources.jar>
to org.apache.myfaces.shared/myfaces-shared-tomahawk/4.1.15-SNAPSHOT/myfaces-shared-tomahawk-4.1.15-SNAPSHOT-sources.jar
Sending artifact delta relative to myfaces-current21 ? MyFaces Shared Tomahawk #2952
Archived 3 artifacts
Archive block size is 32768
Received 0 blocks and 830307 bytes
Compression is 0.0%
Took 0.3 sec
[JENKINS] Archiving <https://builds.apache.org/job/myfaces-current21/ws/current21/core/shared-public/pom.xml>
to org.apache.myfaces.core.internal/myfaces-impl-shared-public/2.1.18-SNAPSHOT/myfaces-impl-shared-public-2.1.18-SNAPSHOT.pom
[JENKINS] Archiving <https://builds.apache.org/job/myfaces-current21/ws/current21/core/shared-public/target/myfaces-impl-shared-public-2.1.18-SNAPSHOT.jar>
to org.apache.myfaces.core.internal/myfaces-impl-shared-public/2.1.18-SNAPSHOT/myfaces-impl-shared-public-2.1.18-SNAPSHOT.jar
[JENKINS] Archiving <https://builds.apache.org/job/myfaces-current21/ws/current21/core/shared-public/target/myfaces-impl-shared-public-2.1.18-SNAPSHOT-sources.jar>
to org.apache.myfaces.core.internal/myfaces-impl-shared-public/2.1.18-SNAPSHOT/myfaces-impl-shared-public-2.1.18-SNAPSHOT-sources.jar
Sending artifact delta relative to myfaces-current21 ? Apache MyFaces Shared Public API For
JSF 2.1 - Core #2952
Archived 3 artifacts
Archive block size is 32768
Received 0 blocks and 186120 bytes
Compression is 0.0%
Took 38 ms
[JENKINS] Archiving <https://builds.apache.org/job/myfaces-current21/ws/current21/core/impl/pom.xml>
to org.apache.myfaces.core/myfaces-impl/2.1.18-SNAPSHOT/myfaces-impl-2.1.18-SNAPSHOT.pom
[JENKINS] Archiving <https://builds.apache.org/job/myfaces-current21/ws/current21/core/impl/target/myfaces-impl-2.1.18-SNAPSHOT.jar>
to org.apache.myfaces.core/myfaces-impl/2.1.18-SNAPSHOT/myfaces-impl-2.1.18-SNAPSHOT.jar
[JENKINS] Archiving <https://builds.apache.org/job/myfaces-current21/ws/current21/core/impl/target/myfaces-impl-2.1.18-SNAPSHOT-sources.jar>
to org.apache.myfaces.core/myfaces-impl/2.1.18-SNAPSHOT/myfaces-impl-2.1.18-SNAPSHOT-sources.jar
[JENKINS] Archiving <https://builds.apache.org/job/myfaces-current21/ws/current21/core/impl/target/myfaces-impl-2.1.18-SNAPSHOT-tests.jar>
to org.apache.myfaces.core/myfaces-impl/2.1.18-SNAPSHOT/myfaces-impl-2.1.18-SNAPSHOT-tests.jar
Sending artifact delta relative to myfaces-current21 ? Apache MyFaces JSF-2.1 Core Impl #2952
Archived 4 artifacts
Archive block size is 32768
Received 1 blocks and 4900845 bytes
Compression is 0.7%
Took 1 sec
[JENKINS] Archiving <https://builds.apache.org/job/myfaces-current21/ws/current21/shared/core/pom.xml>
to org.apache.myfaces.shared/myfaces-shared-core/4.1.15-SNAPSHOT/myfaces-shared-core-4.1.15-SNAPSHOT.pom
[JENKINS] Archiving <https://builds.apache.org/job/myfaces-current21/ws/current21/shared/core/target/myfaces-shared-core-4.1.15-SNAPSHOT.jar>
to org.apache.myfaces.shared/myfaces-shared-core/4.1.15-SNAPSHOT/myfaces-shared-core-4.1.15-SNAPSHOT.jar
[JENKINS] Archiving <https://builds.apache.org/job/myfaces-current21/ws/current21/shared/core/target/myfaces-shared-core-4.1.15-SNAPSHOT-sources.jar>
to org.apache.myfaces.shared/myfaces-shared-core/4.1.15-SNAPSHOT/myfaces-shared-core-4.1.15-SNAPSHOT-sources.jar
Sending artifact delta relative to myfaces-current21 ? Apache MyFaces Shared For JSF 2.1 -
Core Mirror #2952
Archived 3 artifacts
Archive block size is 32768
Received 11 blocks and 538810 bytes
Compression is 40.1%
Took 0.14 sec
[JENKINS] Archiving <https://builds.apache.org/job/myfaces-current21/ws/current21/core/bundle/pom.xml>
to org.apache.myfaces.core/myfaces-bundle/2.1.18-SNAPSHOT/myfaces-bundle-2.1.18-SNAPSHOT.pom
[JENKINS] Archiving <https://builds.apache.org/job/myfaces-current21/ws/current21/core/bundle/target/myfaces-bundle-2.1.18-SNAPSHOT.jar>
to org.apache.myfaces.core/myfaces-bundle/2.1.18-SNAPSHOT/myfaces-bundle-2.1.18-SNAPSHOT.jar
[JENKINS] Archiving <https://builds.apache.org/job/myfaces-current21/ws/current21/core/bundle/target/myfaces-bundle-2.1.18-SNAPSHOT-sources.jar>
to org.apache.myfaces.core/myfaces-bundle/2.1.18-SNAPSHOT/myfaces-bundle-2.1.18-SNAPSHOT-sources.jar
Sending artifact delta relative to myfaces-current21 ? Apache MyFaces JSF-2.1 Core OSGi Bundle
#2952
Archived 3 artifacts
Archive block size is 32768
Received 2 blocks and 3129416 bytes
Compression is 2.1%
Took 0.71 sec
[JENKINS] Archiving <https://builds.apache.org/job/myfaces-current21/ws/current21/core/api/pom.xml>
to org.apache.myfaces.core/myfaces-api/2.1.18-SNAPSHOT/myfaces-api-2.1.18-SNAPSHOT.pom
[JENKINS] Archiving <https://builds.apache.org/job/myfaces-current21/ws/current21/core/api/target/myfaces-api-2.1.18-SNAPSHOT.jar>
to org.apache.myfaces.core/myfaces-api/2.1.18-SNAPSHOT/myfaces-api-2.1.18-SNAPSHOT.jar
[JENKINS] Archiving <https://builds.apache.org/job/myfaces-current21/ws/current21/core/api/target/myfaces-api-2.1.18-SNAPSHOT-sources.jar>
to org.apache.myfaces.core/myfaces-api/2.1.18-SNAPSHOT/myfaces-api-2.1.18-SNAPSHOT-sources.jar
[JENKINS] Archiving <https://builds.apache.org/job/myfaces-current21/ws/current21/core/api/target/myfaces-api-2.1.18-SNAPSHOT-tests.jar>
to org.apache.myfaces.core/myfaces-api/2.1.18-SNAPSHOT/myfaces-api-2.1.18-SNAPSHOT-tests.jar
Sending artifact delta relative to myfaces-current21 ? Apache MyFaces JSF-2.1 Core API #2952
Archived 4 artifacts
Archive block size is 32768
Received 20 blocks and 1672758 bytes
Compression is 28.1%
Took 0.45 sec
[JENKINS] Archiving /home/jenkins/jenkins-slave/maven-repositories/2/org/apache/myfaces/shared/myfaces-shared-project/4.1.15-SNAPSHOT/myfaces-shared-project-4.1.15-SNAPSHOT.pom
to org.apache.myfaces.shared/myfaces-shared-project/4.1.15-SNAPSHOT/myfaces-shared-project-4.1.15-SNAPSHOT.pom
[JENKINS] Archiving <https://builds.apache.org/job/myfaces-current21/ws/current21/shared/target/myfaces-shared-project-4.1.15-SNAPSHOT-site.xml>
to org.apache.myfaces.shared/myfaces-shared-project/4.1.15-SNAPSHOT/myfaces-shared-project-4.1.15-SNAPSHOT-site.xml
/x1/jenkins/jenkins-slave/maven-repositories/2/org/apache/myfaces/shared/myfaces-shared-project/4.1.15-SNAPSHOT/myfaces-shared-project-4.1.15-SNAPSHOT.pom
is not inside /x1/jenkins/jenkins-slave/workspace/myfaces-current21/current21/shared/; will
archive in a separate pass
Sending artifact delta relative to myfaces-current21 ? Apache MyFaces Shared For JSF 2.1 -
Project #2952
Archived 1 artifacts
Archive block size is 32768
Received 0 blocks and 2548 bytes
Compression is 0.0%
Took 14 ms
Sending artifact delta relative to myfaces-current21 ? Apache MyFaces Shared For JSF 2.1 -
Project #2952
Archived 1 artifacts
Archive block size is 32768
Received 0 blocks and 7986 bytes
Compression is 0.0%
Took 6 ms
[JENKINS] Archiving /home/jenkins/jenkins-slave/maven-repositories/2/org/apache/myfaces/core/myfaces-core-project/2.1.18-SNAPSHOT/myfaces-core-project-2.1.18-SNAPSHOT.pom
to org.apache.myfaces.core/myfaces-core-project/2.1.18-SNAPSHOT/myfaces-core-project-2.1.18-SNAPSHOT.pom
[JENKINS] Archiving <https://builds.apache.org/job/myfaces-current21/ws/current21/core/parent/target/myfaces-core-project-2.1.18-SNAPSHOT-site.xml>
to org.apache.myfaces.core/myfaces-core-project/2.1.18-SNAPSHOT/myfaces-core-project-2.1.18-SNAPSHOT-site.xml
/x1/jenkins/jenkins-slave/maven-repositories/2/org/apache/myfaces/core/myfaces-core-project/2.1.18-SNAPSHOT/myfaces-core-project-2.1.18-SNAPSHOT.pom
is not inside /x1/jenkins/jenkins-slave/workspace/myfaces-current21/current21/core/parent/;
will archive in a separate pass
Sending artifact delta relative to myfaces-current21 ? Apache MyFaces JSF-2.1 Core Project
#2952
Archived 1 artifacts
Archive block size is 32768
Received 0 blocks and 6227 bytes
Compression is 0.0%
Took 6 ms
Sending artifact delta relative to myfaces-current21 ? Apache MyFaces JSF-2.1 Core Project
#2952
Archived 1 artifacts
Archive block size is 32768
Received 0 blocks and 23555 bytes
Compression is 0.0%
Took 8 ms
[JENKINS] Archiving /home/jenkins/jenkins-slave/maven-repositories/2/org/apache/myfaces/core/myfaces-core-module/2.1.18-SNAPSHOT/myfaces-core-module-2.1.18-SNAPSHOT.pom
to org.apache.myfaces.core/myfaces-core-module/2.1.18-SNAPSHOT/myfaces-core-module-2.1.18-SNAPSHOT.pom
/x1/jenkins/jenkins-slave/maven-repositories/2/org/apache/myfaces/core/myfaces-core-module/2.1.18-SNAPSHOT/myfaces-core-module-2.1.18-SNAPSHOT.pom
is not inside /x1/jenkins/jenkins-slave/workspace/myfaces-current21/current21/core/; will
archive in a separate pass
Sending artifact delta relative to myfaces-current21 ? Apache MyFaces JSF-2.1 Core Module
#2952
Archived 1 artifacts
Archive block size is 32768
Received 0 blocks and 8298 bytes
Compression is 0.0%
Took 7 ms
[JENKINS] Archiving /home/jenkins/jenkins-slave/maven-repositories/2/org/apache/myfaces/myfaces-base/2.1.0-SNAPSHOT/myfaces-base-2.1.0-SNAPSHOT.pom
to org.apache.myfaces/myfaces-base/2.1.0-SNAPSHOT/myfaces-base-2.1.0-SNAPSHOT.pom
/x1/jenkins/jenkins-slave/maven-repositories/2/org/apache/myfaces/myfaces-base/2.1.0-SNAPSHOT/myfaces-base-2.1.0-SNAPSHOT.pom
is not inside /x1/jenkins/jenkins-slave/workspace/myfaces-current21/current21/; will archive
in a separate pass
Sending artifact delta relative to myfaces-current21 ? Apache MyFaces Composite Build #2952
Archived 1 artifacts
Archive block size is 32768
Received 0 blocks and 2225 bytes
Compression is 0.0%
Took 6 ms
[JENKINS] Archiving <https://builds.apache.org/job/myfaces-current21/ws/current21/core/shared/pom.xml>
to org.apache.myfaces.core.internal/myfaces-impl-shared/2.1.18-SNAPSHOT/myfaces-impl-shared-2.1.18-SNAPSHOT.pom
[JENKINS] Archiving <https://builds.apache.org/job/myfaces-current21/ws/current21/core/shared/target/myfaces-impl-shared-2.1.18-SNAPSHOT.jar>
to org.apache.myfaces.core.internal/myfaces-impl-shared/2.1.18-SNAPSHOT/myfaces-impl-shared-2.1.18-SNAPSHOT.jar
[JENKINS] Archiving <https://builds.apache.org/job/myfaces-current21/ws/current21/core/shared/target/myfaces-impl-shared-2.1.18-SNAPSHOT-sources.jar>
to org.apache.myfaces.core.internal/myfaces-impl-shared/2.1.18-SNAPSHOT/myfaces-impl-shared-2.1.18-SNAPSHOT-sources.jar
Sending artifact delta relative to myfaces-current21 ? Apache MyFaces Core For JSF 2.1 - Shared
#2952
Archived 3 artifacts
Archive block size is 32768
Received 0 blocks and 905806 bytes
Compression is 0.0%
Took 0.24 sec
channel stopped
Maven RedeployPublisher use remote ubuntu3 maven settings from : /home/jenkins/.m2/settings.xml
[INFO] Deployment in https://repository.apache.org/content/repositories/snapshots (id=apache.snapshots.https,uniqueVersion=false)
Deploying the main artifact myfaces-base-2.1.0-SNAPSHOT.pom
[INFO] Deployment in https://repository.apache.org/content/repositories/snapshots (id=apache.snapshots.https,uniqueVersion=false)
Deploying the main artifact myfaces-api-2.1.18-SNAPSHOT.jar
Deploying the main artifact myfaces-api-2.1.18-SNAPSHOT-sources.jar
Deploying the main artifact myfaces-api-2.1.18-SNAPSHOT-tests.jar
[INFO] Deployment in https://repository.apache.org/content/repositories/snapshots (id=apache.snapshots.https,uniqueVersion=false)
Deploying the main artifact myfaces-bundle-2.1.18-SNAPSHOT.jar
Deploying the main artifact myfaces-bundle-2.1.18-SNAPSHOT-sources.jar
[INFO] Deployment in https://repository.apache.org/content/repositories/snapshots (id=apache.snapshots.https,uniqueVersion=false)
Deploying the main artifact myfaces-core-module-2.1.18-SNAPSHOT.pom
[INFO] Deployment in https://repository.apache.org/content/repositories/snapshots (id=apache.snapshots.https,uniqueVersion=false)
Deploying the main artifact myfaces-core-project-2.1.18-SNAPSHOT.pom
Deploying the main artifact myfaces-core-project-2.1.18-SNAPSHOT-site.xml
[INFO] Deployment in https://repository.apache.org/content/repositories/snapshots (id=apache.snapshots.https,uniqueVersion=false)
Deploying the main artifact myfaces-impl-2.1.18-SNAPSHOT.jar
Deploying the main artifact myfaces-impl-2.1.18-SNAPSHOT-sources.jar
ERROR: Error installing artifact's metadata: Error while deploying metadata: Failed to transfer
file: https://repository.apache.org/content/repositories/snapshots/org/apache/myfaces/core/myfaces-impl/2.1.18-SNAPSHOT/maven-metadata.xml.sha1.
Return code is: 502, ReasonPhrase: Proxy Error.
org.apache.maven.artifact.deployer.ArtifactDeploymentException: Error installing artifact's
metadata: Error while deploying metadata: Failed to transfer file: https://repository.apache.org/content/repositories/snapshots/org/apache/myfaces/core/myfaces-impl/2.1.18-SNAPSHOT/maven-metadata.xml.sha1.
Return code is: 502, ReasonPhrase: Proxy Error.
	at hudson.maven.artifact.deployer.DefaultArtifactDeployer.deploy(DefaultArtifactDeployer.java:183)
	at hudson.maven.reporters.MavenArtifactRecord.deploy(MavenArtifactRecord.java:208)
	at hudson.maven.RedeployPublisher.perform(RedeployPublisher.java:176)
	at hudson.tasks.BuildStepMonitor$1.perform(BuildStepMonitor.java:20)
	at hudson.model.AbstractBuild$AbstractBuildExecution.perform(AbstractBuild.java:756)
	at hudson.model.AbstractBuild$AbstractBuildExecution.performAllBuildSteps(AbstractBuild.java:720)
	at hudson.maven.MavenModuleSetBuild$MavenModuleSetBuildExecution.post2(MavenModuleSetBuild.java:1037)
	at hudson.model.AbstractBuild$AbstractBuildExecution.post(AbstractBuild.java:669)
	at hudson.model.Run.execute(Run.java:1731)
	at hudson.maven.MavenModuleSetBuild.run(MavenModuleSetBuild.java:529)
	at hudson.model.ResourceController.execute(ResourceController.java:88)
	at hudson.model.Executor.run(Executor.java:232)
Caused by: org.apache.maven.artifact.repository.metadata.RepositoryMetadataDeploymentException:
Error while deploying metadata: Failed to transfer file: https://repository.apache.org/content/repositories/snapshots/org/apache/myfaces/core/myfaces-impl/2.1.18-SNAPSHOT/maven-metadata.xml.sha1.
Return code is: 502, ReasonPhrase: Proxy Error.
	at org.apache.maven.artifact.repository.metadata.DefaultRepositoryMetadataManager.deploy(DefaultRepositoryMetadataManager.java:492)
	at hudson.maven.artifact.deployer.DefaultArtifactDeployer.deploy(DefaultArtifactDeployer.java:167)
	... 11 more
Caused by: org.apache.maven.wagon.TransferFailedException: Failed to transfer file: https://repository.apache.org/content/repositories/snapshots/org/apache/myfaces/core/myfaces-impl/2.1.18-SNAPSHOT/maven-metadata.xml.sha1.
Return code is: 502, ReasonPhrase: Proxy Error.
	at org.apache.maven.wagon.shared.http4.AbstractHttpClientWagon.put(AbstractHttpClientWagon.java:626)
	at org.apache.maven.wagon.shared.http4.AbstractHttpClientWagon.put(AbstractHttpClientWagon.java:524)
	at org.apache.maven.wagon.shared.http4.AbstractHttpClientWagon.put(AbstractHttpClientWagon.java:505)
	at org.apache.maven.wagon.shared.http4.AbstractHttpClientWagon.put(AbstractHttpClientWagon.java:485)
	at org.apache.maven.repository.legacy.DefaultWagonManager.putRemoteFile(DefaultWagonManager.java:569)
	at org.apache.maven.repository.legacy.DefaultWagonManager.putArtifactMetadata(DefaultWagonManager.java:501)
	at org.apache.maven.artifact.repository.metadata.DefaultRepositoryMetadataManager.deploy(DefaultRepositoryMetadataManager.java:488)
	... 12 more
[INFO] Deployment failed after 5 min 57 sec
Build step 'Deploy artifacts to Maven repository' changed build result to FAILURE

Mime
View raw message