myfaces-commits mailing list archives

Site index · List index
Message view « Date » · « Thread »
Top « Date » · « Thread »
From Apache Jenkins Server <jenk...@builds.apache.org>
Subject Build failed in Jenkins: myfaces-current12 #1844
Date Sat, 26 Sep 2015 13:03:37 GMT
See <https://builds.apache.org/job/myfaces-current12/1844/>

------------------------------------------
[...truncated 2731 lines...]

Tests run: 143, Failures: 0, Errors: 0, Skipped: 0

[JENKINS] Recording test results
[INFO] [jar:jar {execution: default-jar}]
[INFO] Building jar: <https://builds.apache.org/job/myfaces-current12/ws/current12/core/impl/target/myfaces-impl-1.2.13-SNAPSHOT.jar>
[INFO] Preparing source:jar
[WARNING] Removing: jar from forked lifecycle, to prevent recursive invocation.
[INFO] [myfaces-builder:build-metadata {execution: makemyfacesmetadata}]
Artifact: myfaces-api-1.2.13-SNAPSHOT.jar have META-INF/myfaces-metadata.xml
[INFO] [myfaces-builder:make-config {execution: makefacesconfig}]
[WARNING] *******************************************************************
[WARNING] RuntimeInstance initializing.
[WARNING] Default ResourceManager initializing. (class org.apache.velocity.runtime.resource.ResourceManagerImpl)
[WARNING] FileResourceLoader : initialization starting.
[WARNING] FileResourceLoader : initialization complete.
[WARNING] RelativeClasspathResourceLoader : initialization complete.
[INFO] RelativeClasspathResourceLoader : adding path 'META-INF'
[WARNING] RelativeClasspathResourceLoader : initialization complete.
[WARNING] Default ResourceManager initialization complete.
[WARNING] Velocimacro : initialization starting.
[WARNING] Velocimacro : VM library registration complete.
[WARNING] Velocimacro : Velocimacro : initialization complete.
[WARNING] RuntimeInstance successfully initialized.
[INFO] using base content file: <https://builds.apache.org/job/myfaces-current12/ws/current12/core/impl/src/main/conf/META-INF/standard-faces-config-base.xml>
[INFO] [myfaces-builder:make-tags {execution: make_tags}]
[INFO] Using template from file loader: <https://builds.apache.org/job/myfaces-current12/ws/current12/core/impl/src/main/resources/META-INF/tagClass12.vm>
[WARNING] *******************************************************************
[WARNING] RuntimeInstance initializing.
[WARNING] Default ResourceManager initializing. (class org.apache.velocity.runtime.resource.ResourceManagerImpl)
[WARNING] FileResourceLoader : initialization starting.
[WARNING] FileResourceLoader : initialization complete.
[WARNING] RelativeClasspathResourceLoader : initialization complete.
[INFO] RelativeClasspathResourceLoader : adding path 'META-INF'
[WARNING] RelativeClasspathResourceLoader : initialization complete.
[WARNING] Default ResourceManager initialization complete.
[WARNING] Velocimacro : initialization starting.
[WARNING] Velocimacro : VM library registration complete.
[WARNING] Velocimacro : Velocimacro : initialization complete.
[WARNING] RuntimeInstance successfully initialized.
[INFO] Generating tag class:org.apache.myfaces.taglib.html.HtmlInputHiddenTag
[INFO] Generating tag class:org.apache.myfaces.taglib.html.HtmlColumnTag
[INFO] Generating tag class:org.apache.myfaces.taglib.html.HtmlCommandButtonTag
[INFO] Generating tag class:org.apache.myfaces.taglib.html.HtmlCommandLinkTag
[INFO] Generating tag class:org.apache.myfaces.taglib.html.HtmlDataTableTag
[INFO] Generating tag class:org.apache.myfaces.taglib.html.HtmlFormTag
[INFO] Generating tag class:org.apache.myfaces.taglib.html.HtmlGraphicImageTag
[INFO] Generating tag class:org.apache.myfaces.taglib.html.HtmlInputSecretTag
[INFO] Generating tag class:org.apache.myfaces.taglib.html.HtmlInputTextTag
[INFO] Generating tag class:org.apache.myfaces.taglib.html.HtmlInputTextareaTag
[INFO] Generating tag class:org.apache.myfaces.taglib.html.HtmlMessageTag
[INFO] Generating tag class:org.apache.myfaces.taglib.html.HtmlMessagesTag
[INFO] Generating tag class:org.apache.myfaces.taglib.html.HtmlOutputFormatTag
[INFO] Generating tag class:org.apache.myfaces.taglib.html.HtmlOutputLabelTag
[INFO] Generating tag class:org.apache.myfaces.taglib.html.HtmlOutputLinkTag
[INFO] Generating tag class:org.apache.myfaces.taglib.html.HtmlOutputTextTag
[INFO] Generating tag class:org.apache.myfaces.taglib.html.HtmlPanelGridTag
[INFO] Generating tag class:org.apache.myfaces.taglib.html.HtmlPanelGroupTag
[INFO] Generating tag class:org.apache.myfaces.taglib.html.HtmlSelectBooleanCheckboxTag
[INFO] Generating tag class:org.apache.myfaces.taglib.html.HtmlSelectManyCheckboxTag
[INFO] Generating tag class:org.apache.myfaces.taglib.html.HtmlSelectManyListboxTag
[INFO] Generating tag class:org.apache.myfaces.taglib.html.HtmlSelectManyMenuTag
[INFO] Generating tag class:org.apache.myfaces.taglib.html.HtmlSelectOneListboxTag
[INFO] Generating tag class:org.apache.myfaces.taglib.html.HtmlSelectOneMenuTag
[INFO] Generating tag class:org.apache.myfaces.taglib.html.HtmlSelectOneRadioTag
[INFO] [myfaces-builder:make-config {execution: makecoretld}]
[WARNING] *******************************************************************
[WARNING] RuntimeInstance initializing.
[WARNING] Default ResourceManager initializing. (class org.apache.velocity.runtime.resource.ResourceManagerImpl)
[WARNING] FileResourceLoader : initialization starting.
[WARNING] FileResourceLoader : initialization complete.
[WARNING] RelativeClasspathResourceLoader : initialization complete.
[INFO] RelativeClasspathResourceLoader : adding path 'META-INF'
[WARNING] RelativeClasspathResourceLoader : initialization complete.
[WARNING] Default ResourceManager initialization complete.
[WARNING] Velocimacro : initialization starting.
[WARNING] Velocimacro : VM library registration complete.
[WARNING] Velocimacro : Velocimacro : initialization complete.
[WARNING] RuntimeInstance successfully initialized.
[INFO] using base content file: <https://builds.apache.org/job/myfaces-current12/ws/current12/core/impl/src/main/conf/META-INF/myfaces_core-base.tld>
[INFO] [myfaces-builder:make-config {execution: makehtmltld}]
[WARNING] *******************************************************************
[WARNING] RuntimeInstance initializing.
[WARNING] Default ResourceManager initializing. (class org.apache.velocity.runtime.resource.ResourceManagerImpl)
[WARNING] FileResourceLoader : initialization starting.
[WARNING] FileResourceLoader : initialization complete.
[WARNING] RelativeClasspathResourceLoader : initialization complete.
[INFO] RelativeClasspathResourceLoader : adding path 'META-INF'
[WARNING] RelativeClasspathResourceLoader : initialization complete.
[WARNING] Default ResourceManager initialization complete.
[WARNING] Velocimacro : initialization starting.
[WARNING] Velocimacro : VM library registration complete.
[WARNING] Velocimacro : Velocimacro : initialization complete.
[WARNING] RuntimeInstance successfully initialized.
[INFO] using base content file: <https://builds.apache.org/job/myfaces-current12/ws/current12/core/impl/src/main/conf/META-INF/myfaces_html-base.tld>
ERROR: Could not find local repository for 2.2.1
[INFO] [source:jar {execution: attach-source}]
[INFO] Building jar: <https://builds.apache.org/job/myfaces-current12/ws/current12/core/impl/target/myfaces-impl-1.2.13-SNAPSHOT-sources.jar>
[INFO] [checkstyle:check {execution: verify-style}]
[INFO] 
[INFO] [install:install {execution: default-install}]
[INFO] Installing <https://builds.apache.org/job/myfaces-current12/ws/current12/core/impl/target/myfaces-impl-1.2.13-SNAPSHOT.jar>
to /home/jenkins/jenkins-slave/maven-repositories/0/org/apache/myfaces/core/myfaces-impl/1.2.13-SNAPSHOT/myfaces-impl-1.2.13-SNAPSHOT.jar
[INFO] Installing <https://builds.apache.org/job/myfaces-current12/ws/current12/core/impl/target/myfaces-impl-1.2.13-SNAPSHOT-sources.jar>
to /home/jenkins/jenkins-slave/maven-repositories/0/org/apache/myfaces/core/myfaces-impl/1.2.13-SNAPSHOT/myfaces-impl-1.2.13-SNAPSHOT-sources.jar
[INFO] ------------------------------------------------------------------------
[INFO] Building Build Project
[INFO]    task-segment: [install]
[INFO] ------------------------------------------------------------------------
[INFO] Setting property: classpath.resource.loader.class => 'org.codehaus.plexus.velocity.ContextClassLoaderResourceLoader'.
[INFO] Setting property: velocimacro.messages.on => 'false'.
[INFO] Setting property: resource.loader => 'classpath'.
[INFO] Setting property: resource.manager.logwhenfound => 'false'.
[INFO] [remote-resources:process {execution: default}]
[INFO] [site:attach-descriptor {execution: default-attach-descriptor}]
[INFO] [install:install {execution: default-install}]
[INFO] Installing <https://builds.apache.org/job/myfaces-current12/ws/current12/pom.xml>
to /home/jenkins/jenkins-slave/maven-repositories/0/org/apache/myfaces/myfaces-base/1.2.10-SNAPSHOT/myfaces-base-1.2.10-SNAPSHOT.pom
[INFO] 
[INFO] 
[INFO] ------------------------------------------------------------------------
[INFO] Reactor Summary:
[INFO] ------------------------------------------------------------------------
[INFO] Apache MyFaces JSF-1.2 Core Project ................... SUCCESS [3.749s]
[INFO] Apache Myfaces JSF Core-1.2 API ....................... SUCCESS [20.039s]
[INFO] Apache MyFaces Shared For JSF 1.2 - Project ........... SUCCESS [0.364s]
[INFO] Apache MyFaces Shared For JSF 1.2 - Core .............. SUCCESS [6.050s]
[INFO] MyFaces Shared Impl ................................... SUCCESS [9.568s]
[INFO] MyFaces Shared Tomahawk ............................... SUCCESS [3.608s]
[INFO] Apache MyFaces JSF-1.2 Core Impl ...................... SUCCESS [18.829s]
[INFO] Build Project ......................................... SUCCESS [1.755s]
[INFO] ------------------------------------------------------------------------
[INFO] ------------------------------------------------------------------------
[INFO] BUILD SUCCESSFUL
[INFO] ------------------------------------------------------------------------
[INFO] Total time: 1 minute 7 seconds
[INFO] Finished at: Sat Sep 26 13:02:50 UTC 2015
[INFO] Final Memory: 131M/632M
[INFO] ------------------------------------------------------------------------
[JENKINS] Archiving <https://builds.apache.org/job/myfaces-current12/ws/current12/shared/shared-tomahawk/pom.xml>
to org.apache.myfaces.shared/myfaces-shared-tomahawk/3.0.13-SNAPSHOT/myfaces-shared-tomahawk-3.0.13-SNAPSHOT.pom
[JENKINS] Archiving <https://builds.apache.org/job/myfaces-current12/ws/current12/shared/shared-tomahawk/target/myfaces-shared-tomahawk-3.0.13-SNAPSHOT.jar>
to org.apache.myfaces.shared/myfaces-shared-tomahawk/3.0.13-SNAPSHOT/myfaces-shared-tomahawk-3.0.13-SNAPSHOT.jar
[JENKINS] Archiving <https://builds.apache.org/job/myfaces-current12/ws/current12/shared/shared-tomahawk/target/myfaces-shared-tomahawk-3.0.13-SNAPSHOT-sources.jar>
to org.apache.myfaces.shared/myfaces-shared-tomahawk/3.0.13-SNAPSHOT/myfaces-shared-tomahawk-3.0.13-SNAPSHOT-sources.jar
Sending artifact delta relative to myfaces-current12 ? MyFaces Shared Tomahawk #1843
Archived 3 artifacts
Archive block size is 32768
Received 0 blocks and 562395 bytes
Compression is 0.0%
Took 0.21 sec
[JENKINS] Archiving <https://builds.apache.org/job/myfaces-current12/ws/current12/core/impl/pom.xml>
to org.apache.myfaces.core/myfaces-impl/1.2.13-SNAPSHOT/myfaces-impl-1.2.13-SNAPSHOT.pom
[JENKINS] Archiving <https://builds.apache.org/job/myfaces-current12/ws/current12/core/impl/target/myfaces-impl-1.2.13-SNAPSHOT.jar>
to org.apache.myfaces.core/myfaces-impl/1.2.13-SNAPSHOT/myfaces-impl-1.2.13-SNAPSHOT.jar
[JENKINS] Archiving <https://builds.apache.org/job/myfaces-current12/ws/current12/core/impl/target/myfaces-impl-1.2.13-SNAPSHOT-sources.jar>
to org.apache.myfaces.core/myfaces-impl/1.2.13-SNAPSHOT/myfaces-impl-1.2.13-SNAPSHOT-sources.jar
Sending artifact delta relative to myfaces-current12 ? Apache MyFaces JSF-1.2 Core Impl #1843
Archived 3 artifacts
Archive block size is 32768
Received 1 blocks and 1573054 bytes
Compression is 2.0%
Took 0.43 sec
[JENKINS] Archiving <https://builds.apache.org/job/myfaces-current12/ws/current12/shared/shared-impl/pom.xml>
to org.apache.myfaces.shared/myfaces-shared-impl/3.0.13-SNAPSHOT/myfaces-shared-impl-3.0.13-SNAPSHOT.pom
[JENKINS] Archiving <https://builds.apache.org/job/myfaces-current12/ws/current12/shared/shared-impl/target/myfaces-shared-impl-3.0.13-SNAPSHOT.jar>
to org.apache.myfaces.shared/myfaces-shared-impl/3.0.13-SNAPSHOT/myfaces-shared-impl-3.0.13-SNAPSHOT.jar
[JENKINS] Archiving <https://builds.apache.org/job/myfaces-current12/ws/current12/shared/shared-impl/target/myfaces-shared-impl-3.0.13-SNAPSHOT-sources.jar>
to org.apache.myfaces.shared/myfaces-shared-impl/3.0.13-SNAPSHOT/myfaces-shared-impl-3.0.13-SNAPSHOT-sources.jar
Sending artifact delta relative to myfaces-current12 ? MyFaces Shared Impl #1843
Archived 3 artifacts
Archive block size is 32768
Received 0 blocks and 558585 bytes
Compression is 0.0%
Took 0.11 sec
[JENKINS] Archiving <https://builds.apache.org/job/myfaces-current12/ws/current12/shared/core/pom.xml>
to org.apache.myfaces.shared/myfaces-shared-core/3.0.13-SNAPSHOT/myfaces-shared-core-3.0.13-SNAPSHOT.pom
[JENKINS] Archiving <https://builds.apache.org/job/myfaces-current12/ws/current12/shared/core/target/myfaces-shared-core-3.0.13-SNAPSHOT.jar>
to org.apache.myfaces.shared/myfaces-shared-core/3.0.13-SNAPSHOT/myfaces-shared-core-3.0.13-SNAPSHOT.jar
[JENKINS] Archiving <https://builds.apache.org/job/myfaces-current12/ws/current12/shared/core/target/myfaces-shared-core-3.0.13-SNAPSHOT-sources.jar>
to org.apache.myfaces.shared/myfaces-shared-core/3.0.13-SNAPSHOT/myfaces-shared-core-3.0.13-SNAPSHOT-sources.jar
Sending artifact delta relative to myfaces-current12 ? Apache MyFaces Shared For JSF 1.2 -
Core #1843
Archived 3 artifacts
Archive block size is 32768
Received 0 blocks and 561750 bytes
Compression is 0.0%
Took 0.12 sec
[JENKINS] Archiving <https://builds.apache.org/job/myfaces-current12/ws/current12/core/api/pom.xml>
to org.apache.myfaces.core/myfaces-api/1.2.13-SNAPSHOT/myfaces-api-1.2.13-SNAPSHOT.pom
[JENKINS] Archiving <https://builds.apache.org/job/myfaces-current12/ws/current12/core/api/target/myfaces-api-1.2.13-SNAPSHOT.jar>
to org.apache.myfaces.core/myfaces-api/1.2.13-SNAPSHOT/myfaces-api-1.2.13-SNAPSHOT.jar
[JENKINS] Archiving <https://builds.apache.org/job/myfaces-current12/ws/current12/core/api/target/myfaces-api-1.2.13-SNAPSHOT-sources.jar>
to org.apache.myfaces.core/myfaces-api/1.2.13-SNAPSHOT/myfaces-api-1.2.13-SNAPSHOT-sources.jar
[JENKINS] Archiving <https://builds.apache.org/job/myfaces-current12/ws/current12/core/api/target/myfaces-api-1.2.13-SNAPSHOT-tests.jar>
to org.apache.myfaces.core/myfaces-api/1.2.13-SNAPSHOT/myfaces-api-1.2.13-SNAPSHOT-tests.jar
Sending artifact delta relative to myfaces-current12 ? Apache Myfaces JSF Core-1.2 API #1843
Archived 4 artifacts
Archive block size is 32768
Received 0 blocks and 1013282 bytes
Compression is 0.0%
Took 0.21 sec
[JENKINS] Archiving /home/jenkins/jenkins-slave/maven-repositories/0/org/apache/myfaces/shared/myfaces-shared-project/3.0.13-SNAPSHOT/myfaces-shared-project-3.0.13-SNAPSHOT.pom
to org.apache.myfaces.shared/myfaces-shared-project/3.0.13-SNAPSHOT/myfaces-shared-project-3.0.13-SNAPSHOT.pom
[JENKINS] Archiving <https://builds.apache.org/job/myfaces-current12/ws/current12/shared/target/myfaces-shared-project-3.0.13-SNAPSHOT-site.xml>
to org.apache.myfaces.shared/myfaces-shared-project/3.0.13-SNAPSHOT/myfaces-shared-project-3.0.13-SNAPSHOT-site.xml
/x1/jenkins/jenkins-slave/maven-repositories/0/org/apache/myfaces/shared/myfaces-shared-project/3.0.13-SNAPSHOT/myfaces-shared-project-3.0.13-SNAPSHOT.pom
is not inside /x1/jenkins/jenkins-slave/workspace/myfaces-current12/current12/shared/; will
archive in a separate pass
Sending artifact delta relative to myfaces-current12 ? Apache MyFaces Shared For JSF 1.2 -
Project #1843
Archived 1 artifacts
Archive block size is 32768
Received 0 blocks and 2548 bytes
Compression is 0.0%
Took 4 ms
Sending artifact delta relative to myfaces-current12 ? Apache MyFaces Shared For JSF 1.2 -
Project #1843
Archived 1 artifacts
Archive block size is 32768
Received 0 blocks and 7667 bytes
Compression is 0.0%
Took 4 ms
[JENKINS] Archiving /home/jenkins/jenkins-slave/maven-repositories/0/org/apache/myfaces/core/myfaces-core-project/1.2.13-SNAPSHOT/myfaces-core-project-1.2.13-SNAPSHOT.pom
to org.apache.myfaces.core/myfaces-core-project/1.2.13-SNAPSHOT/myfaces-core-project-1.2.13-SNAPSHOT.pom
[JENKINS] Archiving <https://builds.apache.org/job/myfaces-current12/ws/current12/core/target/myfaces-core-project-1.2.13-SNAPSHOT-site.xml>
to org.apache.myfaces.core/myfaces-core-project/1.2.13-SNAPSHOT/myfaces-core-project-1.2.13-SNAPSHOT-site.xml
/x1/jenkins/jenkins-slave/maven-repositories/0/org/apache/myfaces/core/myfaces-core-project/1.2.13-SNAPSHOT/myfaces-core-project-1.2.13-SNAPSHOT.pom
is not inside /x1/jenkins/jenkins-slave/workspace/myfaces-current12/current12/core/; will
archive in a separate pass
Sending artifact delta relative to myfaces-current12 ? Apache MyFaces JSF-1.2 Core Project
#1843
Archived 1 artifacts
Archive block size is 32768
Received 0 blocks and 5923 bytes
Compression is 0.0%
Took 3 ms
Sending artifact delta relative to myfaces-current12 ? Apache MyFaces JSF-1.2 Core Project
#1843
Archived 1 artifacts
Archive block size is 32768
Received 0 blocks and 17769 bytes
Compression is 0.0%
Took 4 ms
[JENKINS] Archiving /home/jenkins/jenkins-slave/maven-repositories/0/org/apache/myfaces/myfaces-base/1.2.10-SNAPSHOT/myfaces-base-1.2.10-SNAPSHOT.pom
to org.apache.myfaces/myfaces-base/1.2.10-SNAPSHOT/myfaces-base-1.2.10-SNAPSHOT.pom
/x1/jenkins/jenkins-slave/maven-repositories/0/org/apache/myfaces/myfaces-base/1.2.10-SNAPSHOT/myfaces-base-1.2.10-SNAPSHOT.pom
is not inside /x1/jenkins/jenkins-slave/workspace/myfaces-current12/current12/; will archive
in a separate pass
Sending artifact delta relative to myfaces-current12 ? Build Project #1843
Archived 1 artifacts
Archive block size is 32768
Received 0 blocks and 1228 bytes
Compression is 0.0%
Took 4 ms
channel stopped
Maven RedeployPublisher use remote ubuntu3 maven settings from : /home/jenkins/.m2/settings.xml
[INFO] Deployment in https://repository.apache.org/content/repositories/snapshots (id=apache.snapshots.https,uniqueVersion=false)
Deploying the main artifact myfaces-base-1.2.10-SNAPSHOT.pom
ERROR: Error deploying artifact: Failed to transfer file: https://repository.apache.org/content/repositories/snapshots/org/apache/myfaces/myfaces-base/1.2.10-SNAPSHOT/myfaces-base-1.2.10-SNAPSHOT.pom.md5.
Return code is: 502, ReasonPhrase: Proxy Error.
org.apache.maven.artifact.deployer.ArtifactDeploymentException: Error deploying artifact:
Failed to transfer file: https://repository.apache.org/content/repositories/snapshots/org/apache/myfaces/myfaces-base/1.2.10-SNAPSHOT/myfaces-base-1.2.10-SNAPSHOT.pom.md5.
Return code is: 502, ReasonPhrase: Proxy Error.
	at hudson.maven.artifact.deployer.DefaultArtifactDeployer.deploy(DefaultArtifactDeployer.java:175)
	at hudson.maven.reporters.MavenArtifactRecord.deploy(MavenArtifactRecord.java:193)
	at hudson.maven.RedeployPublisher.perform(RedeployPublisher.java:176)
	at hudson.tasks.BuildStepMonitor$1.perform(BuildStepMonitor.java:20)
	at hudson.model.AbstractBuild$AbstractBuildExecution.perform(AbstractBuild.java:756)
	at hudson.model.AbstractBuild$AbstractBuildExecution.performAllBuildSteps(AbstractBuild.java:720)
	at hudson.maven.MavenModuleSetBuild$MavenModuleSetBuildExecution.post2(MavenModuleSetBuild.java:1037)
	at hudson.model.AbstractBuild$AbstractBuildExecution.post(AbstractBuild.java:669)
	at hudson.model.Run.execute(Run.java:1731)
	at hudson.maven.MavenModuleSetBuild.run(MavenModuleSetBuild.java:529)
	at hudson.model.ResourceController.execute(ResourceController.java:88)
	at hudson.model.Executor.run(Executor.java:232)
Caused by: org.apache.maven.wagon.TransferFailedException: Failed to transfer file: https://repository.apache.org/content/repositories/snapshots/org/apache/myfaces/myfaces-base/1.2.10-SNAPSHOT/myfaces-base-1.2.10-SNAPSHOT.pom.md5.
Return code is: 502, ReasonPhrase: Proxy Error.
	at org.apache.maven.wagon.shared.http4.AbstractHttpClientWagon.put(AbstractHttpClientWagon.java:626)
	at org.apache.maven.wagon.shared.http4.AbstractHttpClientWagon.put(AbstractHttpClientWagon.java:524)
	at org.apache.maven.wagon.shared.http4.AbstractHttpClientWagon.put(AbstractHttpClientWagon.java:505)
	at org.apache.maven.wagon.shared.http4.AbstractHttpClientWagon.put(AbstractHttpClientWagon.java:485)
	at org.apache.maven.repository.legacy.DefaultWagonManager.putRemoteFile(DefaultWagonManager.java:569)
	at org.apache.maven.repository.legacy.DefaultWagonManager.putArtifact(DefaultWagonManager.java:494)
	at hudson.maven.artifact.deployer.DefaultArtifactDeployer.deploy(DefaultArtifactDeployer.java:160)
	... 11 more
[INFO] Deployment failed after 1 min 7 sec
Build step 'Deploy artifacts to Maven repository' changed build result to FAILURE

Mime
View raw message