myfaces-commits mailing list archives

Site index · List index
Message view « Date » · « Thread »
Top « Date » · « Thread »
From Apache Jenkins Server <jenk...@builds.apache.org>
Subject Build failed in Jenkins: tobago-3.0.x #156
Date Tue, 24 Nov 2015 16:30:21 GMT
See <https://builds.apache.org/job/tobago-3.0.x/156/changes>

Changes:

[Dennis Kieselhorst] updated parent to myfaces 16

------------------------------------------
[...truncated 2793 lines...]
[JENKINS] Recording test results
[INFO] 
[INFO] --- maven-jar-plugin:2.6:jar (default-jar) @ tobago-tool-annotation ---
[INFO] Building jar: <https://builds.apache.org/job/tobago-3.0.x/ws/tobago-3.0.x/tobago-tool/tobago-tool-annotation/target/tobago-tool-annotation-3.0.0-alpha-2-SNAPSHOT.jar>
[INFO] 
[INFO] --- maven-site-plugin:3.4:attach-descriptor (attach-descriptor) @ tobago-tool-annotation
---
[INFO] 
[INFO] --- maven-install-plugin:2.5.2:install (default-install) @ tobago-tool-annotation ---
[INFO] Installing <https://builds.apache.org/job/tobago-3.0.x/ws/tobago-3.0.x/tobago-tool/tobago-tool-annotation/target/tobago-tool-annotation-3.0.0-alpha-2-SNAPSHOT.jar>
to /home/jenkins/jenkins-slave/maven-repositories/1/org/apache/myfaces/tobago/tobago-tool-annotation/3.0.0-alpha-2-SNAPSHOT/tobago-tool-annotation-3.0.0-alpha-2-SNAPSHOT.jar
[INFO] Installing <https://builds.apache.org/job/tobago-3.0.x/ws/tobago-3.0.x/tobago-tool/tobago-tool-annotation/pom.xml>
to /home/jenkins/jenkins-slave/maven-repositories/1/org/apache/myfaces/tobago/tobago-tool-annotation/3.0.0-alpha-2-SNAPSHOT/tobago-tool-annotation-3.0.0-alpha-2-SNAPSHOT.pom
[INFO]                                                                         
[INFO] ------------------------------------------------------------------------
[INFO] Building Tobago Tool Apt 3.0.0-alpha-2-SNAPSHOT
[INFO] ------------------------------------------------------------------------
[INFO] 
[INFO] --- maven-clean-plugin:2.6.1:clean (default-clean) @ tobago-tool-apt ---
[INFO] 
[INFO] --- animal-sniffer-maven-plugin:1.14:check (default-cli) @ tobago-tool-apt ---
[INFO] Checking unresolved references to org.codehaus.mojo.signature:java16:1.0
[INFO] 
[INFO] --- maven-checkstyle-plugin:2.9.1:check (default-cli) @ tobago-tool-apt ---
[INFO] Starting audit...
Audit done.

[INFO] 
[INFO] --- maven-enforcer-plugin:1.4:enforce (enforce) @ tobago-tool-apt ---
[INFO] 
[INFO] --- maven-remote-resources-plugin:1.5:process (default) @ tobago-tool-apt ---
[INFO] 
[INFO] --- maven-resources-plugin:2.7:resources (default-resources) @ tobago-tool-apt ---
[INFO] Using 'UTF-8' encoding to copy filtered resources.
[INFO] Copying 2 resources
[INFO] Copying 3 resources
[INFO] 
[INFO] --- maven-compiler-plugin:3.3:compile (default-compile) @ tobago-tool-apt ---
[INFO] Compiling 16 source files to <https://builds.apache.org/job/tobago-3.0.x/ws/tobago-3.0.x/tobago-tool/tobago-tool-apt/target/classes>
[WARNING] bootstrap class path not set in conjunction with -source 1.6
[INFO] <https://builds.apache.org/job/tobago-3.0.x/ws/tobago-3.0.x/tobago-tool/tobago-tool-apt/src/main/java/org/apache/myfaces/tobago/apt/processor/FacesConfigGenerator.java>:
<https://builds.apache.org/job/tobago-3.0.x/ws/tobago-3.0.x/tobago-tool/tobago-tool-apt/src/main/java/org/apache/myfaces/tobago/apt/processor/FacesConfigGenerator.java>
uses unchecked or unsafe operations.
[INFO] <https://builds.apache.org/job/tobago-3.0.x/ws/tobago-3.0.x/tobago-tool/tobago-tool-apt/src/main/java/org/apache/myfaces/tobago/apt/processor/FacesConfigGenerator.java>:
Recompile with -Xlint:unchecked for details.
[INFO] 
[INFO] --- maven-resources-plugin:2.7:testResources (default-testResources) @ tobago-tool-apt
---
[INFO] Using 'UTF-8' encoding to copy filtered resources.
[INFO] skip non existing resourceDirectory <https://builds.apache.org/job/tobago-3.0.x/ws/tobago-3.0.x/tobago-tool/tobago-tool-apt/src/test/resources>
[INFO] Copying 3 resources
[INFO] 
[INFO] --- maven-compiler-plugin:3.3:testCompile (default-testCompile) @ tobago-tool-apt ---
[INFO] No sources to compile
[INFO] 
[INFO] --- maven-surefire-plugin:2.18.1:test (default-test) @ tobago-tool-apt ---
[JENKINS] Recording test results
[INFO] 
[INFO] --- maven-jar-plugin:2.6:jar (default-jar) @ tobago-tool-apt ---
[INFO] Building jar: <https://builds.apache.org/job/tobago-3.0.x/ws/tobago-3.0.x/tobago-tool/tobago-tool-apt/target/tobago-tool-apt-3.0.0-alpha-2-SNAPSHOT.jar>
[INFO] 
[INFO] --- maven-site-plugin:3.4:attach-descriptor (attach-descriptor) @ tobago-tool-apt ---
[INFO] 
[INFO] --- maven-install-plugin:2.5.2:install (default-install) @ tobago-tool-apt ---
[INFO] Installing <https://builds.apache.org/job/tobago-3.0.x/ws/tobago-3.0.x/tobago-tool/tobago-tool-apt/target/tobago-tool-apt-3.0.0-alpha-2-SNAPSHOT.jar>
to /home/jenkins/jenkins-slave/maven-repositories/1/org/apache/myfaces/tobago/tobago-tool-apt/3.0.0-alpha-2-SNAPSHOT/tobago-tool-apt-3.0.0-alpha-2-SNAPSHOT.jar
[INFO] Installing <https://builds.apache.org/job/tobago-3.0.x/ws/tobago-3.0.x/tobago-tool/tobago-tool-apt/pom.xml>
to /home/jenkins/jenkins-slave/maven-repositories/1/org/apache/myfaces/tobago/tobago-tool-apt/3.0.0-alpha-2-SNAPSHOT/tobago-tool-apt-3.0.0-alpha-2-SNAPSHOT.pom
[INFO]                                                                         
[INFO] ------------------------------------------------------------------------
[INFO] Building Tobago Maven2 Theme Plugin 3.0.0-alpha-2-SNAPSHOT
[INFO] ------------------------------------------------------------------------
[INFO] 
[INFO] --- maven-clean-plugin:2.6.1:clean (default-clean) @ tobago-theme-plugin ---
[INFO] 
[INFO] --- animal-sniffer-maven-plugin:1.14:check (default-cli) @ tobago-theme-plugin ---
[INFO] Checking unresolved references to org.codehaus.mojo.signature:java16:1.1
[INFO] 
[INFO] --- maven-checkstyle-plugin:2.9.1:check (default-cli) @ tobago-theme-plugin ---
[INFO] Starting audit...
Audit done.

[INFO] 
[INFO] --- maven-enforcer-plugin:1.4:enforce (enforce) @ tobago-theme-plugin ---
[INFO] 
[INFO] --- maven-remote-resources-plugin:1.5:process (default) @ tobago-theme-plugin ---
[INFO] 
[INFO] --- maven-resources-plugin:2.7:resources (default-resources) @ tobago-theme-plugin
---
[INFO] Using 'UTF-8' encoding to copy filtered resources.
[INFO] Copying 2 resources
[INFO] Copying 3 resources
[INFO] 
[INFO] --- maven-compiler-plugin:3.3:compile (default-compile) @ tobago-theme-plugin ---
[INFO] Compiling 3 source files to <https://builds.apache.org/job/tobago-3.0.x/ws/tobago-3.0.x/tobago-tool/tobago-theme-plugin/target/classes>
[WARNING] bootstrap class path not set in conjunction with -source 1.5
[INFO] 
[INFO] --- maven-plugin-plugin:3.4:descriptor (default-descriptor) @ tobago-theme-plugin ---
[INFO] Using 'UTF-8' encoding to read mojo metadata.
[INFO] Mojo extractor with id: java-annotations found 0 mojo descriptors.
[WARNING] org.apache.myfaces.tobago.maven.plugin.UnPackThemeMojo#archiverManager:
[WARNING]   The syntax
[WARNING]     @parameter expression="${property}"
[WARNING]   is deprecated, please use
[WARNING]     @parameter property="property"
[WARNING]   instead.
[WARNING] org.apache.myfaces.tobago.maven.plugin.UnPackThemeMojo#archiverManager:
[WARNING]   The syntax
[WARNING]     @parameter expression="${component.<role>#<roleHint>}"
[WARNING]   is deprecated, please use
[WARNING]     @component role="<role>" roleHint="<roleHint>"
[WARNING]   instead.
[WARNING] org.apache.myfaces.tobago.maven.plugin.UnPackThemeMojo#project:
[WARNING]   The syntax
[WARNING]     @parameter expression="${property}"
[WARNING]   is deprecated, please use
[WARNING]     @parameter property="property"
[WARNING]   instead.
[WARNING] org.apache.myfaces.tobago.maven.plugin.UnPackThemeMojo#webappDirectory:
[WARNING]   The syntax
[WARNING]     @parameter expression="${property}"
[WARNING]   is deprecated, please use
[WARNING]     @parameter property="property"
[WARNING]   instead.
[WARNING] org.apache.myfaces.tobago.maven.plugin.UnPackThemeMojo#workDirectory:
[WARNING]   The syntax
[WARNING]     @parameter expression="${property}"
[WARNING]   is deprecated, please use
[WARNING]     @parameter property="property"
[WARNING]   instead.
[WARNING] org.apache.myfaces.tobago.maven.plugin.IndexThemeMojo#project:
[WARNING]   The syntax
[WARNING]     @parameter expression="${property}"
[WARNING]   is deprecated, please use
[WARNING]     @parameter property="property"
[WARNING]   instead.
[INFO] Mojo extractor with id: java-javadoc found 2 mojo descriptors.
[INFO] 
[INFO] --- maven-resources-plugin:2.7:testResources (default-testResources) @ tobago-theme-plugin
---
[INFO] Using 'UTF-8' encoding to copy filtered resources.
[INFO] skip non existing resourceDirectory <https://builds.apache.org/job/tobago-3.0.x/ws/tobago-3.0.x/tobago-tool/tobago-theme-plugin/src/test/resources>
[INFO] Copying 3 resources
[INFO] 
[INFO] --- maven-compiler-plugin:3.3:testCompile (default-testCompile) @ tobago-theme-plugin
---
[INFO] No sources to compile
[INFO] 
[INFO] --- maven-surefire-plugin:2.18.1:test (default-test) @ tobago-theme-plugin ---
[JENKINS] Recording test results
[INFO] 
[INFO] --- maven-jar-plugin:2.6:jar (default-jar) @ tobago-theme-plugin ---
[INFO] Building jar: <https://builds.apache.org/job/tobago-3.0.x/ws/tobago-3.0.x/tobago-tool/tobago-theme-plugin/target/tobago-theme-plugin-3.0.0-alpha-2-SNAPSHOT.jar>
[INFO] 
[INFO] --- maven-plugin-plugin:3.4:addPluginArtifactMetadata (default-addPluginArtifactMetadata)
@ tobago-theme-plugin ---
[INFO] 
[INFO] --- maven-site-plugin:3.4:attach-descriptor (attach-descriptor) @ tobago-theme-plugin
---
[INFO] 
[INFO] --- maven-install-plugin:2.5.2:install (default-install) @ tobago-theme-plugin ---
[INFO] Installing <https://builds.apache.org/job/tobago-3.0.x/ws/tobago-3.0.x/tobago-tool/tobago-theme-plugin/target/tobago-theme-plugin-3.0.0-alpha-2-SNAPSHOT.jar>
to /home/jenkins/jenkins-slave/maven-repositories/1/org/apache/myfaces/tobago/tobago-theme-plugin/3.0.0-alpha-2-SNAPSHOT/tobago-theme-plugin-3.0.0-alpha-2-SNAPSHOT.jar
[INFO] Installing <https://builds.apache.org/job/tobago-3.0.x/ws/tobago-3.0.x/tobago-tool/tobago-theme-plugin/pom.xml>
to /home/jenkins/jenkins-slave/maven-repositories/1/org/apache/myfaces/tobago/tobago-theme-plugin/3.0.0-alpha-2-SNAPSHOT/tobago-theme-plugin-3.0.0-alpha-2-SNAPSHOT.pom
[INFO]                                                                         
[INFO] ------------------------------------------------------------------------
[INFO] Building Tobago Core 3.0.0-alpha-2-SNAPSHOT
[INFO] ------------------------------------------------------------------------
[INFO] 
[INFO] --- maven-clean-plugin:2.6.1:clean (default-clean) @ tobago-core ---
[INFO] 
[INFO] --- animal-sniffer-maven-plugin:1.14:check (default-cli) @ tobago-core ---
[INFO] Checking unresolved references to org.codehaus.mojo.signature:java16:1.1
[INFO] 
[INFO] --- maven-checkstyle-plugin:2.9.1:check (default-cli) @ tobago-core ---
[INFO] Starting audit...
<https://builds.apache.org/job/tobago-3.0.x/ws/tobago-3.0.x/tobago-core/src/test/java/org/apache/myfaces/tobago/layout/MeasureUnitTest.java>:31:34:
',' is not followed by whitespace.
<https://builds.apache.org/job/tobago-3.0.x/ws/tobago-3.0.x/tobago-core/src/test/java/org/apache/myfaces/tobago/layout/MeasureUnitTest.java>:32:34:
',' is not followed by whitespace.
<https://builds.apache.org/job/tobago-3.0.x/ws/tobago-3.0.x/tobago-core/src/test/java/org/apache/myfaces/tobago/layout/MeasureUnitTest.java>:33:33:
',' is not followed by whitespace.
<https://builds.apache.org/job/tobago-3.0.x/ws/tobago-3.0.x/tobago-core/src/test/java/org/apache/myfaces/tobago/layout/MeasureUnitTest.java>:34:31:
',' is not followed by whitespace.
Audit done.

[INFO] There are 4 checkstyle errors.
[INFO] ------------------------------------------------------------------------
[INFO] Reactor Summary:
[INFO] 
[INFO] Apache Tobago ...................................... SUCCESS [  5.871 s]
[INFO] Tobago Tool ........................................ SUCCESS [  1.475 s]
[INFO] Tobago Tool Annotation ............................. SUCCESS [  3.826 s]
[INFO] Tobago Tool Apt .................................... SUCCESS [  4.629 s]
[INFO] Tobago Maven2 Theme Plugin ......................... SUCCESS [  3.961 s]
[INFO] Tobago Core ........................................ FAILURE [  4.450 s]
[INFO] Tobago Themes ...................................... SKIPPED
[INFO] Tobago Theme Standard .............................. SKIPPED
[INFO] Tobago Theme Scarborough ........................... SKIPPED
[INFO] Tobago Theme Speyside .............................. SKIPPED
[INFO] Tobago Theme Richmond .............................. SKIPPED
[INFO] Tobago Theme Charlotteville ........................ SKIPPED
[INFO] Tobago Extensions .................................. SKIPPED
[INFO] Tobago Deprecation ................................. SKIPPED
[INFO] Tobago Fileupload .................................. SKIPPED
[INFO] Tobago Sandbox ..................................... SKIPPED
[INFO] Tobago Security .................................... SKIPPED
[INFO] Tobago Examples .................................... SKIPPED
[INFO] Tobago Example Addressbook (Java EE 6) ............. SKIPPED
[INFO] Tobago Example Blank ............................... SKIPPED
[INFO] Tobago Example Data ................................ SKIPPED
[INFO] Tobago Example Demo ................................ SKIPPED
[INFO] Tobago Example Test ................................ SKIPPED
[INFO] Tobago Example for Portlets ........................ SKIPPED
[INFO] Tobago Example Security ............................ SKIPPED
[INFO] Tobago Example Assembly ............................ SKIPPED
[INFO] Tobago Theme Example ............................... SKIPPED
[INFO] Tobago Assembly .................................... SKIPPED
[INFO] ------------------------------------------------------------------------
[INFO] BUILD FAILURE
[INFO] ------------------------------------------------------------------------
[INFO] Total time: 37.111 s
[INFO] Finished at: 2015-11-24T16:30:17+00:00
[INFO] Final Memory: 54M/813M
[INFO] ------------------------------------------------------------------------
[ERROR] Failed to execute goal org.apache.maven.plugins:maven-checkstyle-plugin:2.9.1:check
(default-cli) on project tobago-core: You have 4 Checkstyle violations. -> [Help 1]
[ERROR] 
[ERROR] To see the full stack trace of the errors, re-run Maven with the -e switch.
[ERROR] Re-run Maven using the -X switch to enable full debug logging.
[ERROR] 
[ERROR] For more information about the errors and possible solutions, please read the following
articles:
[ERROR] [Help 1] http://cwiki.apache.org/confluence/display/MAVEN/MojoFailureException
[ERROR] 
[ERROR] After correcting the problems, you can resume the build with the command
[ERROR]   mvn <goals> -rf :tobago-core
[JENKINS] Archiving <https://builds.apache.org/job/tobago-3.0.x/ws/tobago-3.0.x/tobago-assembly/pom.xml>
to org.apache.myfaces.tobago/tobago-assembly/3.0.0-alpha-2-SNAPSHOT/tobago-assembly-3.0.0-alpha-2-SNAPSHOT.pom
[JENKINS] Archiving <https://builds.apache.org/job/tobago-3.0.x/ws/tobago-3.0.x/tobago-extension/tobago-sandbox/pom.xml>
to org.apache.myfaces.tobago/tobago-sandbox/3.0.0-alpha-2-SNAPSHOT/tobago-sandbox-3.0.0-alpha-2-SNAPSHOT.pom
[JENKINS] Archiving <https://builds.apache.org/job/tobago-3.0.x/ws/tobago-3.0.x/tobago-theme/tobago-theme-speyside/pom.xml>
to org.apache.myfaces.tobago/tobago-theme-speyside/3.0.0-alpha-2-SNAPSHOT/tobago-theme-speyside-3.0.0-alpha-2-SNAPSHOT.pom
[JENKINS] Archiving <https://builds.apache.org/job/tobago-3.0.x/ws/tobago-3.0.x/tobago-tool/tobago-theme-plugin/pom.xml>
to org.apache.myfaces.tobago/tobago-theme-plugin/3.0.0-alpha-2-SNAPSHOT/tobago-theme-plugin-3.0.0-alpha-2-SNAPSHOT.pom
[JENKINS] Archiving <https://builds.apache.org/job/tobago-3.0.x/ws/tobago-3.0.x/tobago-tool/tobago-theme-plugin/target/tobago-theme-plugin-3.0.0-alpha-2-SNAPSHOT.jar>
to org.apache.myfaces.tobago/tobago-theme-plugin/3.0.0-alpha-2-SNAPSHOT/tobago-theme-plugin-3.0.0-alpha-2-SNAPSHOT.jar
[JENKINS] Archiving <https://builds.apache.org/job/tobago-3.0.x/ws/tobago-3.0.x/tobago-example/tobago-example-data/pom.xml>
to org.apache.myfaces.tobago/tobago-example-data/3.0.0-alpha-2-SNAPSHOT/tobago-example-data-3.0.0-alpha-2-SNAPSHOT.pom
[JENKINS] Archiving <https://builds.apache.org/job/tobago-3.0.x/ws/tobago-3.0.x/tobago-example/tobago-example-portlet/pom.xml>
to org.apache.myfaces.tobago/tobago-example-portlet/3.0.0-alpha-2-SNAPSHOT/tobago-example-portlet-3.0.0-alpha-2-SNAPSHOT.pom
[JENKINS] Archiving <https://builds.apache.org/job/tobago-3.0.x/ws/tobago-3.0.x/tobago-example/tobago-theme-example/pom.xml>
to org.apache.myfaces.tobago/tobago-theme-example/3.0.0-alpha-2-SNAPSHOT/tobago-theme-example-3.0.0-alpha-2-SNAPSHOT.pom
[JENKINS] Archiving <https://builds.apache.org/job/tobago-3.0.x/ws/tobago-3.0.x/tobago-example/pom.xml>
to org.apache.myfaces.tobago/tobago-example/3.0.0-alpha-2-SNAPSHOT/tobago-example-3.0.0-alpha-2-SNAPSHOT.pom
[JENKINS] Archiving <https://builds.apache.org/job/tobago-3.0.x/ws/tobago-3.0.x/tobago-core/pom.xml>
to org.apache.myfaces.tobago/tobago-core/3.0.0-alpha-2-SNAPSHOT/tobago-core-3.0.0-alpha-2-SNAPSHOT.pom
[JENKINS] Archiving <https://builds.apache.org/job/tobago-3.0.x/ws/tobago-3.0.x/tobago-example/tobago-example-blank/pom.xml>
to org.apache.myfaces.tobago/tobago-example-blank/3.0.0-alpha-2-SNAPSHOT/tobago-example-blank-3.0.0-alpha-2-SNAPSHOT.pom
[JENKINS] Archiving <https://builds.apache.org/job/tobago-3.0.x/ws/tobago-3.0.x/tobago-theme/pom.xml>
to org.apache.myfaces.tobago/tobago-theme/3.0.0-alpha-2-SNAPSHOT/tobago-theme-3.0.0-alpha-2-SNAPSHOT.pom
[JENKINS] Archiving <https://builds.apache.org/job/tobago-3.0.x/ws/tobago-3.0.x/tobago-tool/tobago-tool-annotation/pom.xml>
to org.apache.myfaces.tobago/tobago-tool-annotation/3.0.0-alpha-2-SNAPSHOT/tobago-tool-annotation-3.0.0-alpha-2-SNAPSHOT.pom
[JENKINS] Archiving <https://builds.apache.org/job/tobago-3.0.x/ws/tobago-3.0.x/tobago-tool/tobago-tool-annotation/target/tobago-tool-annotation-3.0.0-alpha-2-SNAPSHOT.jar>
to org.apache.myfaces.tobago/tobago-tool-annotation/3.0.0-alpha-2-SNAPSHOT/tobago-tool-annotation-3.0.0-alpha-2-SNAPSHOT.jar
[JENKINS] Archiving <https://builds.apache.org/job/tobago-3.0.x/ws/tobago-3.0.x/tobago-theme/tobago-theme-richmond/pom.xml>
to org.apache.myfaces.tobago/tobago-theme-richmond/3.0.0-alpha-2-SNAPSHOT/tobago-theme-richmond-3.0.0-alpha-2-SNAPSHOT.pom
[JENKINS] Archiving <https://builds.apache.org/job/tobago-3.0.x/ws/tobago-3.0.x/tobago-theme/tobago-theme-standard/pom.xml>
to org.apache.myfaces.tobago/tobago-theme-standard/3.0.0-alpha-2-SNAPSHOT/tobago-theme-standard-3.0.0-alpha-2-SNAPSHOT.pom
[JENKINS] Archiving <https://builds.apache.org/job/tobago-3.0.x/ws/tobago-3.0.x/tobago-example/tobago-example-security/pom.xml>
to org.apache.myfaces.tobago/tobago-example-security/3.0.0-alpha-2-SNAPSHOT/tobago-example-security-3.0.0-alpha-2-SNAPSHOT.pom
[JENKINS] Archiving <https://builds.apache.org/job/tobago-3.0.x/ws/tobago-3.0.x/tobago-example/tobago-example-addressbook/pom.xml>
to org.apache.myfaces.tobago/tobago-example-addressbook/3.0.0-alpha-2-SNAPSHOT/tobago-example-addressbook-3.0.0-alpha-2-SNAPSHOT.pom
[JENKINS] Archiving <https://builds.apache.org/job/tobago-3.0.x/ws/tobago-3.0.x/tobago-tool/tobago-tool-apt/pom.xml>
to org.apache.myfaces.tobago/tobago-tool-apt/3.0.0-alpha-2-SNAPSHOT/tobago-tool-apt-3.0.0-alpha-2-SNAPSHOT.pom
[JENKINS] Archiving <https://builds.apache.org/job/tobago-3.0.x/ws/tobago-3.0.x/tobago-tool/tobago-tool-apt/target/tobago-tool-apt-3.0.0-alpha-2-SNAPSHOT.jar>
to org.apache.myfaces.tobago/tobago-tool-apt/3.0.0-alpha-2-SNAPSHOT/tobago-tool-apt-3.0.0-alpha-2-SNAPSHOT.jar
[JENKINS] Archiving <https://builds.apache.org/job/tobago-3.0.x/ws/tobago-3.0.x/tobago-tool/pom.xml>
to org.apache.myfaces.tobago/tobago-tool/3.0.0-alpha-2-SNAPSHOT/tobago-tool-3.0.0-alpha-2-SNAPSHOT.pom
[JENKINS] Archiving <https://builds.apache.org/job/tobago-3.0.x/ws/tobago-3.0.x/tobago-extension/tobago-deprecation/pom.xml>
to org.apache.myfaces.tobago/tobago-deprecation/3.0.0-alpha-2-SNAPSHOT/tobago-deprecation-3.0.0-alpha-2-SNAPSHOT.pom
[JENKINS] Archiving <https://builds.apache.org/job/tobago-3.0.x/ws/tobago-3.0.x/tobago-extension/tobago-fileupload/pom.xml>
to org.apache.myfaces.tobago/tobago-fileupload/3.0.0-alpha-2-SNAPSHOT/tobago-fileupload-3.0.0-alpha-2-SNAPSHOT.pom
[JENKINS] Archiving <https://builds.apache.org/job/tobago-3.0.x/ws/tobago-3.0.x/tobago-example/tobago-example-demo/pom.xml>
to org.apache.myfaces.tobago/tobago-example-demo/3.0.0-alpha-2-SNAPSHOT/tobago-example-demo-3.0.0-alpha-2-SNAPSHOT.pom
[JENKINS] Archiving <https://builds.apache.org/job/tobago-3.0.x/ws/tobago-3.0.x/tobago-extension/pom.xml>
to org.apache.myfaces.tobago/tobago-extension/3.0.0-alpha-2-SNAPSHOT/tobago-extension-3.0.0-alpha-2-SNAPSHOT.pom
[JENKINS] Archiving <https://builds.apache.org/job/tobago-3.0.x/ws/tobago-3.0.x/tobago-theme/tobago-theme-charlotteville/pom.xml>
to org.apache.myfaces.tobago/tobago-theme-charlotteville/3.0.0-alpha-2-SNAPSHOT/tobago-theme-charlotteville-3.0.0-alpha-2-SNAPSHOT.pom
[JENKINS] Archiving <https://builds.apache.org/job/tobago-3.0.x/ws/tobago-3.0.x/tobago-extension/tobago-security/pom.xml>
to org.apache.myfaces.tobago/tobago-security/3.0.0-alpha-2-SNAPSHOT/tobago-security-3.0.0-alpha-2-SNAPSHOT.pom
[JENKINS] Archiving <https://builds.apache.org/job/tobago-3.0.x/ws/tobago-3.0.x/tobago-example/tobago-example-assembly/pom.xml>
to org.apache.myfaces.tobago/tobago-example-assembly/3.0.0-alpha-2-SNAPSHOT/tobago-example-assembly-3.0.0-alpha-2-SNAPSHOT.pom
[JENKINS] Archiving <https://builds.apache.org/job/tobago-3.0.x/ws/tobago-3.0.x/pom.xml>
to org.apache.myfaces.tobago/tobago/3.0.0-alpha-2-SNAPSHOT/tobago-3.0.0-alpha-2-SNAPSHOT.pom
[JENKINS] Archiving <https://builds.apache.org/job/tobago-3.0.x/ws/tobago-3.0.x/tobago-example/tobago-example-test/pom.xml>
to org.apache.myfaces.tobago/tobago-example-test/3.0.0-alpha-2-SNAPSHOT/tobago-example-test-3.0.0-alpha-2-SNAPSHOT.pom
[JENKINS] Archiving <https://builds.apache.org/job/tobago-3.0.x/ws/tobago-3.0.x/tobago-theme/tobago-theme-scarborough/pom.xml>
to org.apache.myfaces.tobago/tobago-theme-scarborough/3.0.0-alpha-2-SNAPSHOT/tobago-theme-scarborough-3.0.0-alpha-2-SNAPSHOT.pom
Sending e-mails to: commits@myfaces.apache.org
channel stopped

Mime
View raw message