myfaces-commits mailing list archives

Site index · List index
Message view « Date » · « Thread »
Top « Date » · « Thread »
From Apache Jenkins Server <jenk...@builds.apache.org>
Subject Build failed in Jenkins: Tobago 3.0.x #286
Date Wed, 16 Mar 2016 23:31:39 GMT
See <https://builds.apache.org/job/Tobago%203.0.x/286/changes>

Changes:

[lofwyr] TOBAGO-1546: Disabled images should be styled by CSS

[lofwyr] TOBAGO-1544: Revise Demo Application for Tobago 3.0
[developed by hnoeth]

[lofwyr] TOBAGO-1544: Revise Demo Application for Tobago 3.0
[developed by hnoeth]

------------------------------------------
[...truncated 5589 lines...]
[INFO] Copying 1 resource
[INFO] Copying 3 resources
[INFO] 
[INFO] --- maven-compiler-plugin:3.5.1:testCompile (default-testCompile) @ tobago-example-addressbook
---
[INFO] No sources to compile
[INFO] 
[INFO] --- maven-surefire-plugin:2.18.1:test (default-test) @ tobago-example-addressbook ---
[JENKINS] Recording test results
[INFO] 
[INFO] --- maven-war-plugin:2.6:war (default-war) @ tobago-example-addressbook ---
[INFO] Packaging webapp
[INFO] Assembling webapp [tobago-example-addressbook] in [<https://builds.apache.org/job/Tobago%203.0.x/ws/tobago-3.0.x/tobago-example/tobago-example-addressbook/target/tobago-example-addressbook]>
[INFO] Processing war project
[INFO] Copying webapp resources [<https://builds.apache.org/job/Tobago%203.0.x/ws/tobago-3.0.x/tobago-example/tobago-example-addressbook/src/main/webapp]>
[INFO] Webapp assembled in [118 msecs]
[INFO] Building war: <https://builds.apache.org/job/Tobago%203.0.x/ws/tobago-3.0.x/tobago-example/tobago-example-addressbook/target/tobago-example-addressbook.war>
[INFO] 
[INFO] --- maven-site-plugin:3.4:attach-descriptor (attach-descriptor) @ tobago-example-addressbook
---
[INFO] 
[INFO] --- maven-dependency-plugin:2.10:unpack (unpack) @ tobago-example-addressbook ---
[INFO] Configured Artifact: org.tango-project:tango-icon-theme:0.8.0:jar
[INFO] Unpacking /home/jenkins/jenkins-slave/maven-repositories/1/org/tango-project/tango-icon-theme/0.8.0/tango-icon-theme-0.8.0.jar
to <https://builds.apache.org/job/Tobago%203.0.x/ws/tobago-3.0.x/tobago-example/tobago-example-addressbook/target/tobago-example-addressbook/image>
with includes "" and excludes ""
[INFO] 
[INFO] --- maven-install-plugin:2.5.2:install (default-install) @ tobago-example-addressbook
---
[INFO] Installing <https://builds.apache.org/job/Tobago%203.0.x/ws/tobago-3.0.x/tobago-example/tobago-example-addressbook/target/tobago-example-addressbook.war>
to /home/jenkins/jenkins-slave/maven-repositories/1/org/apache/myfaces/tobago/tobago-example-addressbook/3.0.0-alpha-3-SNAPSHOT/tobago-example-addressbook-3.0.0-alpha-3-SNAPSHOT.war
[INFO] Installing <https://builds.apache.org/job/Tobago%203.0.x/ws/tobago-3.0.x/tobago-example/tobago-example-addressbook/pom.xml>
to /home/jenkins/jenkins-slave/maven-repositories/1/org/apache/myfaces/tobago/tobago-example-addressbook/3.0.0-alpha-3-SNAPSHOT/tobago-example-addressbook-3.0.0-alpha-3-SNAPSHOT.pom
[INFO]                                                                         
[INFO] ------------------------------------------------------------------------
[INFO] Building Tobago Example Blank 3.0.0-alpha-3-SNAPSHOT
[INFO] ------------------------------------------------------------------------
[INFO] 
[INFO] --- maven-clean-plugin:2.6.1:clean (default-clean) @ tobago-example-blank ---
[INFO] 
[INFO] --- animal-sniffer-maven-plugin:1.14:check (default-cli) @ tobago-example-blank ---
[INFO] Checking unresolved references to org.codehaus.mojo.signature:java16:1.1
[INFO] 
[INFO] --- maven-checkstyle-plugin:2.9.1:check (default-cli) @ tobago-example-blank ---
[INFO] Starting audit...
Audit done.

[INFO] 
[INFO] --- maven-enforcer-plugin:1.4.1:enforce (enforce) @ tobago-example-blank ---
[INFO] 
[INFO] --- maven-remote-resources-plugin:1.5:process (default) @ tobago-example-blank ---
[INFO] 
[INFO] --- maven-resources-plugin:2.7:resources (default-resources) @ tobago-example-blank
---
[INFO] Using 'UTF-8' encoding to copy filtered resources.
[INFO] Copying 1 resource
[INFO] Copying 3 resources
[INFO] 
[INFO] --- maven-compiler-plugin:3.5.1:compile (default-compile) @ tobago-example-blank ---
[INFO] No sources to compile
[INFO] 
[INFO] --- maven-resources-plugin:2.7:testResources (default-testResources) @ tobago-example-blank
---
[INFO] Using 'UTF-8' encoding to copy filtered resources.
[INFO] skip non existing resourceDirectory <https://builds.apache.org/job/Tobago%203.0.x/ws/tobago-3.0.x/tobago-example/tobago-example-blank/src/test/resources>
[INFO] Copying 3 resources
[INFO] 
[INFO] --- maven-compiler-plugin:3.5.1:testCompile (default-testCompile) @ tobago-example-blank
---
[INFO] No sources to compile
[INFO] 
[INFO] --- maven-surefire-plugin:2.18.1:test (default-test) @ tobago-example-blank ---
[JENKINS] Recording test results
[INFO] 
[INFO] --- maven-war-plugin:2.6:war (default-war) @ tobago-example-blank ---
[INFO] Packaging webapp
[INFO] Assembling webapp [tobago-example-blank] in [<https://builds.apache.org/job/Tobago%203.0.x/ws/tobago-3.0.x/tobago-example/tobago-example-blank/target/tobago-example-blank]>
[INFO] Processing war project
[INFO] Copying webapp resources [<https://builds.apache.org/job/Tobago%203.0.x/ws/tobago-3.0.x/tobago-example/tobago-example-blank/src/main/webapp]>
[INFO] Webapp assembled in [17 msecs]
[INFO] Building war: <https://builds.apache.org/job/Tobago%203.0.x/ws/tobago-3.0.x/tobago-example/tobago-example-blank/target/tobago-example-blank.war>
[INFO] 
[INFO] --- maven-site-plugin:3.4:attach-descriptor (attach-descriptor) @ tobago-example-blank
---
[INFO] 
[INFO] --- maven-install-plugin:2.5.2:install (default-install) @ tobago-example-blank ---
[INFO] Installing <https://builds.apache.org/job/Tobago%203.0.x/ws/tobago-3.0.x/tobago-example/tobago-example-blank/target/tobago-example-blank.war>
to /home/jenkins/jenkins-slave/maven-repositories/1/org/apache/myfaces/tobago/tobago-example-blank/3.0.0-alpha-3-SNAPSHOT/tobago-example-blank-3.0.0-alpha-3-SNAPSHOT.war
[INFO] Installing <https://builds.apache.org/job/Tobago%203.0.x/ws/tobago-3.0.x/tobago-example/tobago-example-blank/pom.xml>
to /home/jenkins/jenkins-slave/maven-repositories/1/org/apache/myfaces/tobago/tobago-example-blank/3.0.0-alpha-3-SNAPSHOT/tobago-example-blank-3.0.0-alpha-3-SNAPSHOT.pom
[INFO]                                                                         
[INFO] ------------------------------------------------------------------------
[INFO] Building Tobago Example Data 3.0.0-alpha-3-SNAPSHOT
[INFO] ------------------------------------------------------------------------
[INFO] 
[INFO] --- maven-clean-plugin:2.6.1:clean (default-clean) @ tobago-example-data ---
[INFO] 
[INFO] --- animal-sniffer-maven-plugin:1.14:check (default-cli) @ tobago-example-data ---
[INFO] Checking unresolved references to org.codehaus.mojo.signature:java16:1.1
[INFO] 
[INFO] --- maven-checkstyle-plugin:2.9.1:check (default-cli) @ tobago-example-data ---
[INFO] Starting audit...
Audit done.

[INFO] 
[INFO] --- maven-enforcer-plugin:1.4.1:enforce (enforce) @ tobago-example-data ---
[INFO] 
[INFO] --- maven-remote-resources-plugin:1.5:process (default) @ tobago-example-data ---
[INFO] 
[INFO] --- maven-resources-plugin:2.7:resources (default-resources) @ tobago-example-data
---
[INFO] Using 'UTF-8' encoding to copy filtered resources.
[INFO] Copying 10 resources
[INFO] Copying 3 resources
[INFO] 
[INFO] --- maven-compiler-plugin:3.5.1:compile (default-compile) @ tobago-example-data ---
[INFO] Compiling 14 source files to <https://builds.apache.org/job/Tobago%203.0.x/ws/tobago-3.0.x/tobago-example/tobago-example-data/target/classes>
[WARNING] bootstrap class path not set in conjunction with -source 1.6
[INFO] 
[INFO] --- maven-resources-plugin:2.7:testResources (default-testResources) @ tobago-example-data
---
[INFO] Using 'UTF-8' encoding to copy filtered resources.
[INFO] skip non existing resourceDirectory <https://builds.apache.org/job/Tobago%203.0.x/ws/tobago-3.0.x/tobago-example/tobago-example-data/src/test/resources>
[INFO] Copying 3 resources
[INFO] 
[INFO] --- maven-compiler-plugin:3.5.1:testCompile (default-testCompile) @ tobago-example-data
---
[INFO] No sources to compile
[INFO] 
[INFO] --- maven-surefire-plugin:2.18.1:test (default-test) @ tobago-example-data ---
[JENKINS] Recording test results
[INFO] 
[INFO] --- maven-jar-plugin:2.6:jar (default-jar) @ tobago-example-data ---
[INFO] Building jar: <https://builds.apache.org/job/Tobago%203.0.x/ws/tobago-3.0.x/tobago-example/tobago-example-data/target/tobago-example-data-3.0.0-alpha-3-SNAPSHOT.jar>
[INFO] 
[INFO] --- maven-site-plugin:3.4:attach-descriptor (attach-descriptor) @ tobago-example-data
---
[INFO] 
[INFO] --- maven-install-plugin:2.5.2:install (default-install) @ tobago-example-data ---
[INFO] Installing <https://builds.apache.org/job/Tobago%203.0.x/ws/tobago-3.0.x/tobago-example/tobago-example-data/target/tobago-example-data-3.0.0-alpha-3-SNAPSHOT.jar>
to /home/jenkins/jenkins-slave/maven-repositories/1/org/apache/myfaces/tobago/tobago-example-data/3.0.0-alpha-3-SNAPSHOT/tobago-example-data-3.0.0-alpha-3-SNAPSHOT.jar
[INFO] Installing <https://builds.apache.org/job/Tobago%203.0.x/ws/tobago-3.0.x/tobago-example/tobago-example-data/pom.xml>
to /home/jenkins/jenkins-slave/maven-repositories/1/org/apache/myfaces/tobago/tobago-example-data/3.0.0-alpha-3-SNAPSHOT/tobago-example-data-3.0.0-alpha-3-SNAPSHOT.pom
[INFO]                                                                         
[INFO] ------------------------------------------------------------------------
[INFO] Building Tobago Example Demo 3.0.0-alpha-3-SNAPSHOT
[INFO] ------------------------------------------------------------------------
[INFO] 
[INFO] --- maven-clean-plugin:2.6.1:clean (default-clean) @ tobago-example-demo ---
[INFO] 
[INFO] --- animal-sniffer-maven-plugin:1.14:check (default-cli) @ tobago-example-demo ---
[INFO] Checking unresolved references to org.codehaus.mojo.signature:java16:1.1
[INFO] 
[INFO] --- maven-checkstyle-plugin:2.9.1:check (default-cli) @ tobago-example-demo ---
[INFO] Starting audit...
<https://builds.apache.org/job/Tobago%203.0.x/ws/tobago-3.0.x/tobago-example/tobago-example-demo/src/main/java/org/apache/myfaces/tobago/example/demo/OutController.java>:1:
Missing a header - not enough lines in file.
<https://builds.apache.org/job/Tobago%203.0.x/ws/tobago-3.0.x/tobago-example/tobago-example-demo/src/main/java/org/apache/myfaces/tobago/example/demo/TextareaController.java>:1:
Line does not match expected header line of '/*'.
<https://builds.apache.org/job/Tobago%203.0.x/ws/tobago-3.0.x/tobago-example/tobago-example-demo/src/main/java/org/apache/myfaces/tobago/example/demo/TextareaController.java>:14:
Line is longer than 120 characters.
<https://builds.apache.org/job/Tobago%203.0.x/ws/tobago-3.0.x/tobago-example/tobago-example-demo/src/main/java/org/apache/myfaces/tobago/example/demo/TextareaController.java>:16:
Line is longer than 120 characters.
<https://builds.apache.org/job/Tobago%203.0.x/ws/tobago-3.0.x/tobago-example/tobago-example-demo/src/main/java/org/apache/myfaces/tobago/example/demo/TextareaController.java>:18:
Line is longer than 120 characters.
<https://builds.apache.org/job/Tobago%203.0.x/ws/tobago-3.0.x/tobago-example/tobago-example-demo/src/main/java/org/apache/myfaces/tobago/example/demo/TextareaController.java>:20:
Line is longer than 120 characters.
<https://builds.apache.org/job/Tobago%203.0.x/ws/tobago-3.0.x/tobago-example/tobago-example-demo/src/main/java/org/apache/myfaces/tobago/example/demo/TextareaController.java>:22:
Line is longer than 120 characters.
<https://builds.apache.org/job/Tobago%203.0.x/ws/tobago-3.0.x/tobago-example/tobago-example-demo/src/main/java/org/apache/myfaces/tobago/example/demo/TextareaController.java>:24:
Line is longer than 120 characters.
Audit done.

[INFO] There are 8 checkstyle errors.
[INFO] ------------------------------------------------------------------------
[INFO] Reactor Summary:
[INFO] 
[INFO] Apache Tobago ...................................... SUCCESS [  7.377 s]
[INFO] Tobago Tool ........................................ SUCCESS [  0.961 s]
[INFO] Tobago Tool Annotation ............................. SUCCESS [  4.043 s]
[INFO] Tobago Tool Apt .................................... SUCCESS [  3.362 s]
[INFO] Tobago Maven2 Theme Plugin ......................... SUCCESS [  3.186 s]
[INFO] Tobago Core ........................................ SUCCESS [ 16.625 s]
[INFO] Tobago Themes ...................................... SUCCESS [  1.050 s]
[INFO] Tobago Theme Standard .............................. SUCCESS [ 11.470 s]
[INFO] Tobago Theme Scarborough ........................... SUCCESS [  3.711 s]
[INFO] Tobago Theme Speyside .............................. SUCCESS [ 11.457 s]
[INFO] Tobago Theme Richmond .............................. SUCCESS [  1.833 s]
[INFO] Tobago Theme Charlotteville ........................ SUCCESS [  1.530 s]
[INFO] Tobago Theme Example ............................... SUCCESS [  4.912 s]
[INFO] Tobago Extensions .................................. SUCCESS [  1.631 s]
[INFO] Tobago Deprecation ................................. SUCCESS [  1.495 s]
[INFO] Tobago Sandbox ..................................... SUCCESS [  5.221 s]
[INFO] Tobago Security .................................... SUCCESS [  1.690 s]
[INFO] Tobago Examples .................................... SUCCESS [  1.561 s]
[INFO] Tobago Example Addressbook (Java EE 6) ............. SUCCESS [ 13.280 s]
[INFO] Tobago Example Blank ............................... SUCCESS [  2.436 s]
[INFO] Tobago Example Data ................................ SUCCESS [  2.012 s]
[INFO] Tobago Example Demo ................................ FAILURE [  2.953 s]
[INFO] Tobago Example for Portlets ........................ SKIPPED
[INFO] Tobago Example Security ............................ SKIPPED
[INFO] Tobago Example Test ................................ SKIPPED
[INFO] Tobago Example Assembly ............................ SKIPPED
[INFO] Tobago Assembly .................................... SKIPPED
[INFO] ------------------------------------------------------------------------
[INFO] BUILD FAILURE
[INFO] ------------------------------------------------------------------------
[INFO] Total time: 01:56 min
[INFO] Finished at: 2016-03-16T23:31:21+00:00
[INFO] Final Memory: 103M/888M
[INFO] ------------------------------------------------------------------------
[WARNING] The requested profile "all-modules" could not be activated because it does not exist.
Waiting for Jenkins to finish collecting data
[ERROR] Failed to execute goal org.apache.maven.plugins:maven-checkstyle-plugin:2.9.1:check
(default-cli) on project tobago-example-demo: You have 8 Checkstyle violations. -> [Help
1]
[ERROR] 
[ERROR] To see the full stack trace of the errors, re-run Maven with the -e switch.
[ERROR] Re-run Maven using the -X switch to enable full debug logging.
[ERROR] 
[ERROR] For more information about the errors and possible solutions, please read the following
articles:
[ERROR] [Help 1] http://cwiki.apache.org/confluence/display/MAVEN/MojoFailureException
[ERROR] 
[ERROR] After correcting the problems, you can resume the build with the command
[ERROR]   mvn <goals> -rf :tobago-example-demo
[JENKINS] Archiving <https://builds.apache.org/job/Tobago%203.0.x/ws/tobago-3.0.x/tobago-assembly/pom.xml>
to org.apache.myfaces.tobago/tobago-assembly/3.0.0-alpha-3-SNAPSHOT/tobago-assembly-3.0.0-alpha-3-SNAPSHOT.pom
[JENKINS] Archiving <https://builds.apache.org/job/Tobago%203.0.x/ws/tobago-3.0.x/tobago-extension/tobago-sandbox/pom.xml>
to org.apache.myfaces.tobago/tobago-sandbox/3.0.0-alpha-3-SNAPSHOT/tobago-sandbox-3.0.0-alpha-3-SNAPSHOT.pom
[JENKINS] Archiving <https://builds.apache.org/job/Tobago%203.0.x/ws/tobago-3.0.x/tobago-extension/tobago-sandbox/target/tobago-sandbox-3.0.0-alpha-3-SNAPSHOT.jar>
to org.apache.myfaces.tobago/tobago-sandbox/3.0.0-alpha-3-SNAPSHOT/tobago-sandbox-3.0.0-alpha-3-SNAPSHOT.jar
[JENKINS] Archiving <https://builds.apache.org/job/Tobago%203.0.x/ws/tobago-3.0.x/tobago-theme/tobago-theme-speyside/pom.xml>
to org.apache.myfaces.tobago/tobago-theme-speyside/3.0.0-alpha-3-SNAPSHOT/tobago-theme-speyside-3.0.0-alpha-3-SNAPSHOT.pom
[JENKINS] Archiving <https://builds.apache.org/job/Tobago%203.0.x/ws/tobago-3.0.x/tobago-theme/tobago-theme-speyside/target/tobago-theme-speyside-3.0.0-alpha-3-SNAPSHOT.jar>
to org.apache.myfaces.tobago/tobago-theme-speyside/3.0.0-alpha-3-SNAPSHOT/tobago-theme-speyside-3.0.0-alpha-3-SNAPSHOT.jar
[JENKINS] Archiving <https://builds.apache.org/job/Tobago%203.0.x/ws/tobago-3.0.x/tobago-tool/tobago-theme-plugin/pom.xml>
to org.apache.myfaces.tobago/tobago-theme-plugin/3.0.0-alpha-3-SNAPSHOT/tobago-theme-plugin-3.0.0-alpha-3-SNAPSHOT.pom
[JENKINS] Archiving <https://builds.apache.org/job/Tobago%203.0.x/ws/tobago-3.0.x/tobago-tool/tobago-theme-plugin/target/tobago-theme-plugin-3.0.0-alpha-3-SNAPSHOT.jar>
to org.apache.myfaces.tobago/tobago-theme-plugin/3.0.0-alpha-3-SNAPSHOT/tobago-theme-plugin-3.0.0-alpha-3-SNAPSHOT.jar
[JENKINS] Archiving <https://builds.apache.org/job/Tobago%203.0.x/ws/tobago-3.0.x/tobago-example/tobago-example-data/pom.xml>
to org.apache.myfaces.tobago/tobago-example-data/3.0.0-alpha-3-SNAPSHOT/tobago-example-data-3.0.0-alpha-3-SNAPSHOT.pom
[JENKINS] Archiving <https://builds.apache.org/job/Tobago%203.0.x/ws/tobago-3.0.x/tobago-example/tobago-example-data/target/tobago-example-data-3.0.0-alpha-3-SNAPSHOT.jar>
to org.apache.myfaces.tobago/tobago-example-data/3.0.0-alpha-3-SNAPSHOT/tobago-example-data-3.0.0-alpha-3-SNAPSHOT.jar
[JENKINS] Archiving <https://builds.apache.org/job/Tobago%203.0.x/ws/tobago-3.0.x/tobago-example/tobago-example-portlet/pom.xml>
to org.apache.myfaces.tobago/tobago-example-portlet/3.0.0-alpha-3-SNAPSHOT/tobago-example-portlet-3.0.0-alpha-3-SNAPSHOT.pom
[JENKINS] Archiving <https://builds.apache.org/job/Tobago%203.0.x/ws/tobago-3.0.x/tobago-theme/tobago-theme-example/pom.xml>
to org.apache.myfaces.tobago/tobago-theme-example/3.0.0-alpha-3-SNAPSHOT/tobago-theme-example-3.0.0-alpha-3-SNAPSHOT.pom
[JENKINS] Archiving <https://builds.apache.org/job/Tobago%203.0.x/ws/tobago-3.0.x/tobago-theme/tobago-theme-example/target/tobago-theme-example-3.0.0-alpha-3-SNAPSHOT.jar>
to org.apache.myfaces.tobago/tobago-theme-example/3.0.0-alpha-3-SNAPSHOT/tobago-theme-example-3.0.0-alpha-3-SNAPSHOT.jar
[JENKINS] Archiving <https://builds.apache.org/job/Tobago%203.0.x/ws/tobago-3.0.x/tobago-example/pom.xml>
to org.apache.myfaces.tobago/tobago-example/3.0.0-alpha-3-SNAPSHOT/tobago-example-3.0.0-alpha-3-SNAPSHOT.pom
[JENKINS] Archiving <https://builds.apache.org/job/Tobago%203.0.x/ws/tobago-3.0.x/tobago-core/pom.xml>
to org.apache.myfaces.tobago/tobago-core/3.0.0-alpha-3-SNAPSHOT/tobago-core-3.0.0-alpha-3-SNAPSHOT.pom
[JENKINS] Archiving <https://builds.apache.org/job/Tobago%203.0.x/ws/tobago-3.0.x/tobago-core/target/tobago-core-3.0.0-alpha-3-SNAPSHOT.jar>
to org.apache.myfaces.tobago/tobago-core/3.0.0-alpha-3-SNAPSHOT/tobago-core-3.0.0-alpha-3-SNAPSHOT.jar
[JENKINS] Archiving <https://builds.apache.org/job/Tobago%203.0.x/ws/tobago-3.0.x/tobago-core/target/tobago-core-3.0.0-alpha-3-SNAPSHOT-tests.jar>
to org.apache.myfaces.tobago/tobago-core/3.0.0-alpha-3-SNAPSHOT/tobago-core-3.0.0-alpha-3-SNAPSHOT-tests.jar
[JENKINS] Archiving <https://builds.apache.org/job/Tobago%203.0.x/ws/tobago-3.0.x/tobago-core/target/tobago-core-3.0.0-alpha-3-SNAPSHOT-sources.jar>
to org.apache.myfaces.tobago/tobago-core/3.0.0-alpha-3-SNAPSHOT/tobago-core-3.0.0-alpha-3-SNAPSHOT-sources.jar
[JENKINS] Archiving <https://builds.apache.org/job/Tobago%203.0.x/ws/tobago-3.0.x/tobago-example/tobago-example-blank/pom.xml>
to org.apache.myfaces.tobago/tobago-example-blank/3.0.0-alpha-3-SNAPSHOT/tobago-example-blank-3.0.0-alpha-3-SNAPSHOT.pom
[JENKINS] Archiving <https://builds.apache.org/job/Tobago%203.0.x/ws/tobago-3.0.x/tobago-example/tobago-example-blank/target/tobago-example-blank.war>
to org.apache.myfaces.tobago/tobago-example-blank/3.0.0-alpha-3-SNAPSHOT/tobago-example-blank-3.0.0-alpha-3-SNAPSHOT.war
Compressed 6.76 MB of artifacts by 63.3% relative to #285
[JENKINS] Archiving <https://builds.apache.org/job/Tobago%203.0.x/ws/tobago-3.0.x/tobago-theme/pom.xml>
to org.apache.myfaces.tobago/tobago-theme/3.0.0-alpha-3-SNAPSHOT/tobago-theme-3.0.0-alpha-3-SNAPSHOT.pom
[JENKINS] Archiving <https://builds.apache.org/job/Tobago%203.0.x/ws/tobago-3.0.x/tobago-tool/tobago-tool-annotation/pom.xml>
to org.apache.myfaces.tobago/tobago-tool-annotation/3.0.0-alpha-3-SNAPSHOT/tobago-tool-annotation-3.0.0-alpha-3-SNAPSHOT.pom
[JENKINS] Archiving <https://builds.apache.org/job/Tobago%203.0.x/ws/tobago-3.0.x/tobago-tool/tobago-tool-annotation/target/tobago-tool-annotation-3.0.0-alpha-3-SNAPSHOT.jar>
to org.apache.myfaces.tobago/tobago-tool-annotation/3.0.0-alpha-3-SNAPSHOT/tobago-tool-annotation-3.0.0-alpha-3-SNAPSHOT.jar
[JENKINS] Archiving <https://builds.apache.org/job/Tobago%203.0.x/ws/tobago-3.0.x/tobago-theme/tobago-theme-richmond/pom.xml>
to org.apache.myfaces.tobago/tobago-theme-richmond/3.0.0-alpha-3-SNAPSHOT/tobago-theme-richmond-3.0.0-alpha-3-SNAPSHOT.pom
[JENKINS] Archiving <https://builds.apache.org/job/Tobago%203.0.x/ws/tobago-3.0.x/tobago-theme/tobago-theme-richmond/target/tobago-theme-richmond-3.0.0-alpha-3-SNAPSHOT.jar>
to org.apache.myfaces.tobago/tobago-theme-richmond/3.0.0-alpha-3-SNAPSHOT/tobago-theme-richmond-3.0.0-alpha-3-SNAPSHOT.jar
[JENKINS] Archiving <https://builds.apache.org/job/Tobago%203.0.x/ws/tobago-3.0.x/tobago-theme/tobago-theme-standard/pom.xml>
to org.apache.myfaces.tobago/tobago-theme-standard/3.0.0-alpha-3-SNAPSHOT/tobago-theme-standard-3.0.0-alpha-3-SNAPSHOT.pom
[JENKINS] Archiving <https://builds.apache.org/job/Tobago%203.0.x/ws/tobago-3.0.x/tobago-theme/tobago-theme-standard/target/tobago-theme-standard-3.0.0-alpha-3-SNAPSHOT.jar>
to org.apache.myfaces.tobago/tobago-theme-standard/3.0.0-alpha-3-SNAPSHOT/tobago-theme-standard-3.0.0-alpha-3-SNAPSHOT.jar
Compressed 1.33 MB of artifacts by 28.2% relative to #285
[JENKINS] Archiving <https://builds.apache.org/job/Tobago%203.0.x/ws/tobago-3.0.x/tobago-example/tobago-example-security/pom.xml>
to org.apache.myfaces.tobago/tobago-example-security/3.0.0-alpha-3-SNAPSHOT/tobago-example-security-3.0.0-alpha-3-SNAPSHOT.pom
[JENKINS] Archiving <https://builds.apache.org/job/Tobago%203.0.x/ws/tobago-3.0.x/tobago-example/tobago-example-addressbook/pom.xml>
to org.apache.myfaces.tobago/tobago-example-addressbook/3.0.0-alpha-3-SNAPSHOT/tobago-example-addressbook-3.0.0-alpha-3-SNAPSHOT.pom
[JENKINS] Archiving <https://builds.apache.org/job/Tobago%203.0.x/ws/tobago-3.0.x/tobago-example/tobago-example-addressbook/target/tobago-example-addressbook.war>
to org.apache.myfaces.tobago/tobago-example-addressbook/3.0.0-alpha-3-SNAPSHOT/tobago-example-addressbook-3.0.0-alpha-3-SNAPSHOT.war
Compressed 17.16 MB of artifacts by 80.3% relative to #285
[JENKINS] Archiving <https://builds.apache.org/job/Tobago%203.0.x/ws/tobago-3.0.x/tobago-tool/tobago-tool-apt/pom.xml>
to org.apache.myfaces.tobago/tobago-tool-apt/3.0.0-alpha-3-SNAPSHOT/tobago-tool-apt-3.0.0-alpha-3-SNAPSHOT.pom
[JENKINS] Archiving <https://builds.apache.org/job/Tobago%203.0.x/ws/tobago-3.0.x/tobago-tool/tobago-tool-apt/target/tobago-tool-apt-3.0.0-alpha-3-SNAPSHOT.jar>
to org.apache.myfaces.tobago/tobago-tool-apt/3.0.0-alpha-3-SNAPSHOT/tobago-tool-apt-3.0.0-alpha-3-SNAPSHOT.jar
[JENKINS] Archiving <https://builds.apache.org/job/Tobago%203.0.x/ws/tobago-3.0.x/tobago-tool/pom.xml>
to org.apache.myfaces.tobago/tobago-tool/3.0.0-alpha-3-SNAPSHOT/tobago-tool-3.0.0-alpha-3-SNAPSHOT.pom
[JENKINS] Archiving <https://builds.apache.org/job/Tobago%203.0.x/ws/tobago-3.0.x/tobago-extension/tobago-deprecation/pom.xml>
to org.apache.myfaces.tobago/tobago-deprecation/3.0.0-alpha-3-SNAPSHOT/tobago-deprecation-3.0.0-alpha-3-SNAPSHOT.pom
[JENKINS] Archiving <https://builds.apache.org/job/Tobago%203.0.x/ws/tobago-3.0.x/tobago-extension/tobago-deprecation/target/tobago-deprecation-3.0.0-alpha-3-SNAPSHOT.jar>
to org.apache.myfaces.tobago/tobago-deprecation/3.0.0-alpha-3-SNAPSHOT/tobago-deprecation-3.0.0-alpha-3-SNAPSHOT.jar
[JENKINS] Archiving <https://builds.apache.org/job/Tobago%203.0.x/ws/tobago-3.0.x/tobago-example/tobago-example-demo/pom.xml>
to org.apache.myfaces.tobago/tobago-example-demo/3.0.0-alpha-3-SNAPSHOT/tobago-example-demo-3.0.0-alpha-3-SNAPSHOT.pom
[JENKINS] Archiving <https://builds.apache.org/job/Tobago%203.0.x/ws/tobago-3.0.x/tobago-extension/pom.xml>
to org.apache.myfaces.tobago/tobago-extension/3.0.0-alpha-3-SNAPSHOT/tobago-extension-3.0.0-alpha-3-SNAPSHOT.pom
[JENKINS] Archiving <https://builds.apache.org/job/Tobago%203.0.x/ws/tobago-3.0.x/tobago-theme/tobago-theme-charlotteville/pom.xml>
to org.apache.myfaces.tobago/tobago-theme-charlotteville/3.0.0-alpha-3-SNAPSHOT/tobago-theme-charlotteville-3.0.0-alpha-3-SNAPSHOT.pom
[JENKINS] Archiving <https://builds.apache.org/job/Tobago%203.0.x/ws/tobago-3.0.x/tobago-theme/tobago-theme-charlotteville/target/tobago-theme-charlotteville-3.0.0-alpha-3-SNAPSHOT.jar>
to org.apache.myfaces.tobago/tobago-theme-charlotteville/3.0.0-alpha-3-SNAPSHOT/tobago-theme-charlotteville-3.0.0-alpha-3-SNAPSHOT.jar
[JENKINS] Archiving <https://builds.apache.org/job/Tobago%203.0.x/ws/tobago-3.0.x/tobago-extension/tobago-security/pom.xml>
to org.apache.myfaces.tobago/tobago-security/3.0.0-alpha-3-SNAPSHOT/tobago-security-3.0.0-alpha-3-SNAPSHOT.pom
[JENKINS] Archiving <https://builds.apache.org/job/Tobago%203.0.x/ws/tobago-3.0.x/tobago-extension/tobago-security/target/tobago-security-3.0.0-alpha-3-SNAPSHOT.jar>
to org.apache.myfaces.tobago/tobago-security/3.0.0-alpha-3-SNAPSHOT/tobago-security-3.0.0-alpha-3-SNAPSHOT.jar
[JENKINS] Archiving <https://builds.apache.org/job/Tobago%203.0.x/ws/tobago-3.0.x/tobago-example/tobago-example-assembly/pom.xml>
to org.apache.myfaces.tobago/tobago-example-assembly/3.0.0-alpha-3-SNAPSHOT/tobago-example-assembly-3.0.0-alpha-3-SNAPSHOT.pom
[JENKINS] Archiving <https://builds.apache.org/job/Tobago%203.0.x/ws/tobago-3.0.x/pom.xml>
to org.apache.myfaces.tobago/tobago/3.0.0-alpha-3-SNAPSHOT/tobago-3.0.0-alpha-3-SNAPSHOT.pom
Compressed 46.43 KB of artifacts by 68.9% relative to #285
[JENKINS] Archiving <https://builds.apache.org/job/Tobago%203.0.x/ws/tobago-3.0.x/tobago-example/tobago-example-test/pom.xml>
to org.apache.myfaces.tobago/tobago-example-test/3.0.0-alpha-3-SNAPSHOT/tobago-example-test-3.0.0-alpha-3-SNAPSHOT.pom
[JENKINS] Archiving <https://builds.apache.org/job/Tobago%203.0.x/ws/tobago-3.0.x/tobago-theme/tobago-theme-scarborough/pom.xml>
to org.apache.myfaces.tobago/tobago-theme-scarborough/3.0.0-alpha-3-SNAPSHOT/tobago-theme-scarborough-3.0.0-alpha-3-SNAPSHOT.pom
[JENKINS] Archiving <https://builds.apache.org/job/Tobago%203.0.x/ws/tobago-3.0.x/tobago-theme/tobago-theme-scarborough/target/tobago-theme-scarborough-3.0.0-alpha-3-SNAPSHOT.jar>
to org.apache.myfaces.tobago/tobago-theme-scarborough/3.0.0-alpha-3-SNAPSHOT/tobago-theme-scarborough-3.0.0-alpha-3-SNAPSHOT.jar
Sending e-mails to: commits@myfaces.apache.org
channel stopped
Updating TOBAGO-1544
Updating TOBAGO-1546

Mime
View raw message