myfaces-commits mailing list archives

Site index · List index
Message view « Date » · « Thread »
Top « Date » · « Thread »
From Apache Jenkins Server <jenk...@builds.apache.org>
Subject Build failed in Jenkins: myfaces-current-2.0-integration-tests #2396
Date Tue, 21 Jun 2016 18:12:44 GMT
See <https://builds.apache.org/job/myfaces-current-2.0-integration-tests/2396/>

------------------------------------------
Started by upstream project "myfaces-current-2.0" build number 3267
originally caused by:
 Started by upstream project "maven-jxr" build number 77
 originally caused by:
  Started by an SCM change
[EnvInject] - Loading node environment variables.
Building remotely on beam2 (beam) in workspace <https://builds.apache.org/job/myfaces-current-2.0-integration-tests/ws/>
Checking out a fresh workspace because there's no workspace at <https://builds.apache.org/job/myfaces-current-2.0-integration-tests/ws/>
Cleaning local Directory .
Checking out https://svn.apache.org/repos/asf/myfaces/core/branches/2.0.x/integration-tests
at revision '2016-06-21T18:12:40.007 +0000'
A         servlet25-el22-basic-tests
A         servlet25-el22-basic-tests/src
A         servlet25-el22-basic-tests/src/test
A         servlet25-el22-basic-tests/src/test/java
A         servlet25-el22-basic-tests/src/test/java/org
A         servlet25-el22-basic-tests/src/test/java/org/apache
A         servlet25-el22-basic-tests/src/test/java/org/apache/myfaces
A         servlet25-el22-basic-tests/src/test/java/org/apache/myfaces/integrationtest
AU        servlet25-el22-basic-tests/src/test/java/org/apache/myfaces/integrationtest/FormInputTest.java
A         servlet25-el22-basic-tests/src/main
A         servlet25-el22-basic-tests/src/main/java
A         servlet25-el22-basic-tests/src/main/java/org
A         servlet25-el22-basic-tests/src/main/java/org/apache
A         servlet25-el22-basic-tests/src/main/java/org/apache/myfaces
A         servlet25-el22-basic-tests/src/main/java/org/apache/myfaces/integrationtest
AU        servlet25-el22-basic-tests/src/main/java/org/apache/myfaces/integrationtest/FormInputBean.java
A         servlet25-el22-basic-tests/src/main/resources
A         servlet25-el22-basic-tests/src/main/webapp
A         servlet25-el22-basic-tests/src/main/webapp/WEB-INF
AU        servlet25-el22-basic-tests/src/main/webapp/WEB-INF/web.xml
A         servlet25-el22-basic-tests/src/main/webapp/pages
A         servlet25-el22-basic-tests/src/main/webapp/pages/formInput
A         servlet25-el22-basic-tests/src/main/webapp/pages/formInput/index.xhtml
A         servlet25-el22-basic-tests/src/main/webapp/pages/formInput/result.xhtml
AU        servlet25-el22-basic-tests/pom.xml
A         servlet30-el22-basic-tests
A         servlet30-el22-basic-tests/src
A         servlet30-el22-basic-tests/src/main
A         servlet30-el22-basic-tests/src/main/resources
A         servlet30-el22-basic-tests/src/main/webapp
A         servlet30-el22-basic-tests/src/main/webapp/WEB-INF
AU        servlet30-el22-basic-tests/src/main/webapp/WEB-INF/web.xml
A         servlet30-el22-basic-tests/src/main/webapp/pages
A         servlet30-el22-basic-tests/src/main/webapp/pages/formInput
A         servlet30-el22-basic-tests/src/main/webapp/pages/formInput/result.xhtml
A         servlet30-el22-basic-tests/src/main/webapp/pages/formInput/index.xhtml
A         servlet30-el22-basic-tests/src/main/java
A         servlet30-el22-basic-tests/src/main/java/org
A         servlet30-el22-basic-tests/src/main/java/org/apache
A         servlet30-el22-basic-tests/src/main/java/org/apache/myfaces
A         servlet30-el22-basic-tests/src/main/java/org/apache/myfaces/integrationtest
AU        servlet30-el22-basic-tests/src/main/java/org/apache/myfaces/integrationtest/FormInputBean.java
A         servlet30-el22-basic-tests/src/test
A         servlet30-el22-basic-tests/src/test/java
A         servlet30-el22-basic-tests/src/test/java/org
A         servlet30-el22-basic-tests/src/test/java/org/apache
A         servlet30-el22-basic-tests/src/test/java/org/apache/myfaces
A         servlet30-el22-basic-tests/src/test/java/org/apache/myfaces/integrationtest
AU        servlet30-el22-basic-tests/src/test/java/org/apache/myfaces/integrationtest/FormInputTest.java
AU        servlet30-el22-basic-tests/pom.xml
A         servlet25-el10-basic-tests
A         servlet25-el10-basic-tests/src
A         servlet25-el10-basic-tests/src/test
A         servlet25-el10-basic-tests/src/test/java
A         servlet25-el10-basic-tests/src/test/java/org
A         servlet25-el10-basic-tests/src/test/java/org/apache
A         servlet25-el10-basic-tests/src/test/java/org/apache/myfaces
A         servlet25-el10-basic-tests/src/test/java/org/apache/myfaces/integrationtest
AU        servlet25-el10-basic-tests/src/test/java/org/apache/myfaces/integrationtest/FormInputTest.java
A         servlet25-el10-basic-tests/src/main
A         servlet25-el10-basic-tests/src/main/webapp
A         servlet25-el10-basic-tests/src/main/webapp/pages
A         servlet25-el10-basic-tests/src/main/webapp/pages/formInput
A         servlet25-el10-basic-tests/src/main/webapp/pages/formInput/index.xhtml
A         servlet25-el10-basic-tests/src/main/webapp/pages/formInput/result.xhtml
A         servlet25-el10-basic-tests/src/main/webapp/WEB-INF
AU        servlet25-el10-basic-tests/src/main/webapp/WEB-INF/web.xml
A         servlet25-el10-basic-tests/src/main/java
A         servlet25-el10-basic-tests/src/main/java/org
A         servlet25-el10-basic-tests/src/main/java/org/apache
A         servlet25-el10-basic-tests/src/main/java/org/apache/myfaces
A         servlet25-el10-basic-tests/src/main/java/org/apache/myfaces/integrationtest
AU        servlet25-el10-basic-tests/src/main/java/org/apache/myfaces/integrationtest/FormInputBean.java
A         servlet25-el10-basic-tests/src/main/resources
AU        servlet25-el10-basic-tests/pom.xml
A         integration-test-support
A         integration-test-support/src
A         integration-test-support/src/main
A         integration-test-support/src/main/java
A         integration-test-support/src/main/java/org
A         integration-test-support/src/main/java/org/apache
A         integration-test-support/src/main/java/org/apache/myfaces
A         integration-test-support/src/main/java/org/apache/myfaces/integrationtest
A         integration-test-support/src/main/java/org/apache/myfaces/integrationtest/support
AU        integration-test-support/src/main/java/org/apache/myfaces/integrationtest/support/MyFacesIntegrationTest.java
AU        integration-test-support/pom.xml
AU        pom.xml
 U        .
At revision 1749582

No changes for https://svn.apache.org/repos/asf/myfaces/core/branches/2.0.x/integration-tests
since the previous build
Parsing POMs
ERROR: Failed to parse POMs
java.io.IOException: remote file operation failed: <https://builds.apache.org/job/myfaces-current-2.0-integration-tests/ws/>
at hudson.remoting.Channel@184924b4:beam2: hudson.remoting.ProxyException: hudson.maven.MavenModuleSetBuild$MavenExecutionException:
org.apache.maven.project.ProjectBuildingException: Some problems were encountered while processing
the POMs:
[FATAL] Non-resolvable parent POM: Could not find artifact org.apache.myfaces.core:myfaces-core-project:pom:2.0.15-SNAPSHOT
and 'parent.relativePath' points at wrong local POM @ line 20, column 13

	at hudson.FilePath.act(FilePath.java:986)
	at hudson.FilePath.act(FilePath.java:968)
	at hudson.maven.MavenModuleSetBuild$MavenModuleSetBuildExecution.parsePoms(MavenModuleSetBuild.java:960)
	at hudson.maven.MavenModuleSetBuild$MavenModuleSetBuildExecution.doRun(MavenModuleSetBuild.java:679)
	at hudson.model.AbstractBuild$AbstractBuildExecution.run(AbstractBuild.java:534)
	at hudson.model.Run.execute(Run.java:1738)
	at hudson.maven.MavenModuleSetBuild.run(MavenModuleSetBuild.java:531)
	at hudson.model.ResourceController.execute(ResourceController.java:98)
	at hudson.model.Executor.run(Executor.java:410)
Caused by: hudson.remoting.ProxyException: hudson.maven.MavenModuleSetBuild$MavenExecutionException:
org.apache.maven.project.ProjectBuildingException: Some problems were encountered while processing
the POMs:
[FATAL] Non-resolvable parent POM: Could not find artifact org.apache.myfaces.core:myfaces-core-project:pom:2.0.15-SNAPSHOT
and 'parent.relativePath' points at wrong local POM @ line 20, column 13

	at hudson.maven.MavenModuleSetBuild$PomParser.invoke(MavenModuleSetBuild.java:1364)
	at hudson.maven.MavenModuleSetBuild$PomParser.invoke(MavenModuleSetBuild.java:1098)
	at hudson.FilePath$FileCallableWrapper.call(FilePath.java:2719)
	at hudson.remoting.UserRequest.perform(UserRequest.java:120)
	at hudson.remoting.UserRequest.perform(UserRequest.java:48)
	at hudson.remoting.Request$2.run(Request.java:326)
	at hudson.remoting.InterceptingExecutorService$1.call(InterceptingExecutorService.java:68)
	at java.util.concurrent.FutureTask.run(FutureTask.java:262)
	at java.util.concurrent.ThreadPoolExecutor.runWorker(ThreadPoolExecutor.java:1145)
	at java.util.concurrent.ThreadPoolExecutor$Worker.run(ThreadPoolExecutor.java:615)
	at java.lang.Thread.run(Thread.java:745)
	at ......remote call to beam2(Native Method)
	at hudson.remoting.Channel.attachCallSiteStackTrace(Channel.java:1416)
	at hudson.remoting.UserResponse.retrieve(UserRequest.java:220)
	at hudson.remoting.Channel.call(Channel.java:781)
	at hudson.FilePath.act(FilePath.java:979)
	... 8 more
Caused by: hudson.remoting.ProxyException: org.apache.maven.project.ProjectBuildingException:
Some problems were encountered while processing the POMs:
[FATAL] Non-resolvable parent POM: Could not find artifact org.apache.myfaces.core:myfaces-core-project:pom:2.0.15-SNAPSHOT
and 'parent.relativePath' points at wrong local POM @ line 20, column 13

	at org.apache.maven.project.DefaultProjectBuilder.build(DefaultProjectBuilder.java:364)
	at hudson.maven.MavenEmbedder.buildProjects(MavenEmbedder.java:361)
	at hudson.maven.MavenEmbedder.readProjects(MavenEmbedder.java:331)
	at hudson.maven.MavenModuleSetBuild$PomParser.invoke(MavenModuleSetBuild.java:1301)
	at hudson.maven.MavenModuleSetBuild$PomParser.invoke(MavenModuleSetBuild.java:1098)
	at hudson.FilePath$FileCallableWrapper.call(FilePath.java:2719)
	at hudson.remoting.UserRequest.perform(UserRequest.java:120)
	at hudson.remoting.UserRequest.perform(UserRequest.java:48)
	at hudson.remoting.Request$2.run(Request.java:326)
	at hudson.remoting.InterceptingExecutorService$1.call(InterceptingExecutorService.java:68)
	at java.util.concurrent.FutureTask.run(FutureTask.java:262)
	at java.util.concurrent.ThreadPoolExecutor.runWorker(ThreadPoolExecutor.java:1145)
	at java.util.concurrent.ThreadPoolExecutor$Worker.run(ThreadPoolExecutor.java:615)
	at java.lang.Thread.run(Thread.java:745)

Mime
View raw message