myfaces-commits mailing list archives

Site index · List index
Message view « Date » · « Thread »
Top « Date » · « Thread »
From Apache Jenkins Server <jenk...@builds.apache.org>
Subject Build failed in Jenkins: Tobago 3.0.x #417
Date Wed, 06 Jul 2016 16:20:01 GMT
See <https://builds.apache.org/job/Tobago%203.0.x/417/changes>

Changes:

[lofwyr] TOBAGO-1531: Extend functinallity of <tc:flexLayout>

------------------------------------------
[...truncated 4228 lines...]
2016-07-06 16:19:41,428 [main            ] INFO  o.a.m.tobago.internal.config.TobagoConfigParser
  :parse               :110  [] Parsing configuration file: '<https://builds.apache.org/job/Tobago%203.0.x/ws/tobago-3.0.x/tobago-core/target/test-classes/tobago-config-for-unit-tests.xml'>
2016-07-06 16:19:41,432 [main            ] INFO  o.a.m.tobago.internal.config.TobagoConfigSorter
  :sort                :60   [] Order of the Tobago config files:
2016-07-06 16:19:41,432 [main            ] INFO  o.a.m.tobago.internal.config.TobagoConfigSorter
  :sort                :68   [] name=<unnamed> url='null'
2016-07-06 16:19:41,432 [main            ] WARN  org.apache.myfaces.tobago.sanitizer.JsoupSanitizer:setProperties
      :80   [] Using whitelist 'relaxed' for sanitizing!
2016-07-06 16:19:41,432 [main            ] INFO  o.a.m.tobago.internal.config.TobagoConfigImpl
    :addResourceDir      :212  [] adding resourceDir = 'null'
2016-07-06 16:19:41,432 [main            ] INFO  o.a.m.tobago.internal.config.TobagoConfigImpl
    :resolveThemes       :153  [] Using default Theme one
2016-07-06 16:19:41,433 [main            ] INFO  o.a.m.tobago.internal.config.TobagoConfigImpl
    :initProjectState    :286  [] Couldn't discover the current project stage, using Production
2016-07-06 16:19:41,433 [main            ] DEBUG org.apache.myfaces.tobago.context.ClientProperties:<init>
             :76   [] userAgent='null' from header 'User-Agent: null'
2016-07-06 16:19:41,433 [main            ] DEBUG o.a.m.tobago.internal.config.TobagoConfigImpl
    :getTheme            :183  [] searching theme: null
2016-07-06 16:19:41,433 [main            ] DEBUG org.apache.myfaces.tobago.context.ClientProperties:<init>
             :85   [] theme='one' from requestParameter tobago.theme='null'
2016-07-06 16:19:41,433 [main            ] DEBUG o.a.m.tobago.internal.context.ResourceLocator
    :locateResourcesInWar:99   [] Skipping empty resource path: path='/'
2016-07-06 16:19:41,433 [main            ] INFO  o.a.m.tobago.internal.context.ResourceLocator
    :sourcesFromClasspath:143  [] Searching for and 'META-INF/tobago-config.xml'
2016-07-06 16:19:41,434 [main            ] INFO  o.a.m.tobago.internal.context.ResourceLocator
    :ourcesServlet30Alike:182  [] Searching for 'META-INF/resources'
2016-07-06 16:19:41,434 [main            ] INFO  o.a.m.tobago.internal.context.ResourceLocator
    :ourcesServlet30Alike:190  [] resourcesUrl='jar:file:/home/jenkins/jenkins-slave/maven-repositories/2/org/apache/myfaces/core/myfaces-api/2.0.23/myfaces-api-2.0.23.jar!/META-INF/resources'
2016-07-06 16:19:41,434 [main            ] INFO  o.a.m.tobago.internal.context.ResourceLocator
    :ourcesServlet30Alike:192  [] skip ...
2016-07-06 16:19:41,435 [main            ] INFO  o.a.m.tobago.internal.config.TobagoConfigParser
  :parse               :110  [] Parsing configuration file: '<https://builds.apache.org/job/Tobago%203.0.x/ws/tobago-3.0.x/tobago-core/target/test-classes/tobago-config-for-unit-tests.xml'>
2016-07-06 16:19:41,438 [main            ] INFO  o.a.m.tobago.internal.config.TobagoConfigSorter
  :sort                :60   [] Order of the Tobago config files:
2016-07-06 16:19:41,438 [main            ] INFO  o.a.m.tobago.internal.config.TobagoConfigSorter
  :sort                :68   [] name=<unnamed> url='null'
2016-07-06 16:19:41,438 [main            ] WARN  org.apache.myfaces.tobago.sanitizer.JsoupSanitizer:setProperties
      :80   [] Using whitelist 'relaxed' for sanitizing!
2016-07-06 16:19:41,438 [main            ] INFO  o.a.m.tobago.internal.config.TobagoConfigImpl
    :addResourceDir      :212  [] adding resourceDir = 'null'
2016-07-06 16:19:41,438 [main            ] INFO  o.a.m.tobago.internal.config.TobagoConfigImpl
    :resolveThemes       :153  [] Using default Theme one
2016-07-06 16:19:41,439 [main            ] INFO  o.a.m.tobago.internal.config.TobagoConfigImpl
    :initProjectState    :286  [] Couldn't discover the current project stage, using Production
2016-07-06 16:19:41,439 [main            ] DEBUG org.apache.myfaces.tobago.context.ClientProperties:<init>
             :76   [] userAgent='null' from header 'User-Agent: null'
2016-07-06 16:19:41,439 [main            ] DEBUG o.a.m.tobago.internal.config.TobagoConfigImpl
    :getTheme            :183  [] searching theme: null
2016-07-06 16:19:41,439 [main            ] DEBUG org.apache.myfaces.tobago.context.ClientProperties:<init>
             :85   [] theme='one' from requestParameter tobago.theme='null'
2016-07-06 16:19:41,439 [main            ] DEBUG o.a.m.tobago.internal.context.ResourceLocator
    :locateResourcesInWar:99   [] Skipping empty resource path: path='/'
2016-07-06 16:19:41,439 [main            ] INFO  o.a.m.tobago.internal.context.ResourceLocator
    :sourcesFromClasspath:143  [] Searching for and 'META-INF/tobago-config.xml'
2016-07-06 16:19:41,440 [main            ] INFO  o.a.m.tobago.internal.context.ResourceLocator
    :ourcesServlet30Alike:182  [] Searching for 'META-INF/resources'
2016-07-06 16:19:41,440 [main            ] INFO  o.a.m.tobago.internal.context.ResourceLocator
    :ourcesServlet30Alike:190  [] resourcesUrl='jar:file:/home/jenkins/jenkins-slave/maven-repositories/2/org/apache/myfaces/core/myfaces-api/2.0.23/myfaces-api-2.0.23.jar!/META-INF/resources'
2016-07-06 16:19:41,440 [main            ] INFO  o.a.m.tobago.internal.context.ResourceLocator
    :ourcesServlet30Alike:192  [] skip ...
Tests run: 18, Failures: 0, Errors: 0, Skipped: 0, Time elapsed: 0.135 sec - in org.apache.myfaces.tobago.component.UISheetUnitTest
Running org.apache.myfaces.tobago.context.ResourceUtilsUnitTest
Tests run: 2, Failures: 0, Errors: 0, Skipped: 0, Time elapsed: 0 sec - in org.apache.myfaces.tobago.context.ResourceUtilsUnitTest
Running org.apache.myfaces.tobago.context.UserAgentUnitTest
Tests run: 31, Failures: 0, Errors: 0, Skipped: 0, Time elapsed: 0.014 sec - in org.apache.myfaces.tobago.context.UserAgentUnitTest
Running org.apache.myfaces.tobago.context.MarkupUnitTest
Tests run: 8, Failures: 0, Errors: 0, Skipped: 0, Time elapsed: 0.004 sec - in org.apache.myfaces.tobago.context.MarkupUnitTest
Running org.apache.myfaces.tobago.util.ComponentUtilsUnitTest
2016-07-06 16:19:41,464 [main            ] INFO  o.a.m.tobago.internal.config.TobagoConfigParser
  :parse               :110  [] Parsing configuration file: '<https://builds.apache.org/job/Tobago%203.0.x/ws/tobago-3.0.x/tobago-core/target/test-classes/tobago-config-for-unit-tests.xml'>
2016-07-06 16:19:41,468 [main            ] INFO  o.a.m.tobago.internal.config.TobagoConfigSorter
  :sort                :60   [] Order of the Tobago config files:
2016-07-06 16:19:41,468 [main            ] INFO  o.a.m.tobago.internal.config.TobagoConfigSorter
  :sort                :68   [] name=<unnamed> url='null'
2016-07-06 16:19:41,468 [main            ] WARN  org.apache.myfaces.tobago.sanitizer.JsoupSanitizer:setProperties
      :80   [] Using whitelist 'relaxed' for sanitizing!
2016-07-06 16:19:41,468 [main            ] INFO  o.a.m.tobago.internal.config.TobagoConfigImpl
    :addResourceDir      :212  [] adding resourceDir = 'null'
2016-07-06 16:19:41,468 [main            ] INFO  o.a.m.tobago.internal.config.TobagoConfigImpl
    :resolveThemes       :153  [] Using default Theme one
2016-07-06 16:19:41,469 [main            ] INFO  o.a.m.tobago.internal.config.TobagoConfigImpl
    :initProjectState    :286  [] Couldn't discover the current project stage, using Production
2016-07-06 16:19:41,469 [main            ] DEBUG org.apache.myfaces.tobago.context.ClientProperties:<init>
             :76   [] userAgent='null' from header 'User-Agent: null'
2016-07-06 16:19:41,469 [main            ] DEBUG o.a.m.tobago.internal.config.TobagoConfigImpl
    :getTheme            :183  [] searching theme: null
2016-07-06 16:19:41,469 [main            ] DEBUG org.apache.myfaces.tobago.context.ClientProperties:<init>
             :85   [] theme='one' from requestParameter tobago.theme='null'
2016-07-06 16:19:41,469 [main            ] DEBUG o.a.m.tobago.internal.context.ResourceLocator
    :locateResourcesInWar:99   [] Skipping empty resource path: path='/'
2016-07-06 16:19:41,469 [main            ] INFO  o.a.m.tobago.internal.context.ResourceLocator
    :sourcesFromClasspath:143  [] Searching for and 'META-INF/tobago-config.xml'
2016-07-06 16:19:41,469 [main            ] INFO  o.a.m.tobago.internal.context.ResourceLocator
    :ourcesServlet30Alike:182  [] Searching for 'META-INF/resources'
2016-07-06 16:19:41,470 [main            ] INFO  o.a.m.tobago.internal.context.ResourceLocator
    :ourcesServlet30Alike:190  [] resourcesUrl='jar:file:/home/jenkins/jenkins-slave/maven-repositories/2/org/apache/myfaces/core/myfaces-api/2.0.23/myfaces-api-2.0.23.jar!/META-INF/resources'
2016-07-06 16:19:41,470 [main            ] INFO  o.a.m.tobago.internal.context.ResourceLocator
    :ourcesServlet30Alike:192  [] skip ...
2016-07-06 16:19:41,471 [main            ] INFO  o.a.m.tobago.internal.config.TobagoConfigParser
  :parse               :110  [] Parsing configuration file: '<https://builds.apache.org/job/Tobago%203.0.x/ws/tobago-3.0.x/tobago-core/target/test-classes/tobago-config-for-unit-tests.xml'>
2016-07-06 16:19:41,474 [main            ] INFO  o.a.m.tobago.internal.config.TobagoConfigSorter
  :sort                :60   [] Order of the Tobago config files:
2016-07-06 16:19:41,474 [main            ] INFO  o.a.m.tobago.internal.config.TobagoConfigSorter
  :sort                :68   [] name=<unnamed> url='null'
2016-07-06 16:19:41,475 [main            ] WARN  org.apache.myfaces.tobago.sanitizer.JsoupSanitizer:setProperties
      :80   [] Using whitelist 'relaxed' for sanitizing!
2016-07-06 16:19:41,475 [main            ] INFO  o.a.m.tobago.internal.config.TobagoConfigImpl
    :addResourceDir      :212  [] adding resourceDir = 'null'
2016-07-06 16:19:41,475 [main            ] INFO  o.a.m.tobago.internal.config.TobagoConfigImpl
    :resolveThemes       :153  [] Using default Theme one
2016-07-06 16:19:41,475 [main            ] INFO  o.a.m.tobago.internal.config.TobagoConfigImpl
    :initProjectState    :286  [] Couldn't discover the current project stage, using Production
2016-07-06 16:19:41,475 [main            ] DEBUG org.apache.myfaces.tobago.context.ClientProperties:<init>
             :76   [] userAgent='null' from header 'User-Agent: null'
2016-07-06 16:19:41,475 [main            ] DEBUG o.a.m.tobago.internal.config.TobagoConfigImpl
    :getTheme            :183  [] searching theme: null
2016-07-06 16:19:41,476 [main            ] DEBUG org.apache.myfaces.tobago.context.ClientProperties:<init>
             :85   [] theme='one' from requestParameter tobago.theme='null'
2016-07-06 16:19:41,476 [main            ] DEBUG o.a.m.tobago.internal.context.ResourceLocator
    :locateResourcesInWar:99   [] Skipping empty resource path: path='/'
2016-07-06 16:19:41,476 [main            ] INFO  o.a.m.tobago.internal.context.ResourceLocator
    :sourcesFromClasspath:143  [] Searching for and 'META-INF/tobago-config.xml'
2016-07-06 16:19:41,476 [main            ] INFO  o.a.m.tobago.internal.context.ResourceLocator
    :ourcesServlet30Alike:182  [] Searching for 'META-INF/resources'
2016-07-06 16:19:41,476 [main            ] INFO  o.a.m.tobago.internal.context.ResourceLocator
    :ourcesServlet30Alike:190  [] resourcesUrl='jar:file:/home/jenkins/jenkins-slave/maven-repositories/2/org/apache/myfaces/core/myfaces-api/2.0.23/myfaces-api-2.0.23.jar!/META-INF/resources'
2016-07-06 16:19:41,476 [main            ] INFO  o.a.m.tobago.internal.context.ResourceLocator
    :ourcesServlet30Alike:192  [] skip ...
Tests run: 2, Failures: 0, Errors: 0, Skipped: 0, Time elapsed: 0.013 sec - in org.apache.myfaces.tobago.util.ComponentUtilsUnitTest
Running org.apache.myfaces.tobago.util.LocaleUtilsUnitTest
Tests run: 3, Failures: 0, Errors: 0, Skipped: 0, Time elapsed: 0 sec - in org.apache.myfaces.tobago.util.LocaleUtilsUnitTest
Running org.apache.myfaces.tobago.util.HtmlWriterUtilsUnitTest
Tests run: 2, Failures: 0, Errors: 0, Skipped: 0, Time elapsed: 0 sec - in org.apache.myfaces.tobago.util.HtmlWriterUtilsUnitTest
Running org.apache.myfaces.tobago.util.RangeParserUnitTest
Tests run: 1, Failures: 0, Errors: 0, Skipped: 0, Time elapsed: 0 sec - in org.apache.myfaces.tobago.util.RangeParserUnitTest
Running org.apache.myfaces.tobago.util.FacetUtilsUnitTest
Tests run: 2, Failures: 0, Errors: 0, Skipped: 0, Time elapsed: 0.001 sec - in org.apache.myfaces.tobago.util.FacetUtilsUnitTest
Running org.apache.myfaces.tobago.util.JavascriptWriterUtilsTest
Tests run: 1, Failures: 0, Errors: 0, Skipped: 0, Time elapsed: 0 sec - in org.apache.myfaces.tobago.util.JavascriptWriterUtilsTest

Results :

Tests run: 180, Failures: 0, Errors: 0, Skipped: 0

[JENKINS] Recording test results
[INFO] 
[INFO] --- maven-jar-plugin:2.6:jar (default-jar) @ tobago-core ---
[INFO] Building jar: <https://builds.apache.org/job/Tobago%203.0.x/ws/tobago-3.0.x/tobago-core/target/tobago-core-3.0.0-alpha-4-SNAPSHOT.jar>
[INFO] 
[INFO] --- maven-site-plugin:3.5.1:attach-descriptor (attach-descriptor) @ tobago-core ---
[INFO] 
[INFO] --- maven-jar-plugin:2.6:test-jar (test-jar) @ tobago-core ---
[INFO] Building jar: <https://builds.apache.org/job/Tobago%203.0.x/ws/tobago-3.0.x/tobago-core/target/tobago-core-3.0.0-alpha-4-SNAPSHOT-tests.jar>
[INFO] 
[INFO] --- maven-jar-plugin:2.6:jar (default) @ tobago-core ---
[INFO] 
[INFO] >>> maven-source-plugin:2.4:jar (attach-source) > generate-sources @ tobago-core
>>>
[INFO] 
[INFO] --- maven-enforcer-plugin:1.4.1:enforce (enforce) @ tobago-core ---
[WARNING] Failed to getClass for org.apache.maven.plugin.source.SourceJarMojo
[INFO] 
[INFO] <<< maven-source-plugin:2.4:jar (attach-source) < generate-sources @ tobago-core
<<<
[INFO] 
[INFO] --- maven-source-plugin:2.4:jar (attach-source) @ tobago-core ---
[INFO] Building jar: <https://builds.apache.org/job/Tobago%203.0.x/ws/tobago-3.0.x/tobago-core/target/tobago-core-3.0.0-alpha-4-SNAPSHOT-sources.jar>
[INFO] 
[INFO] --- maven-install-plugin:2.5.2:install (default-install) @ tobago-core ---
[INFO] Installing <https://builds.apache.org/job/Tobago%203.0.x/ws/tobago-3.0.x/tobago-core/target/tobago-core-3.0.0-alpha-4-SNAPSHOT.jar>
to /home/jenkins/jenkins-slave/maven-repositories/2/org/apache/myfaces/tobago/tobago-core/3.0.0-alpha-4-SNAPSHOT/tobago-core-3.0.0-alpha-4-SNAPSHOT.jar
[INFO] Installing <https://builds.apache.org/job/Tobago%203.0.x/ws/tobago-3.0.x/tobago-core/pom.xml>
to /home/jenkins/jenkins-slave/maven-repositories/2/org/apache/myfaces/tobago/tobago-core/3.0.0-alpha-4-SNAPSHOT/tobago-core-3.0.0-alpha-4-SNAPSHOT.pom
[INFO] Installing <https://builds.apache.org/job/Tobago%203.0.x/ws/tobago-3.0.x/tobago-core/target/tobago-core-3.0.0-alpha-4-SNAPSHOT-tests.jar>
to /home/jenkins/jenkins-slave/maven-repositories/2/org/apache/myfaces/tobago/tobago-core/3.0.0-alpha-4-SNAPSHOT/tobago-core-3.0.0-alpha-4-SNAPSHOT-tests.jar
[INFO] Installing <https://builds.apache.org/job/Tobago%203.0.x/ws/tobago-3.0.x/tobago-core/target/tobago-core-3.0.0-alpha-4-SNAPSHOT-sources.jar>
to /home/jenkins/jenkins-slave/maven-repositories/2/org/apache/myfaces/tobago/tobago-core/3.0.0-alpha-4-SNAPSHOT/tobago-core-3.0.0-alpha-4-SNAPSHOT-sources.jar
[INFO]                                                                         
[INFO] ------------------------------------------------------------------------
[INFO] Building Tobago Themes 3.0.0-alpha-4-SNAPSHOT
[INFO] ------------------------------------------------------------------------
[INFO] 
[INFO] --- maven-clean-plugin:2.6.1:clean (default-clean) @ tobago-theme ---
[INFO] 
[INFO] --- animal-sniffer-maven-plugin:1.14:check (default-cli) @ tobago-theme ---
[INFO] Checking unresolved references to org.codehaus.mojo.signature:java16:1.1
[INFO] 
[INFO] --- maven-checkstyle-plugin:2.9.1:check (default-cli) @ tobago-theme ---
[INFO] Starting audit...
Audit done.

[INFO] 
[INFO] --- maven-enforcer-plugin:1.4.1:enforce (enforce) @ tobago-theme ---
[INFO] 
[INFO] --- maven-remote-resources-plugin:1.5:process (default) @ tobago-theme ---
[INFO] 
[INFO] --- tobago-theme-plugin:3.0.0-alpha-4-SNAPSHOT:index (default) @ tobago-theme ---
[INFO] Not creating tobago-resource-index.txt as the project is a pom package
[INFO] 
[INFO] --- maven-site-plugin:3.5.1:attach-descriptor (attach-descriptor) @ tobago-theme ---
[INFO] 
[INFO] --- maven-install-plugin:2.5.2:install (default-install) @ tobago-theme ---
[INFO] Installing <https://builds.apache.org/job/Tobago%203.0.x/ws/tobago-3.0.x/tobago-theme/pom.xml>
to /home/jenkins/jenkins-slave/maven-repositories/2/org/apache/myfaces/tobago/tobago-theme/3.0.0-alpha-4-SNAPSHOT/tobago-theme-3.0.0-alpha-4-SNAPSHOT.pom
[INFO]                                                                         
[INFO] ------------------------------------------------------------------------
[INFO] Building Tobago Theme Standard 3.0.0-alpha-4-SNAPSHOT
[INFO] ------------------------------------------------------------------------
[INFO] 
[INFO] --- maven-clean-plugin:2.6.1:clean (default-clean) @ tobago-theme-standard ---
[INFO] 
[INFO] --- animal-sniffer-maven-plugin:1.14:check (default-cli) @ tobago-theme-standard ---
[INFO] Checking unresolved references to org.codehaus.mojo.signature:java16:1.1
[INFO] 
[INFO] --- maven-checkstyle-plugin:2.9.1:check (default-cli) @ tobago-theme-standard ---
[INFO] Starting audit...
<https://builds.apache.org/job/Tobago%203.0.x/ws/tobago-3.0.x/tobago-theme/tobago-theme-standard/src/main/java/org/apache/myfaces/tobago/renderkit/html/standard/standard/tag/DateRenderer.java>:35:8:
Unused import - org.apache.myfaces.tobago.renderkit.html.util.HtmlRendererUtils.
<https://builds.apache.org/job/Tobago%203.0.x/ws/tobago-3.0.x/tobago-theme/tobago-theme-standard/src/main/java/org/apache/myfaces/tobago/renderkit/html/standard/standard/tag/CommandRenderer.java>:24:8:
Unused import - org.apache.myfaces.tobago.renderkit.html.util.HtmlRendererUtils.
<https://builds.apache.org/job/Tobago%203.0.x/ws/tobago-3.0.x/tobago-theme/tobago-theme-standard/src/main/java/org/apache/myfaces/tobago/renderkit/html/standard/standard/tag/SegmentLayoutRenderer.java>:32:8:
Unused import - org.apache.myfaces.tobago.renderkit.html.util.HtmlRendererUtils.
<https://builds.apache.org/job/Tobago%203.0.x/ws/tobago-3.0.x/tobago-theme/tobago-theme-standard/src/main/java/org/apache/myfaces/tobago/renderkit/html/standard/standard/tag/MenuSeparatorRenderer.java>:25:8:
Unused import - org.apache.myfaces.tobago.renderkit.html.util.HtmlRendererUtils.
<https://builds.apache.org/job/Tobago%203.0.x/ws/tobago-3.0.x/tobago-theme/tobago-theme-standard/src/main/java/org/apache/myfaces/tobago/renderkit/html/standard/standard/tag/FlexLayoutRenderer.java>:29:8:
Unused import - org.apache.myfaces.tobago.renderkit.html.util.HtmlRendererUtils.
<https://builds.apache.org/job/Tobago%203.0.x/ws/tobago-3.0.x/tobago-theme/tobago-theme-standard/src/main/java/org/apache/myfaces/tobago/renderkit/html/standard/standard/tag/SeparatorRenderer.java>:28:8:
Unused import - org.apache.myfaces.tobago.renderkit.html.util.HtmlRendererUtils.
<https://builds.apache.org/job/Tobago%203.0.x/ws/tobago-3.0.x/tobago-theme/tobago-theme-standard/src/main/java/org/apache/myfaces/tobago/renderkit/html/standard/standard/tag/CalendarRenderer.java>:25:8:
Unused import - org.apache.myfaces.tobago.renderkit.html.util.HtmlRendererUtils.
<https://builds.apache.org/job/Tobago%203.0.x/ws/tobago-3.0.x/tobago-theme/tobago-theme-standard/src/main/java/org/apache/myfaces/tobago/renderkit/html/standard/standard/tag/SuggestRenderer.java>:34:8:
Unused import - org.apache.myfaces.tobago.renderkit.html.util.HtmlRendererUtils.
<https://builds.apache.org/job/Tobago%203.0.x/ws/tobago-3.0.x/tobago-theme/tobago-theme-standard/src/main/java/org/apache/myfaces/tobago/renderkit/html/standard/standard/tag/CommandsRenderer.java>:27:8:
Unused import - org.apache.myfaces.tobago.renderkit.html.util.HtmlRendererUtils.
<https://builds.apache.org/job/Tobago%203.0.x/ws/tobago-3.0.x/tobago-theme/tobago-theme-standard/src/main/java/org/apache/myfaces/tobago/renderkit/html/standard/standard/tag/ToolBarRenderer.java>:30:8:
Unused import - org.apache.myfaces.tobago.renderkit.html.util.HtmlRendererUtils.
<https://builds.apache.org/job/Tobago%203.0.x/ws/tobago-3.0.x/tobago-theme/tobago-theme-standard/src/main/java/org/apache/myfaces/tobago/renderkit/html/standard/standard/tag/ButtonRenderer.java>:29:8:
Unused import - org.apache.myfaces.tobago.renderkit.html.util.HtmlRendererUtils.
<https://builds.apache.org/job/Tobago%203.0.x/ws/tobago-3.0.x/tobago-theme/tobago-theme-standard/src/main/java/org/apache/myfaces/tobago/renderkit/html/standard/standard/tag/FlowLayoutRenderer.java>:28:8:
Unused import - org.apache.myfaces.tobago.renderkit.html.util.HtmlRendererUtils.
<https://builds.apache.org/job/Tobago%203.0.x/ws/tobago-3.0.x/tobago-theme/tobago-theme-standard/src/main/java/org/apache/myfaces/tobago/renderkit/html/standard/standard/tag/VerbatimRenderer.java>:24:8:
Unused import - org.apache.myfaces.tobago.renderkit.html.util.HtmlRendererUtils.
Audit done.

[INFO] There are 13 checkstyle errors.
[INFO] ------------------------------------------------------------------------
[INFO] Reactor Summary:
[INFO] 
[INFO] Apache Tobago ...................................... SUCCESS [ 12.026 s]
[INFO] Tobago Tool ........................................ SUCCESS [  1.002 s]
[INFO] Tobago Tool Annotation ............................. SUCCESS [  4.792 s]
[INFO] Tobago Tool Apt .................................... SUCCESS [  9.189 s]
[INFO] Tobago Maven2 Theme Plugin ......................... SUCCESS [  7.685 s]
[INFO] Tobago Core ........................................ SUCCESS [ 20.212 s]
[INFO] Tobago Themes ...................................... SUCCESS [  1.244 s]
[INFO] Tobago Theme Standard .............................. FAILURE [  5.504 s]
[INFO] Tobago Theme Scarborough ........................... SKIPPED
[INFO] Tobago Theme Speyside .............................. SKIPPED
[INFO] Tobago Theme Richmond .............................. SKIPPED
[INFO] Tobago Theme Charlotteville ........................ SKIPPED
[INFO] Tobago Theme Example ............................... SKIPPED
[INFO] Tobago Extensions .................................. SKIPPED
[INFO] Tobago Deprecation ................................. SKIPPED
[INFO] Tobago Sandbox ..................................... SKIPPED
[INFO] Tobago Examples .................................... SKIPPED
[INFO] Tobago Example Addressbook (Java EE 6) ............. SKIPPED
[INFO] Tobago Example Blank ............................... SKIPPED
[INFO] Tobago Example Data ................................ SKIPPED
[INFO] Tobago Example Demo ................................ SKIPPED
[INFO] Tobago Example for Portlets ........................ SKIPPED
[INFO] Tobago Example Security ............................ SKIPPED
[INFO] Tobago Example Test ................................ SKIPPED
[INFO] Tobago Example Assembly ............................ SKIPPED
[INFO] Tobago Assembly .................................... SKIPPED
[INFO] ------------------------------------------------------------------------
[INFO] BUILD FAILURE
[INFO] ------------------------------------------------------------------------
[INFO] Total time: 01:10 min
[INFO] Finished at: 2016-07-06T16:19:58+00:00
[INFO] Final Memory: 58M/803M
[INFO] ------------------------------------------------------------------------
Waiting for Jenkins to finish collecting data
[ERROR] Failed to execute goal org.apache.maven.plugins:maven-checkstyle-plugin:2.9.1:check
(default-cli) on project tobago-theme-standard: You have 13 Checkstyle violations. -> [Help
1]
[ERROR] 
[ERROR] To see the full stack trace of the errors, re-run Maven with the -e switch.
[ERROR] Re-run Maven using the -X switch to enable full debug logging.
[ERROR] 
[ERROR] For more information about the errors and possible solutions, please read the following
articles:
[ERROR] [Help 1] http://cwiki.apache.org/confluence/display/MAVEN/MojoFailureException
[ERROR] 
[ERROR] After correcting the problems, you can resume the build with the command
[ERROR]   mvn <goals> -rf :tobago-theme-standard
[JENKINS] Archiving <https://builds.apache.org/job/Tobago%203.0.x/ws/tobago-3.0.x/tobago-assembly/pom.xml>
to org.apache.myfaces.tobago/tobago-assembly/3.0.0-alpha-4-SNAPSHOT/tobago-assembly-3.0.0-alpha-4-SNAPSHOT.pom
[JENKINS] Archiving <https://builds.apache.org/job/Tobago%203.0.x/ws/tobago-3.0.x/tobago-extension/tobago-sandbox/pom.xml>
to org.apache.myfaces.tobago/tobago-sandbox/3.0.0-alpha-4-SNAPSHOT/tobago-sandbox-3.0.0-alpha-4-SNAPSHOT.pom
[JENKINS] Archiving <https://builds.apache.org/job/Tobago%203.0.x/ws/tobago-3.0.x/tobago-theme/tobago-theme-speyside/pom.xml>
to org.apache.myfaces.tobago/tobago-theme-speyside/3.0.0-alpha-4-SNAPSHOT/tobago-theme-speyside-3.0.0-alpha-4-SNAPSHOT.pom
[JENKINS] Archiving <https://builds.apache.org/job/Tobago%203.0.x/ws/tobago-3.0.x/tobago-tool/tobago-theme-plugin/pom.xml>
to org.apache.myfaces.tobago/tobago-theme-plugin/3.0.0-alpha-4-SNAPSHOT/tobago-theme-plugin-3.0.0-alpha-4-SNAPSHOT.pom
[JENKINS] Archiving <https://builds.apache.org/job/Tobago%203.0.x/ws/tobago-3.0.x/tobago-tool/tobago-theme-plugin/target/tobago-theme-plugin-3.0.0-alpha-4-SNAPSHOT.jar>
to org.apache.myfaces.tobago/tobago-theme-plugin/3.0.0-alpha-4-SNAPSHOT/tobago-theme-plugin-3.0.0-alpha-4-SNAPSHOT.jar
[JENKINS] Archiving <https://builds.apache.org/job/Tobago%203.0.x/ws/tobago-3.0.x/tobago-example/tobago-example-data/pom.xml>
to org.apache.myfaces.tobago/tobago-example-data/3.0.0-alpha-4-SNAPSHOT/tobago-example-data-3.0.0-alpha-4-SNAPSHOT.pom
[JENKINS] Archiving <https://builds.apache.org/job/Tobago%203.0.x/ws/tobago-3.0.x/tobago-example/tobago-example-portlet/pom.xml>
to org.apache.myfaces.tobago/tobago-example-portlet/3.0.0-alpha-4-SNAPSHOT/tobago-example-portlet-3.0.0-alpha-4-SNAPSHOT.pom
[JENKINS] Archiving <https://builds.apache.org/job/Tobago%203.0.x/ws/tobago-3.0.x/tobago-theme/tobago-theme-example/pom.xml>
to org.apache.myfaces.tobago/tobago-theme-example/3.0.0-alpha-4-SNAPSHOT/tobago-theme-example-3.0.0-alpha-4-SNAPSHOT.pom
[JENKINS] Archiving <https://builds.apache.org/job/Tobago%203.0.x/ws/tobago-3.0.x/tobago-example/pom.xml>
to org.apache.myfaces.tobago/tobago-example/3.0.0-alpha-4-SNAPSHOT/tobago-example-3.0.0-alpha-4-SNAPSHOT.pom
[JENKINS] Archiving <https://builds.apache.org/job/Tobago%203.0.x/ws/tobago-3.0.x/tobago-core/pom.xml>
to org.apache.myfaces.tobago/tobago-core/3.0.0-alpha-4-SNAPSHOT/tobago-core-3.0.0-alpha-4-SNAPSHOT.pom
[JENKINS] Archiving <https://builds.apache.org/job/Tobago%203.0.x/ws/tobago-3.0.x/tobago-core/target/tobago-core-3.0.0-alpha-4-SNAPSHOT.jar>
to org.apache.myfaces.tobago/tobago-core/3.0.0-alpha-4-SNAPSHOT/tobago-core-3.0.0-alpha-4-SNAPSHOT.jar
[JENKINS] Archiving <https://builds.apache.org/job/Tobago%203.0.x/ws/tobago-3.0.x/tobago-core/target/tobago-core-3.0.0-alpha-4-SNAPSHOT-tests.jar>
to org.apache.myfaces.tobago/tobago-core/3.0.0-alpha-4-SNAPSHOT/tobago-core-3.0.0-alpha-4-SNAPSHOT-tests.jar
[JENKINS] Archiving <https://builds.apache.org/job/Tobago%203.0.x/ws/tobago-3.0.x/tobago-core/target/tobago-core-3.0.0-alpha-4-SNAPSHOT-sources.jar>
to org.apache.myfaces.tobago/tobago-core/3.0.0-alpha-4-SNAPSHOT/tobago-core-3.0.0-alpha-4-SNAPSHOT-sources.jar
[JENKINS] Archiving <https://builds.apache.org/job/Tobago%203.0.x/ws/tobago-3.0.x/tobago-example/tobago-example-blank/pom.xml>
to org.apache.myfaces.tobago/tobago-example-blank/3.0.0-alpha-4-SNAPSHOT/tobago-example-blank-3.0.0-alpha-4-SNAPSHOT.pom
[JENKINS] Archiving <https://builds.apache.org/job/Tobago%203.0.x/ws/tobago-3.0.x/tobago-theme/pom.xml>
to org.apache.myfaces.tobago/tobago-theme/3.0.0-alpha-4-SNAPSHOT/tobago-theme-3.0.0-alpha-4-SNAPSHOT.pom
[JENKINS] Archiving <https://builds.apache.org/job/Tobago%203.0.x/ws/tobago-3.0.x/tobago-tool/tobago-tool-annotation/pom.xml>
to org.apache.myfaces.tobago/tobago-tool-annotation/3.0.0-alpha-4-SNAPSHOT/tobago-tool-annotation-3.0.0-alpha-4-SNAPSHOT.pom
[JENKINS] Archiving <https://builds.apache.org/job/Tobago%203.0.x/ws/tobago-3.0.x/tobago-tool/tobago-tool-annotation/target/tobago-tool-annotation-3.0.0-alpha-4-SNAPSHOT.jar>
to org.apache.myfaces.tobago/tobago-tool-annotation/3.0.0-alpha-4-SNAPSHOT/tobago-tool-annotation-3.0.0-alpha-4-SNAPSHOT.jar
[JENKINS] Archiving <https://builds.apache.org/job/Tobago%203.0.x/ws/tobago-3.0.x/tobago-theme/tobago-theme-richmond/pom.xml>
to org.apache.myfaces.tobago/tobago-theme-richmond/3.0.0-alpha-4-SNAPSHOT/tobago-theme-richmond-3.0.0-alpha-4-SNAPSHOT.pom
[JENKINS] Archiving <https://builds.apache.org/job/Tobago%203.0.x/ws/tobago-3.0.x/tobago-theme/tobago-theme-standard/pom.xml>
to org.apache.myfaces.tobago/tobago-theme-standard/3.0.0-alpha-4-SNAPSHOT/tobago-theme-standard-3.0.0-alpha-4-SNAPSHOT.pom
[JENKINS] Archiving <https://builds.apache.org/job/Tobago%203.0.x/ws/tobago-3.0.x/tobago-example/tobago-example-security/pom.xml>
to org.apache.myfaces.tobago/tobago-example-security/3.0.0-alpha-4-SNAPSHOT/tobago-example-security-3.0.0-alpha-4-SNAPSHOT.pom
[JENKINS] Archiving <https://builds.apache.org/job/Tobago%203.0.x/ws/tobago-3.0.x/tobago-example/tobago-example-addressbook/pom.xml>
to org.apache.myfaces.tobago/tobago-example-addressbook/3.0.0-alpha-4-SNAPSHOT/tobago-example-addressbook-3.0.0-alpha-4-SNAPSHOT.pom
[JENKINS] Archiving <https://builds.apache.org/job/Tobago%203.0.x/ws/tobago-3.0.x/tobago-tool/tobago-tool-apt/pom.xml>
to org.apache.myfaces.tobago/tobago-tool-apt/3.0.0-alpha-4-SNAPSHOT/tobago-tool-apt-3.0.0-alpha-4-SNAPSHOT.pom
[JENKINS] Archiving <https://builds.apache.org/job/Tobago%203.0.x/ws/tobago-3.0.x/tobago-tool/tobago-tool-apt/target/tobago-tool-apt-3.0.0-alpha-4-SNAPSHOT.jar>
to org.apache.myfaces.tobago/tobago-tool-apt/3.0.0-alpha-4-SNAPSHOT/tobago-tool-apt-3.0.0-alpha-4-SNAPSHOT.jar
[JENKINS] Archiving <https://builds.apache.org/job/Tobago%203.0.x/ws/tobago-3.0.x/tobago-tool/pom.xml>
to org.apache.myfaces.tobago/tobago-tool/3.0.0-alpha-4-SNAPSHOT/tobago-tool-3.0.0-alpha-4-SNAPSHOT.pom
[JENKINS] Archiving <https://builds.apache.org/job/Tobago%203.0.x/ws/tobago-3.0.x/tobago-extension/tobago-deprecation/pom.xml>
to org.apache.myfaces.tobago/tobago-deprecation/3.0.0-alpha-4-SNAPSHOT/tobago-deprecation-3.0.0-alpha-4-SNAPSHOT.pom
[JENKINS] Archiving <https://builds.apache.org/job/Tobago%203.0.x/ws/tobago-3.0.x/tobago-example/tobago-example-demo/pom.xml>
to org.apache.myfaces.tobago/tobago-example-demo/3.0.0-alpha-4-SNAPSHOT/tobago-example-demo-3.0.0-alpha-4-SNAPSHOT.pom
[JENKINS] Archiving <https://builds.apache.org/job/Tobago%203.0.x/ws/tobago-3.0.x/tobago-extension/pom.xml>
to org.apache.myfaces.tobago/tobago-extension/3.0.0-alpha-4-SNAPSHOT/tobago-extension-3.0.0-alpha-4-SNAPSHOT.pom
[JENKINS] Archiving <https://builds.apache.org/job/Tobago%203.0.x/ws/tobago-3.0.x/tobago-theme/tobago-theme-charlotteville/pom.xml>
to org.apache.myfaces.tobago/tobago-theme-charlotteville/3.0.0-alpha-4-SNAPSHOT/tobago-theme-charlotteville-3.0.0-alpha-4-SNAPSHOT.pom
[JENKINS] Archiving <https://builds.apache.org/job/Tobago%203.0.x/ws/tobago-3.0.x/tobago-example/tobago-example-assembly/pom.xml>
to org.apache.myfaces.tobago/tobago-example-assembly/3.0.0-alpha-4-SNAPSHOT/tobago-example-assembly-3.0.0-alpha-4-SNAPSHOT.pom
[JENKINS] Archiving <https://builds.apache.org/job/Tobago%203.0.x/ws/tobago-3.0.x/pom.xml>
to org.apache.myfaces.tobago/tobago/3.0.0-alpha-4-SNAPSHOT/tobago-3.0.0-alpha-4-SNAPSHOT.pom
[JENKINS] Archiving <https://builds.apache.org/job/Tobago%203.0.x/ws/tobago-3.0.x/target/tobago-3.0.0-alpha-4-SNAPSHOT-site.xml>
to org.apache.myfaces.tobago/tobago/3.0.0-alpha-4-SNAPSHOT/tobago-3.0.0-alpha-4-SNAPSHOT-site.xml
Compressed 50.11 KB of artifacts by 63.9% relative to #416
[JENKINS] Archiving <https://builds.apache.org/job/Tobago%203.0.x/ws/tobago-3.0.x/tobago-example/tobago-example-test/pom.xml>
to org.apache.myfaces.tobago/tobago-example-test/3.0.0-alpha-4-SNAPSHOT/tobago-example-test-3.0.0-alpha-4-SNAPSHOT.pom
[JENKINS] Archiving <https://builds.apache.org/job/Tobago%203.0.x/ws/tobago-3.0.x/tobago-theme/tobago-theme-scarborough/pom.xml>
to org.apache.myfaces.tobago/tobago-theme-scarborough/3.0.0-alpha-4-SNAPSHOT/tobago-theme-scarborough-3.0.0-alpha-4-SNAPSHOT.pom
Sending e-mails to: commits@myfaces.apache.org
channel stopped
Updating TOBAGO-1531

Mime
View raw message