myfaces-commits mailing list archives

Site index · List index
Message view « Date » · « Thread »
Top « Date » · « Thread »
From Apache Jenkins Server <jenk...@builds.apache.org>
Subject Build failed in Jenkins: Tobago 3.0.x #675
Date Fri, 09 Dec 2016 11:19:12 GMT
See <https://builds.apache.org/job/Tobago%203.0.x/675/changes>

Changes:

[lofwyr] TOBAGO-1661: Possibility to use the full browser height for the HTML content

------------------------------------------
[...truncated 2429 lines...]
[INFO] Tobago Example Data
[INFO] Tobago Example Demo
[INFO] Tobago Example for Portlets
[INFO] Tobago Example Test
[INFO] Tobago Example Assembly
[INFO] Tobago Assembly
[INFO]                                                                         
[INFO] ------------------------------------------------------------------------
[INFO] Building Apache Tobago 3.0.0-beta-2-SNAPSHOT
[INFO] ------------------------------------------------------------------------
[INFO] 
[INFO] --- maven-clean-plugin:2.6.1:clean (default-clean) @ tobago ---
[INFO] 
[INFO] --- animal-sniffer-maven-plugin:1.14:check (default-cli) @ tobago ---
[INFO] Checking unresolved references to org.codehaus.mojo.signature:java16:1.1
[INFO] 
[INFO] --- maven-checkstyle-plugin:2.9.1:check (default-cli) @ tobago ---
[INFO] Starting audit...
Audit done.

[INFO] 
[INFO] --- maven-enforcer-plugin:1.4.1:enforce (enforce) @ tobago ---
[INFO] 
[INFO] --- maven-remote-resources-plugin:1.5:process (default) @ tobago ---
[INFO] 
[INFO] --- maven-site-plugin:3.5.1:attach-descriptor (attach-descriptor) @ tobago ---
[INFO] 
[INFO] --- maven-install-plugin:2.5.2:install (default-install) @ tobago ---
[INFO] Installing <https://builds.apache.org/job/Tobago%203.0.x/ws/tobago-3.0.x/pom.xml>
to /home/jenkins/jenkins-slave/maven-repositories/1/org/apache/myfaces/tobago/tobago/3.0.0-beta-2-SNAPSHOT/tobago-3.0.0-beta-2-SNAPSHOT.pom
[INFO] Installing <https://builds.apache.org/job/Tobago%203.0.x/ws/tobago-3.0.x/target/tobago-3.0.0-beta-2-SNAPSHOT-site.xml>
to /home/jenkins/jenkins-slave/maven-repositories/1/org/apache/myfaces/tobago/tobago/3.0.0-beta-2-SNAPSHOT/tobago-3.0.0-beta-2-SNAPSHOT-site.xml
[INFO]                                                                         
[INFO] ------------------------------------------------------------------------
[INFO] Building Tobago Tool 3.0.0-beta-2-SNAPSHOT
[INFO] ------------------------------------------------------------------------
[INFO] 
[INFO] --- maven-clean-plugin:2.6.1:clean (default-clean) @ tobago-tool ---
[INFO] 
[INFO] --- animal-sniffer-maven-plugin:1.14:check (default-cli) @ tobago-tool ---
[INFO] Checking unresolved references to org.codehaus.mojo.signature:java16:1.1
[INFO] 
[INFO] --- maven-checkstyle-plugin:2.9.1:check (default-cli) @ tobago-tool ---
[INFO] Starting audit...
Audit done.

[INFO] 
[INFO] --- maven-enforcer-plugin:1.4.1:enforce (enforce) @ tobago-tool ---
[INFO] 
[INFO] --- maven-remote-resources-plugin:1.5:process (default) @ tobago-tool ---
[INFO] 
[INFO] --- maven-site-plugin:3.5.1:attach-descriptor (attach-descriptor) @ tobago-tool ---
[INFO] 
[INFO] --- maven-install-plugin:2.5.2:install (default-install) @ tobago-tool ---
[INFO] Installing <https://builds.apache.org/job/Tobago%203.0.x/ws/tobago-3.0.x/tobago-tool/pom.xml>
to /home/jenkins/jenkins-slave/maven-repositories/1/org/apache/myfaces/tobago/tobago-tool/3.0.0-beta-2-SNAPSHOT/tobago-tool-3.0.0-beta-2-SNAPSHOT.pom
[INFO]                                                                         
[INFO] ------------------------------------------------------------------------
[INFO] Building Tobago Tool Annotation 3.0.0-beta-2-SNAPSHOT
[INFO] ------------------------------------------------------------------------
[INFO] 
[INFO] --- maven-clean-plugin:2.6.1:clean (default-clean) @ tobago-tool-annotation ---
[INFO] 
[INFO] --- animal-sniffer-maven-plugin:1.14:check (default-cli) @ tobago-tool-annotation ---
[INFO] Checking unresolved references to org.codehaus.mojo.signature:java16:1.1
[INFO] 
[INFO] --- maven-checkstyle-plugin:2.9.1:check (default-cli) @ tobago-tool-annotation ---
[INFO] Starting audit...
Audit done.

[INFO] 
[INFO] --- maven-enforcer-plugin:1.4.1:enforce (enforce) @ tobago-tool-annotation ---
[INFO] 
[INFO] --- maven-remote-resources-plugin:1.5:process (default) @ tobago-tool-annotation ---
[INFO] 
[INFO] --- maven-resources-plugin:2.7:resources (default-resources) @ tobago-tool-annotation
---
[INFO] Using 'UTF-8' encoding to copy filtered resources.
[INFO] skip non existing resourceDirectory <https://builds.apache.org/job/Tobago%203.0.x/ws/tobago-3.0.x/tobago-tool/tobago-tool-annotation/src/main/resources>
[INFO] Copying 3 resources
[INFO] 
[INFO] --- maven-compiler-plugin:3.5.1:compile (default-compile) @ tobago-tool-annotation
---
[INFO] Compiling 16 source files to <https://builds.apache.org/job/Tobago%203.0.x/ws/tobago-3.0.x/tobago-tool/tobago-tool-annotation/target/classes>
[WARNING] bootstrap class path not set in conjunction with -source 1.6
[INFO] 
[INFO] --- maven-resources-plugin:2.7:testResources (default-testResources) @ tobago-tool-annotation
---
[INFO] Using 'UTF-8' encoding to copy filtered resources.
[INFO] skip non existing resourceDirectory <https://builds.apache.org/job/Tobago%203.0.x/ws/tobago-3.0.x/tobago-tool/tobago-tool-annotation/src/test/resources>
[INFO] Copying 3 resources
[INFO] 
[INFO] --- maven-compiler-plugin:3.5.1:testCompile (default-testCompile) @ tobago-tool-annotation
---
[INFO] No sources to compile
[INFO] 
[INFO] --- maven-surefire-plugin:2.19.1:test (default-test) @ tobago-tool-annotation ---
[JENKINS] Recording test results
[INFO] 
[INFO] --- maven-jar-plugin:2.6:jar (default-jar) @ tobago-tool-annotation ---
[INFO] Building jar: <https://builds.apache.org/job/Tobago%203.0.x/ws/tobago-3.0.x/tobago-tool/tobago-tool-annotation/target/tobago-tool-annotation-3.0.0-beta-2-SNAPSHOT.jar>
[INFO] 
[INFO] --- maven-site-plugin:3.5.1:attach-descriptor (attach-descriptor) @ tobago-tool-annotation
---
[INFO] 
[INFO] --- maven-install-plugin:2.5.2:install (default-install) @ tobago-tool-annotation ---
[INFO] Installing <https://builds.apache.org/job/Tobago%203.0.x/ws/tobago-3.0.x/tobago-tool/tobago-tool-annotation/target/tobago-tool-annotation-3.0.0-beta-2-SNAPSHOT.jar>
to /home/jenkins/jenkins-slave/maven-repositories/1/org/apache/myfaces/tobago/tobago-tool-annotation/3.0.0-beta-2-SNAPSHOT/tobago-tool-annotation-3.0.0-beta-2-SNAPSHOT.jar
[INFO] Installing <https://builds.apache.org/job/Tobago%203.0.x/ws/tobago-3.0.x/tobago-tool/tobago-tool-annotation/pom.xml>
to /home/jenkins/jenkins-slave/maven-repositories/1/org/apache/myfaces/tobago/tobago-tool-annotation/3.0.0-beta-2-SNAPSHOT/tobago-tool-annotation-3.0.0-beta-2-SNAPSHOT.pom
[INFO]                                                                         
[INFO] ------------------------------------------------------------------------
[INFO] Building Tobago Tool Apt 3.0.0-beta-2-SNAPSHOT
[INFO] ------------------------------------------------------------------------
[INFO] 
[INFO] --- maven-clean-plugin:2.6.1:clean (default-clean) @ tobago-tool-apt ---
[INFO] 
[INFO] --- animal-sniffer-maven-plugin:1.14:check (default-cli) @ tobago-tool-apt ---
[INFO] Checking unresolved references to org.codehaus.mojo.signature:java16:1.0
[INFO] 
[INFO] --- maven-checkstyle-plugin:2.9.1:check (default-cli) @ tobago-tool-apt ---
[INFO] Starting audit...
Audit done.

[INFO] 
[INFO] --- maven-enforcer-plugin:1.4.1:enforce (enforce) @ tobago-tool-apt ---
[INFO] 
[INFO] --- maven-remote-resources-plugin:1.5:process (default) @ tobago-tool-apt ---
[INFO] 
[INFO] --- maven-resources-plugin:2.7:resources (default-resources) @ tobago-tool-apt ---
[INFO] Using 'UTF-8' encoding to copy filtered resources.
[INFO] Copying 1 resource
[INFO] Copying 3 resources
[INFO] 
[INFO] --- maven-compiler-plugin:3.5.1:compile (default-compile) @ tobago-tool-apt ---
[INFO] Compiling 14 source files to <https://builds.apache.org/job/Tobago%203.0.x/ws/tobago-3.0.x/tobago-tool/tobago-tool-apt/target/classes>
[WARNING] bootstrap class path not set in conjunction with -source 1.6
[INFO] <https://builds.apache.org/job/Tobago%203.0.x/ws/tobago-3.0.x/tobago-tool/tobago-tool-apt/src/main/java/org/apache/myfaces/tobago/apt/processor/FacesConfigGenerator.java>:
<https://builds.apache.org/job/Tobago%203.0.x/ws/tobago-3.0.x/tobago-tool/tobago-tool-apt/src/main/java/org/apache/myfaces/tobago/apt/processor/FacesConfigGenerator.java>
uses unchecked or unsafe operations.
[INFO] <https://builds.apache.org/job/Tobago%203.0.x/ws/tobago-3.0.x/tobago-tool/tobago-tool-apt/src/main/java/org/apache/myfaces/tobago/apt/processor/FacesConfigGenerator.java>:
Recompile with -Xlint:unchecked for details.
[INFO] 
[INFO] --- maven-resources-plugin:2.7:testResources (default-testResources) @ tobago-tool-apt
---
[INFO] Using 'UTF-8' encoding to copy filtered resources.
[INFO] skip non existing resourceDirectory <https://builds.apache.org/job/Tobago%203.0.x/ws/tobago-3.0.x/tobago-tool/tobago-tool-apt/src/test/resources>
[INFO] Copying 3 resources
[INFO] 
[INFO] --- maven-compiler-plugin:3.5.1:testCompile (default-testCompile) @ tobago-tool-apt
---
[INFO] Compiling 1 source file to <https://builds.apache.org/job/Tobago%203.0.x/ws/tobago-3.0.x/tobago-tool/tobago-tool-apt/target/test-classes>
[WARNING] bootstrap class path not set in conjunction with -source 1.6
[INFO] 
[INFO] --- maven-surefire-plugin:2.19.1:test (default-test) @ tobago-tool-apt ---

-------------------------------------------------------
 T E S T S
-------------------------------------------------------
Running org.apache.myfaces.tobago.apt.processor.CheckstyleConfigGeneratorUnitTest
Tests run: 1, Failures: 0, Errors: 0, Skipped: 0, Time elapsed: 0.051 sec - in org.apache.myfaces.tobago.apt.processor.CheckstyleConfigGeneratorUnitTest

Results :

Tests run: 1, Failures: 0, Errors: 0, Skipped: 0

[JENKINS] Recording test results
[INFO] 
[INFO] --- maven-jar-plugin:2.6:jar (default-jar) @ tobago-tool-apt ---
[INFO] Building jar: <https://builds.apache.org/job/Tobago%203.0.x/ws/tobago-3.0.x/tobago-tool/tobago-tool-apt/target/tobago-tool-apt-3.0.0-beta-2-SNAPSHOT.jar>
[INFO] 
[INFO] --- maven-site-plugin:3.5.1:attach-descriptor (attach-descriptor) @ tobago-tool-apt
---
[INFO] 
[INFO] --- maven-install-plugin:2.5.2:install (default-install) @ tobago-tool-apt ---
[INFO] Installing <https://builds.apache.org/job/Tobago%203.0.x/ws/tobago-3.0.x/tobago-tool/tobago-tool-apt/target/tobago-tool-apt-3.0.0-beta-2-SNAPSHOT.jar>
to /home/jenkins/jenkins-slave/maven-repositories/1/org/apache/myfaces/tobago/tobago-tool-apt/3.0.0-beta-2-SNAPSHOT/tobago-tool-apt-3.0.0-beta-2-SNAPSHOT.jar
[INFO] Installing <https://builds.apache.org/job/Tobago%203.0.x/ws/tobago-3.0.x/tobago-tool/tobago-tool-apt/pom.xml>
to /home/jenkins/jenkins-slave/maven-repositories/1/org/apache/myfaces/tobago/tobago-tool-apt/3.0.0-beta-2-SNAPSHOT/tobago-tool-apt-3.0.0-beta-2-SNAPSHOT.pom
[INFO]                                                                         
[INFO] ------------------------------------------------------------------------
[INFO] Building Tobago Core 3.0.0-beta-2-SNAPSHOT
[INFO] ------------------------------------------------------------------------
[INFO] 
[INFO] --- maven-clean-plugin:2.6.1:clean (default-clean) @ tobago-core ---
[INFO] 
[INFO] --- animal-sniffer-maven-plugin:1.14:check (default-cli) @ tobago-core ---
[INFO] Checking unresolved references to org.codehaus.mojo.signature:java16:1.1
[INFO] 
[INFO] --- maven-checkstyle-plugin:2.9.1:check (default-cli) @ tobago-core ---
[INFO] Starting audit...
<https://builds.apache.org/job/Tobago%203.0.x/ws/tobago-3.0.x/tobago-core/src/main/java/org/apache/myfaces/tobago/internal/taglib/component/PageTagDeclaration.java>:31:8:
Unused import - org.apache.myfaces.tobago.context.Markup.
Audit done.

[INFO] There are 1 checkstyle errors.
[INFO] ------------------------------------------------------------------------
[INFO] Reactor Summary:
[INFO] 
[INFO] Apache Tobago ...................................... SUCCESS [  7.046 s]
[INFO] Tobago Tool ........................................ SUCCESS [  1.907 s]
[INFO] Tobago Tool Annotation ............................. SUCCESS [  3.260 s]
[INFO] Tobago Tool Apt .................................... SUCCESS [ 17.147 s]
[INFO] Tobago Core ........................................ FAILURE [  3.565 s]
[INFO] Tobago Themes ...................................... SKIPPED
[INFO] Tobago Theme Standard .............................. SKIPPED
[INFO] Tobago Theme Scarborough ........................... SKIPPED
[INFO] Tobago Theme Speyside .............................. SKIPPED
[INFO] Tobago Theme Richmond .............................. SKIPPED
[INFO] Tobago Theme Charlotteville ........................ SKIPPED
[INFO] Tobago Extensions .................................. SKIPPED
[INFO] Tobago Sandbox ..................................... SKIPPED
[INFO] Tobago Examples .................................... SKIPPED
[INFO] Tobago Example Addressbook (Java EE 6) ............. SKIPPED
[INFO] Tobago Example Blank ............................... SKIPPED
[INFO] Tobago Example Data ................................ SKIPPED
[INFO] Tobago Example Demo ................................ SKIPPED
[INFO] Tobago Example for Portlets ........................ SKIPPED
[INFO] Tobago Example Test ................................ SKIPPED
[INFO] Tobago Example Assembly ............................ SKIPPED
[INFO] Tobago Assembly .................................... SKIPPED
[INFO] ------------------------------------------------------------------------
[INFO] BUILD FAILURE
[INFO] ------------------------------------------------------------------------
[INFO] Total time: 48.808 s
[INFO] Finished at: 2016-12-09T11:19:09+00:00
[INFO] Final Memory: 46M/631M
[INFO] ------------------------------------------------------------------------
Waiting for Jenkins to finish collecting data
[ERROR] Failed to execute goal org.apache.maven.plugins:maven-checkstyle-plugin:2.9.1:check
(default-cli) on project tobago-core: You have 1 Checkstyle violation. -> [Help 1]
[ERROR] 
[ERROR] To see the full stack trace of the errors, re-run Maven with the -e switch.
[ERROR] Re-run Maven using the -X switch to enable full debug logging.
[ERROR] 
[ERROR] For more information about the errors and possible solutions, please read the following
articles:
[ERROR] [Help 1] http://cwiki.apache.org/confluence/display/MAVEN/MojoFailureException
[ERROR] 
[ERROR] After correcting the problems, you can resume the build with the command
[ERROR]   mvn <goals> -rf :tobago-core
[JENKINS] Archiving <https://builds.apache.org/job/Tobago%203.0.x/ws/tobago-3.0.x/tobago-theme/pom.xml>
to org.apache.myfaces.tobago/tobago-theme/3.0.0-beta-2-SNAPSHOT/tobago-theme-3.0.0-beta-2-SNAPSHOT.pom
[JENKINS] Archiving <https://builds.apache.org/job/Tobago%203.0.x/ws/tobago-3.0.x/tobago-example/tobago-example-blank/pom.xml>
to org.apache.myfaces.tobago/tobago-example-blank/3.0.0-beta-2-SNAPSHOT/tobago-example-blank-3.0.0-beta-2-SNAPSHOT.pom
[JENKINS] Archiving <https://builds.apache.org/job/Tobago%203.0.x/ws/tobago-3.0.x/tobago-assembly/pom.xml>
to org.apache.myfaces.tobago/tobago-assembly/3.0.0-beta-2-SNAPSHOT/tobago-assembly-3.0.0-beta-2-SNAPSHOT.pom
[JENKINS] Archiving <https://builds.apache.org/job/Tobago%203.0.x/ws/tobago-3.0.x/pom.xml>
to org.apache.myfaces.tobago/tobago/3.0.0-beta-2-SNAPSHOT/tobago-3.0.0-beta-2-SNAPSHOT.pom
[JENKINS] Archiving <https://builds.apache.org/job/Tobago%203.0.x/ws/tobago-3.0.x/target/tobago-3.0.0-beta-2-SNAPSHOT-site.xml>
to org.apache.myfaces.tobago/tobago/3.0.0-beta-2-SNAPSHOT/tobago-3.0.0-beta-2-SNAPSHOT-site.xml
Compressed 50.59 KB of artifacts by 63.3% relative to #674
[JENKINS] Archiving <https://builds.apache.org/job/Tobago%203.0.x/ws/tobago-3.0.x/tobago-theme/tobago-theme-standard/pom.xml>
to org.apache.myfaces.tobago/tobago-theme-standard/3.0.0-beta-2-SNAPSHOT/tobago-theme-standard-3.0.0-beta-2-SNAPSHOT.pom
[JENKINS] Archiving <https://builds.apache.org/job/Tobago%203.0.x/ws/tobago-3.0.x/tobago-theme/tobago-theme-scarborough/pom.xml>
to org.apache.myfaces.tobago/tobago-theme-scarborough/3.0.0-beta-2-SNAPSHOT/tobago-theme-scarborough-3.0.0-beta-2-SNAPSHOT.pom
[JENKINS] Archiving <https://builds.apache.org/job/Tobago%203.0.x/ws/tobago-3.0.x/tobago-example/tobago-example-assembly/pom.xml>
to org.apache.myfaces.tobago/tobago-example-assembly/3.0.0-beta-2-SNAPSHOT/tobago-example-assembly-3.0.0-beta-2-SNAPSHOT.pom
[JENKINS] Archiving <https://builds.apache.org/job/Tobago%203.0.x/ws/tobago-3.0.x/tobago-theme/tobago-theme-richmond/pom.xml>
to org.apache.myfaces.tobago/tobago-theme-richmond/3.0.0-beta-2-SNAPSHOT/tobago-theme-richmond-3.0.0-beta-2-SNAPSHOT.pom
[JENKINS] Archiving <https://builds.apache.org/job/Tobago%203.0.x/ws/tobago-3.0.x/tobago-theme/tobago-theme-speyside/pom.xml>
to org.apache.myfaces.tobago/tobago-theme-speyside/3.0.0-beta-2-SNAPSHOT/tobago-theme-speyside-3.0.0-beta-2-SNAPSHOT.pom
[JENKINS] Archiving <https://builds.apache.org/job/Tobago%203.0.x/ws/tobago-3.0.x/tobago-extension/pom.xml>
to org.apache.myfaces.tobago/tobago-extension/3.0.0-beta-2-SNAPSHOT/tobago-extension-3.0.0-beta-2-SNAPSHOT.pom
[JENKINS] Archiving <https://builds.apache.org/job/Tobago%203.0.x/ws/tobago-3.0.x/tobago-example/tobago-example-portlet/pom.xml>
to org.apache.myfaces.tobago/tobago-example-portlet/3.0.0-beta-2-SNAPSHOT/tobago-example-portlet-3.0.0-beta-2-SNAPSHOT.pom
[JENKINS] Archiving <https://builds.apache.org/job/Tobago%203.0.x/ws/tobago-3.0.x/tobago-tool/tobago-tool-annotation/pom.xml>
to org.apache.myfaces.tobago/tobago-tool-annotation/3.0.0-beta-2-SNAPSHOT/tobago-tool-annotation-3.0.0-beta-2-SNAPSHOT.pom
[JENKINS] Archiving <https://builds.apache.org/job/Tobago%203.0.x/ws/tobago-3.0.x/tobago-tool/tobago-tool-annotation/target/tobago-tool-annotation-3.0.0-beta-2-SNAPSHOT.jar>
to org.apache.myfaces.tobago/tobago-tool-annotation/3.0.0-beta-2-SNAPSHOT/tobago-tool-annotation-3.0.0-beta-2-SNAPSHOT.jar
[JENKINS] Archiving <https://builds.apache.org/job/Tobago%203.0.x/ws/tobago-3.0.x/tobago-example/pom.xml>
to org.apache.myfaces.tobago/tobago-example/3.0.0-beta-2-SNAPSHOT/tobago-example-3.0.0-beta-2-SNAPSHOT.pom
[JENKINS] Archiving <https://builds.apache.org/job/Tobago%203.0.x/ws/tobago-3.0.x/tobago-example/tobago-example-data/pom.xml>
to org.apache.myfaces.tobago/tobago-example-data/3.0.0-beta-2-SNAPSHOT/tobago-example-data-3.0.0-beta-2-SNAPSHOT.pom
[JENKINS] Archiving <https://builds.apache.org/job/Tobago%203.0.x/ws/tobago-3.0.x/tobago-example/tobago-example-test/pom.xml>
to org.apache.myfaces.tobago/tobago-example-test/3.0.0-beta-2-SNAPSHOT/tobago-example-test-3.0.0-beta-2-SNAPSHOT.pom
[JENKINS] Archiving <https://builds.apache.org/job/Tobago%203.0.x/ws/tobago-3.0.x/tobago-example/tobago-example-addressbook/pom.xml>
to org.apache.myfaces.tobago/tobago-example-addressbook/3.0.0-beta-2-SNAPSHOT/tobago-example-addressbook-3.0.0-beta-2-SNAPSHOT.pom
[JENKINS] Archiving <https://builds.apache.org/job/Tobago%203.0.x/ws/tobago-3.0.x/tobago-tool/pom.xml>
to org.apache.myfaces.tobago/tobago-tool/3.0.0-beta-2-SNAPSHOT/tobago-tool-3.0.0-beta-2-SNAPSHOT.pom
[JENKINS] Archiving <https://builds.apache.org/job/Tobago%203.0.x/ws/tobago-3.0.x/tobago-core/pom.xml>
to org.apache.myfaces.tobago/tobago-core/3.0.0-beta-2-SNAPSHOT/tobago-core-3.0.0-beta-2-SNAPSHOT.pom
[JENKINS] Archiving <https://builds.apache.org/job/Tobago%203.0.x/ws/tobago-3.0.x/tobago-tool/tobago-tool-apt/pom.xml>
to org.apache.myfaces.tobago/tobago-tool-apt/3.0.0-beta-2-SNAPSHOT/tobago-tool-apt-3.0.0-beta-2-SNAPSHOT.pom
[JENKINS] Archiving <https://builds.apache.org/job/Tobago%203.0.x/ws/tobago-3.0.x/tobago-tool/tobago-tool-apt/target/tobago-tool-apt-3.0.0-beta-2-SNAPSHOT.jar>
to org.apache.myfaces.tobago/tobago-tool-apt/3.0.0-beta-2-SNAPSHOT/tobago-tool-apt-3.0.0-beta-2-SNAPSHOT.jar
[JENKINS] Archiving <https://builds.apache.org/job/Tobago%203.0.x/ws/tobago-3.0.x/tobago-extension/tobago-sandbox/pom.xml>
to org.apache.myfaces.tobago/tobago-sandbox/3.0.0-beta-2-SNAPSHOT/tobago-sandbox-3.0.0-beta-2-SNAPSHOT.pom
[JENKINS] Archiving <https://builds.apache.org/job/Tobago%203.0.x/ws/tobago-3.0.x/tobago-theme/tobago-theme-charlotteville/pom.xml>
to org.apache.myfaces.tobago/tobago-theme-charlotteville/3.0.0-beta-2-SNAPSHOT/tobago-theme-charlotteville-3.0.0-beta-2-SNAPSHOT.pom
[JENKINS] Archiving <https://builds.apache.org/job/Tobago%203.0.x/ws/tobago-3.0.x/tobago-example/tobago-example-demo/pom.xml>
to org.apache.myfaces.tobago/tobago-example-demo/3.0.0-beta-2-SNAPSHOT/tobago-example-demo-3.0.0-beta-2-SNAPSHOT.pom
Sending e-mails to: commits@myfaces.apache.org
channel stopped
Updating TOBAGO-1661

Mime
View raw message