myfaces-commits mailing list archives

Site index · List index
Message view « Date » · « Thread »
Top « Date » · « Thread »
From Apache Jenkins Server <jenk...@builds.apache.org>
Subject Build failed in Jenkins: Tobago Trunk #779
Date Wed, 15 Feb 2017 18:47:17 GMT
See <https://builds.apache.org/job/Tobago%20Trunk/779/changes>

Changes:

[lofwyr] TOBAGO-1700: Re-Add the version of Tobago to the resources URL to avoid caching when
updating Tobago

------------------------------------------
[...truncated 2495 lines...]
[INFO] --- maven-clean-plugin:2.6.1:clean (default-clean) @ tobago-tool ---
[INFO] 
[INFO] --- animal-sniffer-maven-plugin:1.14:check (default-cli) @ tobago-tool ---
[INFO] Checking unresolved references to org.codehaus.mojo.signature:java16:1.1
[INFO] 
[INFO] --- maven-checkstyle-plugin:2.17:check (default-cli) @ tobago-tool ---
[INFO] Starting audit...
Audit done.
[INFO] 
[INFO] --- maven-enforcer-plugin:1.4.1:enforce (enforce) @ tobago-tool ---
[INFO] 
[INFO] --- maven-remote-resources-plugin:1.5:process (default) @ tobago-tool ---
[INFO] 
[INFO] --- maven-site-plugin:3.5.1:attach-descriptor (attach-descriptor) @ tobago-tool ---
[INFO] 
[INFO] --- maven-install-plugin:2.5.2:install (default-install) @ tobago-tool ---
[INFO] Installing <https://builds.apache.org/job/Tobago%20Trunk/ws/tobago-trunk/tobago-tool/pom.xml>
to /home/jenkins/jenkins-slave/maven-repositories/1/org/apache/myfaces/tobago/tobago-tool/3.1.0-SNAPSHOT/tobago-tool-3.1.0-SNAPSHOT.pom
[INFO]                                                                         
[INFO] ------------------------------------------------------------------------
[INFO] Building Tobago Tool Annotation 3.1.0-SNAPSHOT
[INFO] ------------------------------------------------------------------------
[INFO] Downloading: https://repo.maven.apache.org/maven2/org/apache/maven/plugins/maven-jar-plugin/2.6/maven-jar-plugin-2.6.pom
[INFO] Downloaded: https://repo.maven.apache.org/maven2/org/apache/maven/plugins/maven-jar-plugin/2.6/maven-jar-plugin-2.6.pom
(6 KB at 302.9 KB/sec)
[INFO] Downloading: https://repo.maven.apache.org/maven2/org/apache/maven/plugins/maven-jar-plugin/2.6/maven-jar-plugin-2.6.jar
[INFO] Downloaded: https://repo.maven.apache.org/maven2/org/apache/maven/plugins/maven-jar-plugin/2.6/maven-jar-plugin-2.6.jar
(26 KB at 1317.5 KB/sec)
[INFO] 
[INFO] --- maven-clean-plugin:2.6.1:clean (default-clean) @ tobago-tool-annotation ---
[INFO] 
[INFO] --- animal-sniffer-maven-plugin:1.14:check (default-cli) @ tobago-tool-annotation ---
[INFO] Checking unresolved references to org.codehaus.mojo.signature:java16:1.1
[INFO] 
[INFO] --- maven-checkstyle-plugin:2.17:check (default-cli) @ tobago-tool-annotation ---
[INFO] Starting audit...
Audit done.
[INFO] 
[INFO] --- maven-enforcer-plugin:1.4.1:enforce (enforce) @ tobago-tool-annotation ---
[INFO] 
[INFO] --- maven-remote-resources-plugin:1.5:process (default) @ tobago-tool-annotation ---
[INFO] 
[INFO] --- maven-resources-plugin:2.7:resources (default-resources) @ tobago-tool-annotation
---
[INFO] Using 'UTF-8' encoding to copy filtered resources.
[INFO] skip non existing resourceDirectory <https://builds.apache.org/job/Tobago%20Trunk/ws/tobago-trunk/tobago-tool/tobago-tool-annotation/src/main/resources>
[INFO] Copying 3 resources
[INFO] 
[INFO] --- maven-compiler-plugin:3.5.1:compile (default-compile) @ tobago-tool-annotation
---
[INFO] Compiling 16 source files to <https://builds.apache.org/job/Tobago%20Trunk/ws/tobago-trunk/tobago-tool/tobago-tool-annotation/target/classes>
[WARNING] bootstrap class path not set in conjunction with -source 1.6
[INFO] 
[INFO] --- maven-resources-plugin:2.7:testResources (default-testResources) @ tobago-tool-annotation
---
[INFO] Using 'UTF-8' encoding to copy filtered resources.
[INFO] skip non existing resourceDirectory <https://builds.apache.org/job/Tobago%20Trunk/ws/tobago-trunk/tobago-tool/tobago-tool-annotation/src/test/resources>
[INFO] Copying 3 resources
[INFO] 
[INFO] --- maven-compiler-plugin:3.5.1:testCompile (default-testCompile) @ tobago-tool-annotation
---
[INFO] No sources to compile
[INFO] 
[INFO] --- maven-surefire-plugin:2.19.1:test (default-test) @ tobago-tool-annotation ---
[JENKINS] Recording test results
[INFO] 
[INFO] --- maven-jar-plugin:2.6:jar (default-jar) @ tobago-tool-annotation ---
[INFO] Downloading: https://repo.maven.apache.org/maven2/org/apache/maven/maven-archiver/2.6/maven-archiver-2.6.pom
[INFO] Downloaded: https://repo.maven.apache.org/maven2/org/apache/maven/maven-archiver/2.6/maven-archiver-2.6.pom
(5 KB at 168.8 KB/sec)
[INFO] Downloading: https://repo.maven.apache.org/maven2/org/codehaus/plexus/plexus-archiver/2.8.1/plexus-archiver-2.8.1.pom
[INFO] Downloaded: https://repo.maven.apache.org/maven2/org/codehaus/plexus/plexus-archiver/2.8.1/plexus-archiver-2.8.1.pom
(5 KB at 182.8 KB/sec)
[INFO] Downloading: https://repo.maven.apache.org/maven2/org/codehaus/plexus/plexus-io/2.3.2/plexus-io-2.3.2.pom
[INFO] Downloaded: https://repo.maven.apache.org/maven2/org/codehaus/plexus/plexus-io/2.3.2/plexus-io-2.3.2.pom
(3 KB at 143.8 KB/sec)
[INFO] Downloading: https://repo.maven.apache.org/maven2/org/apache/maven/maven-archiver/2.6/maven-archiver-2.6.jar
[INFO] Downloaded: https://repo.maven.apache.org/maven2/org/apache/maven/maven-archiver/2.6/maven-archiver-2.6.jar
(23 KB at 1001.6 KB/sec)
[INFO] Building jar: <https://builds.apache.org/job/Tobago%20Trunk/ws/tobago-trunk/tobago-tool/tobago-tool-annotation/target/tobago-tool-annotation-3.1.0-SNAPSHOT.jar>
[INFO] 
[INFO] --- maven-site-plugin:3.5.1:attach-descriptor (attach-descriptor) @ tobago-tool-annotation
---
[INFO] 
[INFO] --- maven-install-plugin:2.5.2:install (default-install) @ tobago-tool-annotation ---
[INFO] Installing <https://builds.apache.org/job/Tobago%20Trunk/ws/tobago-trunk/tobago-tool/tobago-tool-annotation/target/tobago-tool-annotation-3.1.0-SNAPSHOT.jar>
to /home/jenkins/jenkins-slave/maven-repositories/1/org/apache/myfaces/tobago/tobago-tool-annotation/3.1.0-SNAPSHOT/tobago-tool-annotation-3.1.0-SNAPSHOT.jar
[INFO] Installing <https://builds.apache.org/job/Tobago%20Trunk/ws/tobago-trunk/tobago-tool/tobago-tool-annotation/pom.xml>
to /home/jenkins/jenkins-slave/maven-repositories/1/org/apache/myfaces/tobago/tobago-tool-annotation/3.1.0-SNAPSHOT/tobago-tool-annotation-3.1.0-SNAPSHOT.pom
[INFO]                                                                         
[INFO] ------------------------------------------------------------------------
[INFO] Building Tobago Tool Apt 3.1.0-SNAPSHOT
[INFO] ------------------------------------------------------------------------
[INFO] Downloading: https://repo.maven.apache.org/maven2/org/apache/myfaces/core/myfaces-api/2.0.24/myfaces-api-2.0.24.pom
[INFO] Downloaded: https://repo.maven.apache.org/maven2/org/apache/myfaces/core/myfaces-api/2.0.24/myfaces-api-2.0.24.pom
(34 KB at 1655.0 KB/sec)
[INFO] Downloading: https://repo.maven.apache.org/maven2/org/apache/myfaces/core/myfaces-core-project/2.0.24/myfaces-core-project-2.0.24.pom
[INFO] Downloaded: https://repo.maven.apache.org/maven2/org/apache/myfaces/core/myfaces-core-project/2.0.24/myfaces-core-project-2.0.24.pom
(24 KB at 1067.6 KB/sec)
[INFO] Downloading: https://repo.maven.apache.org/maven2/ant/ant/1.6.2/ant-1.6.2.pom
[INFO] Downloaded: https://repo.maven.apache.org/maven2/ant/ant/1.6.2/ant-1.6.2.pom (521 B
at 31.8 KB/sec)
[INFO] Downloading: https://repo.maven.apache.org/maven2/org/codehaus/modello/modello-plugin-java/1.5/modello-plugin-java-1.5.pom
[INFO] Downloaded: https://repo.maven.apache.org/maven2/org/codehaus/modello/modello-plugin-java/1.5/modello-plugin-java-1.5.pom
(3 KB at 118.4 KB/sec)
[INFO] Downloading: https://repo.maven.apache.org/maven2/org/codehaus/modello/modello-plugins/1.5/modello-plugins-1.5.pom
[INFO] Downloaded: https://repo.maven.apache.org/maven2/org/codehaus/modello/modello-plugins/1.5/modello-plugins-1.5.pom
(3 KB at 129.6 KB/sec)
[INFO] Downloading: https://repo.maven.apache.org/maven2/org/codehaus/modello/modello/1.5/modello-1.5.pom
[INFO] Downloaded: https://repo.maven.apache.org/maven2/org/codehaus/modello/modello/1.5/modello-1.5.pom
(24 KB at 1284.9 KB/sec)
[INFO] Downloading: https://repo.maven.apache.org/maven2/org/codehaus/modello/modello-core/1.5/modello-core-1.5.pom
[INFO] Downloaded: https://repo.maven.apache.org/maven2/org/codehaus/modello/modello-core/1.5/modello-core-1.5.pom
(2 KB at 91.4 KB/sec)
[INFO] Downloading: https://repo.maven.apache.org/maven2/org/antlr/stringtemplate/3.0/stringtemplate-3.0.pom
[INFO] Downloaded: https://repo.maven.apache.org/maven2/org/antlr/stringtemplate/3.0/stringtemplate-3.0.pom
(689 B at 42.1 KB/sec)
[INFO] Downloading: https://repo.maven.apache.org/maven2/org/apache/myfaces/core/myfaces-api/2.0.24/myfaces-api-2.0.24.jar
[INFO] Downloading: https://repo.maven.apache.org/maven2/ant/ant/1.6.2/ant-1.6.2.jar
[INFO] Downloading: https://repo.maven.apache.org/maven2/org/codehaus/modello/modello-plugin-java/1.5/modello-plugin-java-1.5.jar
[INFO] Downloading: https://repo.maven.apache.org/maven2/org/codehaus/modello/modello-core/1.5/modello-core-1.5.jar
[INFO] Downloading: https://repo.maven.apache.org/maven2/org/antlr/stringtemplate/3.0/stringtemplate-3.0.jar
[INFO] Downloaded: https://repo.maven.apache.org/maven2/org/codehaus/modello/modello-core/1.5/modello-core-1.5.jar
(57 KB at 1418.0 KB/sec)
[INFO] Downloaded: https://repo.maven.apache.org/maven2/org/codehaus/modello/modello-plugin-java/1.5/modello-plugin-java-1.5.jar
(82 KB at 1902.3 KB/sec)
[INFO] Downloaded: https://repo.maven.apache.org/maven2/org/antlr/stringtemplate/3.0/stringtemplate-3.0.jar
(125 KB at 2901.1 KB/sec)
[INFO] Downloaded: https://repo.maven.apache.org/maven2/org/apache/myfaces/core/myfaces-api/2.0.24/myfaces-api-2.0.24.jar
(1113 KB at 11586.3 KB/sec)
[INFO] Downloaded: https://repo.maven.apache.org/maven2/ant/ant/1.6.2/ant-1.6.2.jar (977 KB
at 9389.7 KB/sec)
[INFO] 
[INFO] --- maven-clean-plugin:2.6.1:clean (default-clean) @ tobago-tool-apt ---
[INFO] 
[INFO] --- animal-sniffer-maven-plugin:1.14:check (default-cli) @ tobago-tool-apt ---
[INFO] Checking unresolved references to org.codehaus.mojo.signature:java16:1.0
[INFO] Downloading: https://repo.maven.apache.org/maven2/org/codehaus/mojo/signature/java16/1.0/java16-1.0.signature
[INFO] Downloaded: https://repo.maven.apache.org/maven2/org/codehaus/mojo/signature/java16/1.0/java16-1.0.signature
(579 KB at 11348.2 KB/sec)
[INFO] 
[INFO] --- maven-checkstyle-plugin:2.17:check (default-cli) @ tobago-tool-apt ---
[INFO] Starting audit...
Audit done.
[INFO] 
[INFO] --- maven-enforcer-plugin:1.4.1:enforce (enforce) @ tobago-tool-apt ---
[INFO] 
[INFO] --- maven-remote-resources-plugin:1.5:process (default) @ tobago-tool-apt ---
[INFO] 
[INFO] --- maven-resources-plugin:2.7:resources (default-resources) @ tobago-tool-apt ---
[INFO] Using 'UTF-8' encoding to copy filtered resources.
[INFO] Copying 1 resource
[INFO] Copying 3 resources
[INFO] 
[INFO] --- maven-compiler-plugin:3.5.1:compile (default-compile) @ tobago-tool-apt ---
[INFO] Compiling 14 source files to <https://builds.apache.org/job/Tobago%20Trunk/ws/tobago-trunk/tobago-tool/tobago-tool-apt/target/classes>
[WARNING] bootstrap class path not set in conjunction with -source 1.6
[INFO] <https://builds.apache.org/job/Tobago%20Trunk/ws/tobago-trunk/tobago-tool/tobago-tool-apt/src/main/java/org/apache/myfaces/tobago/apt/processor/FacesConfigGenerator.java>:
<https://builds.apache.org/job/Tobago%20Trunk/ws/tobago-trunk/tobago-tool/tobago-tool-apt/src/main/java/org/apache/myfaces/tobago/apt/processor/FacesConfigGenerator.java>
uses unchecked or unsafe operations.
[INFO] <https://builds.apache.org/job/Tobago%20Trunk/ws/tobago-trunk/tobago-tool/tobago-tool-apt/src/main/java/org/apache/myfaces/tobago/apt/processor/FacesConfigGenerator.java>:
Recompile with -Xlint:unchecked for details.
[INFO] 
[INFO] --- maven-resources-plugin:2.7:testResources (default-testResources) @ tobago-tool-apt
---
[INFO] Using 'UTF-8' encoding to copy filtered resources.
[INFO] skip non existing resourceDirectory <https://builds.apache.org/job/Tobago%20Trunk/ws/tobago-trunk/tobago-tool/tobago-tool-apt/src/test/resources>
[INFO] Copying 3 resources
[INFO] 
[INFO] --- maven-compiler-plugin:3.5.1:testCompile (default-testCompile) @ tobago-tool-apt
---
[INFO] Compiling 1 source file to <https://builds.apache.org/job/Tobago%20Trunk/ws/tobago-trunk/tobago-tool/tobago-tool-apt/target/test-classes>
[WARNING] bootstrap class path not set in conjunction with -source 1.6
[INFO] 
[INFO] --- maven-surefire-plugin:2.19.1:test (default-test) @ tobago-tool-apt ---

-------------------------------------------------------
 T E S T S
-------------------------------------------------------
Running org.apache.myfaces.tobago.apt.processor.CheckstyleConfigGeneratorUnitTest
Tests run: 1, Failures: 0, Errors: 0, Skipped: 0, Time elapsed: 0.038 sec - in org.apache.myfaces.tobago.apt.processor.CheckstyleConfigGeneratorUnitTest

Results :

Tests run: 1, Failures: 0, Errors: 0, Skipped: 0

[JENKINS] Recording test results
[INFO] 
[INFO] --- maven-jar-plugin:2.6:jar (default-jar) @ tobago-tool-apt ---
[INFO] Building jar: <https://builds.apache.org/job/Tobago%20Trunk/ws/tobago-trunk/tobago-tool/tobago-tool-apt/target/tobago-tool-apt-3.1.0-SNAPSHOT.jar>
[INFO] 
[INFO] --- maven-site-plugin:3.5.1:attach-descriptor (attach-descriptor) @ tobago-tool-apt
---
[INFO] 
[INFO] --- maven-install-plugin:2.5.2:install (default-install) @ tobago-tool-apt ---
[INFO] Installing <https://builds.apache.org/job/Tobago%20Trunk/ws/tobago-trunk/tobago-tool/tobago-tool-apt/target/tobago-tool-apt-3.1.0-SNAPSHOT.jar>
to /home/jenkins/jenkins-slave/maven-repositories/1/org/apache/myfaces/tobago/tobago-tool-apt/3.1.0-SNAPSHOT/tobago-tool-apt-3.1.0-SNAPSHOT.jar
[INFO] Installing <https://builds.apache.org/job/Tobago%20Trunk/ws/tobago-trunk/tobago-tool/tobago-tool-apt/pom.xml>
to /home/jenkins/jenkins-slave/maven-repositories/1/org/apache/myfaces/tobago/tobago-tool-apt/3.1.0-SNAPSHOT/tobago-tool-apt-3.1.0-SNAPSHOT.pom
[INFO]                                                                         
[INFO] ------------------------------------------------------------------------
[INFO] Building Tobago Core 3.1.0-SNAPSHOT
[INFO] ------------------------------------------------------------------------
[INFO] Downloading: https://repo.maven.apache.org/maven2/org/apache/myfaces/test/myfaces-test20/1.0.7/myfaces-test20-1.0.7.pom
[INFO] Downloaded: https://repo.maven.apache.org/maven2/org/apache/myfaces/test/myfaces-test20/1.0.7/myfaces-test20-1.0.7.pom
(10 KB at 516.0 KB/sec)
[INFO] Downloading: https://repo.maven.apache.org/maven2/org/jsoup/jsoup/1.8.2/jsoup-1.8.2.pom
[INFO] Downloaded: https://repo.maven.apache.org/maven2/org/jsoup/jsoup/1.8.2/jsoup-1.8.2.pom
(7 KB at 408.3 KB/sec)
[INFO] Downloading: https://repo.maven.apache.org/maven2/org/apache/myfaces/test/myfaces-test20/1.0.7/myfaces-test20-1.0.7.jar
[INFO] Downloading: https://repo.maven.apache.org/maven2/org/jsoup/jsoup/1.8.2/jsoup-1.8.2.jar
[INFO] Downloaded: https://repo.maven.apache.org/maven2/org/jsoup/jsoup/1.8.2/jsoup-1.8.2.jar
(308 KB at 8544.3 KB/sec)
[INFO] Downloaded: https://repo.maven.apache.org/maven2/org/apache/myfaces/test/myfaces-test20/1.0.7/myfaces-test20-1.0.7.jar
(276 KB at 6552.7 KB/sec)
[INFO] 
[INFO] --- maven-clean-plugin:2.6.1:clean (default-clean) @ tobago-core ---
[INFO] 
[INFO] --- animal-sniffer-maven-plugin:1.14:check (default-cli) @ tobago-core ---
[INFO] Checking unresolved references to org.codehaus.mojo.signature:java16:1.1
[INFO] 
[INFO] --- maven-checkstyle-plugin:2.17:check (default-cli) @ tobago-core ---
[INFO] Starting audit...
<https://builds.apache.org/job/Tobago%20Trunk/ws/tobago-trunk/tobago-core/src/main/java/org/apache/myfaces/tobago/internal/config/TobagoConfigParser.java>:89:18:
error: Name 'VERSION' must match pattern '^[a-z][a-zA-Z0-9]*$'.
Audit done.
[INFO] There is 1 error reported by Checkstyle 6.11.2 with tobago/checkstyle.xml ruleset.
[ERROR] src/main/java/org/apache/myfaces/tobago/internal/config/TobagoConfigParser.java:[89,18]
(naming) MemberName: Name 'VERSION' must match pattern '^[a-z][a-zA-Z0-9]*$'.
[INFO] ------------------------------------------------------------------------
[INFO] Reactor Summary:
[INFO] 
[INFO] Apache Tobago ...................................... SUCCESS [  7.700 s]
[INFO] Tobago Tool ........................................ SUCCESS [  1.945 s]
[INFO] Tobago Tool Annotation ............................. SUCCESS [  3.952 s]
[INFO] Tobago Tool Apt .................................... SUCCESS [ 10.300 s]
[INFO] Tobago Core ........................................ FAILURE [  3.217 s]
[INFO] Tobago Themes ...................................... SKIPPED
[INFO] Tobago Theme Standard .............................. SKIPPED
[INFO] Tobago Theme Speyside .............................. SKIPPED
[INFO] Tobago Extensions .................................. SKIPPED
[INFO] Tobago Sandbox ..................................... SKIPPED
[INFO] Tobago Examples .................................... SKIPPED
[INFO] Tobago Example Blank ............................... SKIPPED
[INFO] Tobago Example Data ................................ SKIPPED
[INFO] Tobago Example Demo ................................ SKIPPED
[INFO] Tobago Example for Portlets ........................ SKIPPED
[INFO] Tobago Example Assembly ............................ SKIPPED
[INFO] Tobago Assembly .................................... SKIPPED
[INFO] ------------------------------------------------------------------------
[INFO] BUILD FAILURE
[INFO] ------------------------------------------------------------------------
[INFO] Total time: 34.512 s
[INFO] Finished at: 2017-02-15T18:46:58+00:00
[INFO] Final Memory: 45M/531M
[INFO] ------------------------------------------------------------------------
Waiting for Jenkins to finish collecting data
[ERROR] Failed to execute goal org.apache.maven.plugins:maven-checkstyle-plugin:2.17:check
(default-cli) on project tobago-core: You have 1 Checkstyle violation. -> [Help 1]
[ERROR] 
[ERROR] To see the full stack trace of the errors, re-run Maven with the -e switch.
[ERROR] Re-run Maven using the -X switch to enable full debug logging.
[ERROR] 
[ERROR] For more information about the errors and possible solutions, please read the following
articles:
[ERROR] [Help 1] http://cwiki.apache.org/confluence/display/MAVEN/MojoFailureException
[ERROR] 
[ERROR] After correcting the problems, you can resume the build with the command
[ERROR]   mvn <goals> -rf :tobago-core
[JENKINS] Archiving <https://builds.apache.org/job/Tobago%20Trunk/ws/tobago-trunk/tobago-theme/pom.xml>
to org.apache.myfaces.tobago/tobago-theme/3.1.0-SNAPSHOT/tobago-theme-3.1.0-SNAPSHOT.pom
[JENKINS] Archiving <https://builds.apache.org/job/Tobago%20Trunk/ws/tobago-trunk/tobago-example/tobago-example-blank/pom.xml>
to org.apache.myfaces.tobago/tobago-example-blank/3.1.0-SNAPSHOT/tobago-example-blank-3.1.0-SNAPSHOT.pom
[JENKINS] Archiving <https://builds.apache.org/job/Tobago%20Trunk/ws/tobago-trunk/tobago-assembly/pom.xml>
to org.apache.myfaces.tobago/tobago-assembly/3.1.0-SNAPSHOT/tobago-assembly-3.1.0-SNAPSHOT.pom
[JENKINS] Archiving <https://builds.apache.org/job/Tobago%20Trunk/ws/tobago-trunk/pom.xml>
to org.apache.myfaces.tobago/tobago/3.1.0-SNAPSHOT/tobago-3.1.0-SNAPSHOT.pom
[JENKINS] Archiving <https://builds.apache.org/job/Tobago%20Trunk/ws/tobago-trunk/target/tobago-3.1.0-SNAPSHOT-site.xml>
to org.apache.myfaces.tobago/tobago/3.1.0-SNAPSHOT/tobago-3.1.0-SNAPSHOT-site.xml
Compressed 51.37 KB of artifacts by 62.3% relative to #778
[JENKINS] Archiving <https://builds.apache.org/job/Tobago%20Trunk/ws/tobago-trunk/tobago-theme/tobago-theme-standard/pom.xml>
to org.apache.myfaces.tobago/tobago-theme-standard/3.1.0-SNAPSHOT/tobago-theme-standard-3.1.0-SNAPSHOT.pom
[JENKINS] Archiving <https://builds.apache.org/job/Tobago%20Trunk/ws/tobago-trunk/tobago-example/tobago-example-assembly/pom.xml>
to org.apache.myfaces.tobago/tobago-example-assembly/3.1.0-SNAPSHOT/tobago-example-assembly-3.1.0-SNAPSHOT.pom
[JENKINS] Archiving <https://builds.apache.org/job/Tobago%20Trunk/ws/tobago-trunk/tobago-theme/tobago-theme-speyside/pom.xml>
to org.apache.myfaces.tobago/tobago-theme-speyside/3.1.0-SNAPSHOT/tobago-theme-speyside-3.1.0-SNAPSHOT.pom
[JENKINS] Archiving <https://builds.apache.org/job/Tobago%20Trunk/ws/tobago-trunk/tobago-extension/pom.xml>
to org.apache.myfaces.tobago/tobago-extension/3.1.0-SNAPSHOT/tobago-extension-3.1.0-SNAPSHOT.pom
[JENKINS] Archiving <https://builds.apache.org/job/Tobago%20Trunk/ws/tobago-trunk/tobago-example/tobago-example-portlet/pom.xml>
to org.apache.myfaces.tobago/tobago-example-portlet/3.1.0-SNAPSHOT/tobago-example-portlet-3.1.0-SNAPSHOT.pom
[JENKINS] Archiving <https://builds.apache.org/job/Tobago%20Trunk/ws/tobago-trunk/tobago-tool/tobago-tool-annotation/pom.xml>
to org.apache.myfaces.tobago/tobago-tool-annotation/3.1.0-SNAPSHOT/tobago-tool-annotation-3.1.0-SNAPSHOT.pom
[JENKINS] Archiving <https://builds.apache.org/job/Tobago%20Trunk/ws/tobago-trunk/tobago-tool/tobago-tool-annotation/target/tobago-tool-annotation-3.1.0-SNAPSHOT.jar>
to org.apache.myfaces.tobago/tobago-tool-annotation/3.1.0-SNAPSHOT/tobago-tool-annotation-3.1.0-SNAPSHOT.jar
[JENKINS] Archiving <https://builds.apache.org/job/Tobago%20Trunk/ws/tobago-trunk/tobago-example/pom.xml>
to org.apache.myfaces.tobago/tobago-example/3.1.0-SNAPSHOT/tobago-example-3.1.0-SNAPSHOT.pom
[JENKINS] Archiving <https://builds.apache.org/job/Tobago%20Trunk/ws/tobago-trunk/tobago-example/tobago-example-data/pom.xml>
to org.apache.myfaces.tobago/tobago-example-data/3.1.0-SNAPSHOT/tobago-example-data-3.1.0-SNAPSHOT.pom
[JENKINS] Archiving <https://builds.apache.org/job/Tobago%20Trunk/ws/tobago-trunk/tobago-tool/pom.xml>
to org.apache.myfaces.tobago/tobago-tool/3.1.0-SNAPSHOT/tobago-tool-3.1.0-SNAPSHOT.pom
[JENKINS] Archiving <https://builds.apache.org/job/Tobago%20Trunk/ws/tobago-trunk/tobago-core/pom.xml>
to org.apache.myfaces.tobago/tobago-core/3.1.0-SNAPSHOT/tobago-core-3.1.0-SNAPSHOT.pom
[JENKINS] Archiving <https://builds.apache.org/job/Tobago%20Trunk/ws/tobago-trunk/tobago-tool/tobago-tool-apt/pom.xml>
to org.apache.myfaces.tobago/tobago-tool-apt/3.1.0-SNAPSHOT/tobago-tool-apt-3.1.0-SNAPSHOT.pom
[JENKINS] Archiving <https://builds.apache.org/job/Tobago%20Trunk/ws/tobago-trunk/tobago-tool/tobago-tool-apt/target/tobago-tool-apt-3.1.0-SNAPSHOT.jar>
to org.apache.myfaces.tobago/tobago-tool-apt/3.1.0-SNAPSHOT/tobago-tool-apt-3.1.0-SNAPSHOT.jar
[JENKINS] Archiving <https://builds.apache.org/job/Tobago%20Trunk/ws/tobago-trunk/tobago-extension/tobago-sandbox/pom.xml>
to org.apache.myfaces.tobago/tobago-sandbox/3.1.0-SNAPSHOT/tobago-sandbox-3.1.0-SNAPSHOT.pom
[JENKINS] Archiving <https://builds.apache.org/job/Tobago%20Trunk/ws/tobago-trunk/tobago-example/tobago-example-demo/pom.xml>
to org.apache.myfaces.tobago/tobago-example-demo/3.1.0-SNAPSHOT/tobago-example-demo-3.1.0-SNAPSHOT.pom
Sending e-mails to: commits@myfaces.apache.org
channel stopped
Updating TOBAGO-1700

Mime
View raw message