myfaces-commits mailing list archives

Site index · List index
Message view « Date » · « Thread »
Top « Date » · « Thread »
From Apache Jenkins Server <jenk...@builds.apache.org>
Subject Build failed in Jenkins: Tobago Trunk #768
Date Wed, 08 Feb 2017 22:48:01 GMT
See <https://builds.apache.org/job/Tobago%20Trunk/768/changes>

Changes:

[lofwyr] TOBAGO-1698: Update some build libs
* checkstyle: UnnecessaryParentheses

------------------------------------------
[...truncated 4017 lines...]
[INFO] 
[INFO] --- maven-resources-plugin:2.7:resources (default-resources) @ tobago-sandbox ---
[INFO] Using 'UTF-8' encoding to copy filtered resources.
[INFO] Copying 5 resources
[INFO] Copying 3 resources
[INFO] 
[INFO] --- maven-compiler-plugin:3.5.1:compile (default-compile) @ tobago-sandbox ---
[INFO] Compiling 9 source files to <https://builds.apache.org/job/Tobago%20Trunk/ws/tobago-trunk/tobago-extension/tobago-sandbox/target/classes>
[WARNING] bootstrap class path not set in conjunction with -source 1.6
[INFO] <https://builds.apache.org/job/Tobago%20Trunk/ws/tobago-trunk/tobago-extension/tobago-sandbox/src/main/java/org/apache/myfaces/tobago/renderkit/html/sandbox/standard/tag/NumberSliderRenderer.java>:
<https://builds.apache.org/job/Tobago%20Trunk/ws/tobago-trunk/tobago-extension/tobago-sandbox/src/main/java/org/apache/myfaces/tobago/renderkit/html/sandbox/standard/tag/NumberSliderRenderer.java>
uses or overrides a deprecated API.
[INFO] <https://builds.apache.org/job/Tobago%20Trunk/ws/tobago-trunk/tobago-extension/tobago-sandbox/src/main/java/org/apache/myfaces/tobago/renderkit/html/sandbox/standard/tag/NumberSliderRenderer.java>:
Recompile with -Xlint:deprecation for details.
[INFO] 
[INFO] --- maven-compiler-plugin:3.5.1:compile (compile) @ tobago-sandbox ---
[INFO] Nothing to compile - all classes are up to date
[INFO] 
[INFO] --- maven-resources-plugin:2.7:copy-resources (copy-resources) @ tobago-sandbox ---
[INFO] Using 'UTF-8' encoding to copy filtered resources.
[INFO] Copying 2 resources
[INFO] 
[INFO] --- maven-resources-plugin:2.7:copy-resources (copy-tld) @ tobago-sandbox ---
[INFO] Using 'UTF-8' encoding to copy filtered resources.
[INFO] Copying 4 resources to META-INF
[INFO] 
[INFO] --- maven-resources-plugin:2.7:testResources (default-testResources) @ tobago-sandbox
---
[INFO] Using 'UTF-8' encoding to copy filtered resources.
[INFO] skip non existing resourceDirectory <https://builds.apache.org/job/Tobago%20Trunk/ws/tobago-trunk/tobago-extension/tobago-sandbox/src/test/resources>
[INFO] Copying 3 resources
[INFO] 
[INFO] --- maven-compiler-plugin:3.5.1:testCompile (default-testCompile) @ tobago-sandbox
---
[INFO] Nothing to compile - all classes are up to date
[INFO] 
[INFO] --- maven-surefire-plugin:2.19.1:test (default-test) @ tobago-sandbox ---
[JENKINS] Recording test results
[INFO] 
[INFO] --- maven-jar-plugin:2.6:jar (default-jar) @ tobago-sandbox ---
[INFO] Building jar: <https://builds.apache.org/job/Tobago%20Trunk/ws/tobago-trunk/tobago-extension/tobago-sandbox/target/tobago-sandbox-3.1.0-SNAPSHOT.jar>
[INFO] 
[INFO] --- maven-site-plugin:3.5.1:attach-descriptor (attach-descriptor) @ tobago-sandbox
---
[INFO] 
[INFO] --- maven-install-plugin:2.5.2:install (default-install) @ tobago-sandbox ---
[INFO] Installing <https://builds.apache.org/job/Tobago%20Trunk/ws/tobago-trunk/tobago-extension/tobago-sandbox/target/tobago-sandbox-3.1.0-SNAPSHOT.jar>
to /home/jenkins/jenkins-slave/maven-repositories/0/org/apache/myfaces/tobago/tobago-sandbox/3.1.0-SNAPSHOT/tobago-sandbox-3.1.0-SNAPSHOT.jar
[INFO] Installing <https://builds.apache.org/job/Tobago%20Trunk/ws/tobago-trunk/tobago-extension/tobago-sandbox/pom.xml>
to /home/jenkins/jenkins-slave/maven-repositories/0/org/apache/myfaces/tobago/tobago-sandbox/3.1.0-SNAPSHOT/tobago-sandbox-3.1.0-SNAPSHOT.pom
[INFO]                                                                         
[INFO] ------------------------------------------------------------------------
[INFO] Building Tobago Examples 3.1.0-SNAPSHOT
[INFO] ------------------------------------------------------------------------
[INFO] 
[INFO] --- maven-clean-plugin:2.6.1:clean (default-clean) @ tobago-example ---
[INFO] 
[INFO] --- animal-sniffer-maven-plugin:1.14:check (default-cli) @ tobago-example ---
[INFO] Checking unresolved references to org.codehaus.mojo.signature:java16:1.1
[INFO] 
[INFO] --- maven-checkstyle-plugin:2.17:check (default-cli) @ tobago-example ---
[INFO] Starting audit...
Audit done.
[INFO] 
[INFO] --- maven-enforcer-plugin:1.4.1:enforce (enforce) @ tobago-example ---
[INFO] 
[INFO] --- maven-remote-resources-plugin:1.5:process (default) @ tobago-example ---
[INFO] 
[INFO] --- maven-site-plugin:3.5.1:attach-descriptor (attach-descriptor) @ tobago-example
---
[INFO] 
[INFO] --- maven-install-plugin:2.5.2:install (default-install) @ tobago-example ---
[INFO] Installing <https://builds.apache.org/job/Tobago%20Trunk/ws/tobago-trunk/tobago-example/pom.xml>
to /home/jenkins/jenkins-slave/maven-repositories/0/org/apache/myfaces/tobago/tobago-example/3.1.0-SNAPSHOT/tobago-example-3.1.0-SNAPSHOT.pom
[INFO]                                                                         
[INFO] ------------------------------------------------------------------------
[INFO] Building Tobago Example Blank 3.1.0-SNAPSHOT
[INFO] ------------------------------------------------------------------------
[INFO] 
[INFO] --- maven-clean-plugin:2.6.1:clean (default-clean) @ tobago-example-blank ---
[INFO] 
[INFO] --- animal-sniffer-maven-plugin:1.14:check (default-cli) @ tobago-example-blank ---
[INFO] Checking unresolved references to org.codehaus.mojo.signature:java16:1.1
[INFO] 
[INFO] --- maven-checkstyle-plugin:2.17:check (default-cli) @ tobago-example-blank ---
[INFO] Starting audit...
Audit done.
[INFO] 
[INFO] --- maven-enforcer-plugin:1.4.1:enforce (enforce) @ tobago-example-blank ---
[INFO] 
[INFO] --- maven-remote-resources-plugin:1.5:process (default) @ tobago-example-blank ---
[INFO] 
[INFO] --- maven-resources-plugin:2.7:resources (default-resources) @ tobago-example-blank
---
[INFO] Using 'UTF-8' encoding to copy filtered resources.
[INFO] Copying 1 resource
[INFO] Copying 3 resources
[INFO] 
[INFO] --- maven-compiler-plugin:3.5.1:compile (default-compile) @ tobago-example-blank ---
[INFO] Compiling 1 source file to <https://builds.apache.org/job/Tobago%20Trunk/ws/tobago-trunk/tobago-example/tobago-example-blank/target/classes>
[WARNING] bootstrap class path not set in conjunction with -source 1.6
[INFO] 
[INFO] --- maven-resources-plugin:2.7:testResources (default-testResources) @ tobago-example-blank
---
[INFO] Using 'UTF-8' encoding to copy filtered resources.
[INFO] skip non existing resourceDirectory <https://builds.apache.org/job/Tobago%20Trunk/ws/tobago-trunk/tobago-example/tobago-example-blank/src/test/resources>
[INFO] Copying 3 resources
[INFO] 
[INFO] --- maven-compiler-plugin:3.5.1:testCompile (default-testCompile) @ tobago-example-blank
---
[INFO] No sources to compile
[INFO] 
[INFO] --- maven-surefire-plugin:2.19.1:test (default-test) @ tobago-example-blank ---
[JENKINS] Recording test results
[INFO] 
[INFO] --- maven-war-plugin:2.6:war (default-war) @ tobago-example-blank ---
[INFO] Packaging webapp
[INFO] Assembling webapp [tobago-example-blank] in [<https://builds.apache.org/job/Tobago%20Trunk/ws/tobago-trunk/tobago-example/tobago-example-blank/target/tobago-example-blank]>
[INFO] Processing war project
[INFO] Copying webapp resources [<https://builds.apache.org/job/Tobago%20Trunk/ws/tobago-trunk/tobago-example/tobago-example-blank/src/main/webapp]>
[INFO] Webapp assembled in [52 msecs]
[INFO] Building war: <https://builds.apache.org/job/Tobago%20Trunk/ws/tobago-trunk/tobago-example/tobago-example-blank/target/tobago-example-blank.war>
[INFO] 
[INFO] --- maven-site-plugin:3.5.1:attach-descriptor (attach-descriptor) @ tobago-example-blank
---
[INFO] 
[INFO] --- maven-install-plugin:2.5.2:install (default-install) @ tobago-example-blank ---
[INFO] Installing <https://builds.apache.org/job/Tobago%20Trunk/ws/tobago-trunk/tobago-example/tobago-example-blank/target/tobago-example-blank.war>
to /home/jenkins/jenkins-slave/maven-repositories/0/org/apache/myfaces/tobago/tobago-example-blank/3.1.0-SNAPSHOT/tobago-example-blank-3.1.0-SNAPSHOT.war
[INFO] Installing <https://builds.apache.org/job/Tobago%20Trunk/ws/tobago-trunk/tobago-example/tobago-example-blank/pom.xml>
to /home/jenkins/jenkins-slave/maven-repositories/0/org/apache/myfaces/tobago/tobago-example-blank/3.1.0-SNAPSHOT/tobago-example-blank-3.1.0-SNAPSHOT.pom
[INFO]                                                                         
[INFO] ------------------------------------------------------------------------
[INFO] Building Tobago Example Data 3.1.0-SNAPSHOT
[INFO] ------------------------------------------------------------------------
[INFO] 
[INFO] --- maven-clean-plugin:2.6.1:clean (default-clean) @ tobago-example-data ---
[INFO] 
[INFO] --- animal-sniffer-maven-plugin:1.14:check (default-cli) @ tobago-example-data ---
[INFO] Checking unresolved references to org.codehaus.mojo.signature:java16:1.1
[INFO] 
[INFO] --- maven-checkstyle-plugin:2.17:check (default-cli) @ tobago-example-data ---
[INFO] Starting audit...
Audit done.
[INFO] 
[INFO] --- maven-enforcer-plugin:1.4.1:enforce (enforce) @ tobago-example-data ---
[INFO] 
[INFO] --- maven-remote-resources-plugin:1.5:process (default) @ tobago-example-data ---
[INFO] 
[INFO] --- maven-resources-plugin:2.7:resources (default-resources) @ tobago-example-data
---
[INFO] Using 'UTF-8' encoding to copy filtered resources.
[INFO] Copying 10 resources
[INFO] Copying 3 resources
[INFO] 
[INFO] --- maven-compiler-plugin:3.5.1:compile (default-compile) @ tobago-example-data ---
[INFO] Compiling 16 source files to <https://builds.apache.org/job/Tobago%20Trunk/ws/tobago-trunk/tobago-example/tobago-example-data/target/classes>
[WARNING] bootstrap class path not set in conjunction with -source 1.6
[INFO] 
[INFO] --- maven-resources-plugin:2.7:testResources (default-testResources) @ tobago-example-data
---
[INFO] Using 'UTF-8' encoding to copy filtered resources.
[INFO] skip non existing resourceDirectory <https://builds.apache.org/job/Tobago%20Trunk/ws/tobago-trunk/tobago-example/tobago-example-data/src/test/resources>
[INFO] Copying 3 resources
[INFO] 
[INFO] --- maven-compiler-plugin:3.5.1:testCompile (default-testCompile) @ tobago-example-data
---
[INFO] No sources to compile
[INFO] 
[INFO] --- maven-surefire-plugin:2.19.1:test (default-test) @ tobago-example-data ---
[JENKINS] Recording test results
[INFO] 
[INFO] --- maven-jar-plugin:2.6:jar (default-jar) @ tobago-example-data ---
[INFO] Building jar: <https://builds.apache.org/job/Tobago%20Trunk/ws/tobago-trunk/tobago-example/tobago-example-data/target/tobago-example-data-3.1.0-SNAPSHOT.jar>
[INFO] 
[INFO] --- maven-site-plugin:3.5.1:attach-descriptor (attach-descriptor) @ tobago-example-data
---
[INFO] 
[INFO] --- maven-install-plugin:2.5.2:install (default-install) @ tobago-example-data ---
[INFO] Installing <https://builds.apache.org/job/Tobago%20Trunk/ws/tobago-trunk/tobago-example/tobago-example-data/target/tobago-example-data-3.1.0-SNAPSHOT.jar>
to /home/jenkins/jenkins-slave/maven-repositories/0/org/apache/myfaces/tobago/tobago-example-data/3.1.0-SNAPSHOT/tobago-example-data-3.1.0-SNAPSHOT.jar
[INFO] Installing <https://builds.apache.org/job/Tobago%20Trunk/ws/tobago-trunk/tobago-example/tobago-example-data/pom.xml>
to /home/jenkins/jenkins-slave/maven-repositories/0/org/apache/myfaces/tobago/tobago-example-data/3.1.0-SNAPSHOT/tobago-example-data-3.1.0-SNAPSHOT.pom
[INFO]                                                                         
[INFO] ------------------------------------------------------------------------
[INFO] Building Tobago Example Demo 3.1.0-SNAPSHOT
[INFO] ------------------------------------------------------------------------
[INFO] 
[INFO] --- maven-clean-plugin:2.6.1:clean (default-clean) @ tobago-example-demo ---
[INFO] 
[INFO] --- animal-sniffer-maven-plugin:1.14:check (default-cli) @ tobago-example-demo ---
[INFO] Checking unresolved references to org.codehaus.mojo.signature:java16:1.1
[INFO] 
[INFO] --- maven-checkstyle-plugin:2.17:check (default-cli) @ tobago-example-demo ---
[INFO] Starting audit...
<https://builds.apache.org/job/Tobago%20Trunk/ws/tobago-trunk/tobago-example/tobago-example-demo/src/test/resources/realm.properties>:1:
error: Line does not match expected header line of '/*'.
Audit done.
[INFO] There is 1 error reported by Checkstyle 6.11.2 with tobago/checkstyle.xml ruleset.
[ERROR] src/test/resources/realm.properties:[1] (header) Header: Line does not match expected
header line of '/*'.
[INFO] ------------------------------------------------------------------------
[INFO] Reactor Summary:
[INFO] 
[INFO] Apache Tobago ...................................... SUCCESS [  5.099 s]
[INFO] Tobago Tool ........................................ SUCCESS [  1.201 s]
[INFO] Tobago Tool Annotation ............................. SUCCESS [  3.996 s]
[INFO] Tobago Tool Apt .................................... SUCCESS [ 11.134 s]
[INFO] Tobago Core ........................................ SUCCESS [ 17.758 s]
[INFO] Tobago Themes ...................................... SUCCESS [  1.297 s]
[INFO] Tobago Theme Standard .............................. SUCCESS [  9.687 s]
[INFO] Tobago Theme Speyside .............................. SUCCESS [  1.859 s]
[INFO] Tobago Extensions .................................. SUCCESS [  1.217 s]
[INFO] Tobago Sandbox ..................................... SUCCESS [  4.200 s]
[INFO] Tobago Examples .................................... SUCCESS [  1.410 s]
[INFO] Tobago Example Blank ............................... SUCCESS [  2.632 s]
[INFO] Tobago Example Data ................................ SUCCESS [  1.986 s]
[INFO] Tobago Example Demo ................................ FAILURE [  1.828 s]
[INFO] Tobago Example for Portlets ........................ SKIPPED
[INFO] Tobago Example Assembly ............................ SKIPPED
[INFO] Tobago Assembly .................................... SKIPPED
[INFO] ------------------------------------------------------------------------
[INFO] BUILD FAILURE
[INFO] ------------------------------------------------------------------------
[INFO] Total time: 01:18 min
[INFO] Finished at: 2017-02-08T22:47:35+00:00
[INFO] Final Memory: 88M/896M
[INFO] ------------------------------------------------------------------------
Waiting for Jenkins to finish collecting data
[ERROR] Failed to execute goal org.apache.maven.plugins:maven-checkstyle-plugin:2.17:check
(default-cli) on project tobago-example-demo: You have 1 Checkstyle violation. -> [Help
1]
[ERROR] 
[ERROR] To see the full stack trace of the errors, re-run Maven with the -e switch.
[ERROR] Re-run Maven using the -X switch to enable full debug logging.
[ERROR] 
[ERROR] For more information about the errors and possible solutions, please read the following
articles:
[ERROR] [Help 1] http://cwiki.apache.org/confluence/display/MAVEN/MojoFailureException
[ERROR] 
[ERROR] After correcting the problems, you can resume the build with the command
[ERROR]   mvn <goals> -rf :tobago-example-demo
[JENKINS] Archiving <https://builds.apache.org/job/Tobago%20Trunk/ws/tobago-trunk/tobago-theme/pom.xml>
to org.apache.myfaces.tobago/tobago-theme/3.1.0-SNAPSHOT/tobago-theme-3.1.0-SNAPSHOT.pom
[JENKINS] Archiving <https://builds.apache.org/job/Tobago%20Trunk/ws/tobago-trunk/tobago-example/tobago-example-blank/pom.xml>
to org.apache.myfaces.tobago/tobago-example-blank/3.1.0-SNAPSHOT/tobago-example-blank-3.1.0-SNAPSHOT.pom
[JENKINS] Archiving <https://builds.apache.org/job/Tobago%20Trunk/ws/tobago-trunk/tobago-example/tobago-example-blank/target/tobago-example-blank.war>
to org.apache.myfaces.tobago/tobago-example-blank/3.1.0-SNAPSHOT/tobago-example-blank-3.1.0-SNAPSHOT.war
Compressed 7.00 MB of artifacts by 72.4% relative to #767
[JENKINS] Archiving <https://builds.apache.org/job/Tobago%20Trunk/ws/tobago-trunk/tobago-assembly/pom.xml>
to org.apache.myfaces.tobago/tobago-assembly/3.1.0-SNAPSHOT/tobago-assembly-3.1.0-SNAPSHOT.pom
[JENKINS] Archiving <https://builds.apache.org/job/Tobago%20Trunk/ws/tobago-trunk/pom.xml>
to org.apache.myfaces.tobago/tobago/3.1.0-SNAPSHOT/tobago-3.1.0-SNAPSHOT.pom
[JENKINS] Archiving <https://builds.apache.org/job/Tobago%20Trunk/ws/tobago-trunk/target/tobago-3.1.0-SNAPSHOT-site.xml>
to org.apache.myfaces.tobago/tobago/3.1.0-SNAPSHOT/tobago-3.1.0-SNAPSHOT-site.xml
Compressed 50.89 KB of artifacts by 62.9% relative to #767
[JENKINS] Archiving <https://builds.apache.org/job/Tobago%20Trunk/ws/tobago-trunk/tobago-theme/tobago-theme-standard/pom.xml>
to org.apache.myfaces.tobago/tobago-theme-standard/3.1.0-SNAPSHOT/tobago-theme-standard-3.1.0-SNAPSHOT.pom
[JENKINS] Archiving <https://builds.apache.org/job/Tobago%20Trunk/ws/tobago-trunk/tobago-theme/tobago-theme-standard/target/tobago-theme-standard-3.1.0-SNAPSHOT.jar>
to org.apache.myfaces.tobago/tobago-theme-standard/3.1.0-SNAPSHOT/tobago-theme-standard-3.1.0-SNAPSHOT.jar
Compressed 1.23 MB of artifacts by 45.8% relative to #767
[JENKINS] Archiving <https://builds.apache.org/job/Tobago%20Trunk/ws/tobago-trunk/tobago-example/tobago-example-assembly/pom.xml>
to org.apache.myfaces.tobago/tobago-example-assembly/3.1.0-SNAPSHOT/tobago-example-assembly-3.1.0-SNAPSHOT.pom
[JENKINS] Archiving <https://builds.apache.org/job/Tobago%20Trunk/ws/tobago-trunk/tobago-theme/tobago-theme-speyside/pom.xml>
to org.apache.myfaces.tobago/tobago-theme-speyside/3.1.0-SNAPSHOT/tobago-theme-speyside-3.1.0-SNAPSHOT.pom
[JENKINS] Archiving <https://builds.apache.org/job/Tobago%20Trunk/ws/tobago-trunk/tobago-theme/tobago-theme-speyside/target/tobago-theme-speyside-3.1.0-SNAPSHOT.jar>
to org.apache.myfaces.tobago/tobago-theme-speyside/3.1.0-SNAPSHOT/tobago-theme-speyside-3.1.0-SNAPSHOT.jar
[JENKINS] Archiving <https://builds.apache.org/job/Tobago%20Trunk/ws/tobago-trunk/tobago-extension/pom.xml>
to org.apache.myfaces.tobago/tobago-extension/3.1.0-SNAPSHOT/tobago-extension-3.1.0-SNAPSHOT.pom
[JENKINS] Archiving <https://builds.apache.org/job/Tobago%20Trunk/ws/tobago-trunk/tobago-example/tobago-example-portlet/pom.xml>
to org.apache.myfaces.tobago/tobago-example-portlet/3.1.0-SNAPSHOT/tobago-example-portlet-3.1.0-SNAPSHOT.pom
[JENKINS] Archiving <https://builds.apache.org/job/Tobago%20Trunk/ws/tobago-trunk/tobago-tool/tobago-tool-annotation/pom.xml>
to org.apache.myfaces.tobago/tobago-tool-annotation/3.1.0-SNAPSHOT/tobago-tool-annotation-3.1.0-SNAPSHOT.pom
[JENKINS] Archiving <https://builds.apache.org/job/Tobago%20Trunk/ws/tobago-trunk/tobago-tool/tobago-tool-annotation/target/tobago-tool-annotation-3.1.0-SNAPSHOT.jar>
to org.apache.myfaces.tobago/tobago-tool-annotation/3.1.0-SNAPSHOT/tobago-tool-annotation-3.1.0-SNAPSHOT.jar
[JENKINS] Archiving <https://builds.apache.org/job/Tobago%20Trunk/ws/tobago-trunk/tobago-example/pom.xml>
to org.apache.myfaces.tobago/tobago-example/3.1.0-SNAPSHOT/tobago-example-3.1.0-SNAPSHOT.pom
[JENKINS] Archiving <https://builds.apache.org/job/Tobago%20Trunk/ws/tobago-trunk/tobago-example/tobago-example-data/pom.xml>
to org.apache.myfaces.tobago/tobago-example-data/3.1.0-SNAPSHOT/tobago-example-data-3.1.0-SNAPSHOT.pom
[JENKINS] Archiving <https://builds.apache.org/job/Tobago%20Trunk/ws/tobago-trunk/tobago-example/tobago-example-data/target/tobago-example-data-3.1.0-SNAPSHOT.jar>
to org.apache.myfaces.tobago/tobago-example-data/3.1.0-SNAPSHOT/tobago-example-data-3.1.0-SNAPSHOT.jar
[JENKINS] Archiving <https://builds.apache.org/job/Tobago%20Trunk/ws/tobago-trunk/tobago-tool/pom.xml>
to org.apache.myfaces.tobago/tobago-tool/3.1.0-SNAPSHOT/tobago-tool-3.1.0-SNAPSHOT.pom
[JENKINS] Archiving <https://builds.apache.org/job/Tobago%20Trunk/ws/tobago-trunk/tobago-core/pom.xml>
to org.apache.myfaces.tobago/tobago-core/3.1.0-SNAPSHOT/tobago-core-3.1.0-SNAPSHOT.pom
[JENKINS] Archiving <https://builds.apache.org/job/Tobago%20Trunk/ws/tobago-trunk/tobago-core/target/tobago-core-3.1.0-SNAPSHOT.jar>
to org.apache.myfaces.tobago/tobago-core/3.1.0-SNAPSHOT/tobago-core-3.1.0-SNAPSHOT.jar
[JENKINS] Archiving <https://builds.apache.org/job/Tobago%20Trunk/ws/tobago-trunk/tobago-core/target/tobago-core-3.1.0-SNAPSHOT-tests.jar>
to org.apache.myfaces.tobago/tobago-core/3.1.0-SNAPSHOT/tobago-core-3.1.0-SNAPSHOT-tests.jar
[JENKINS] Archiving <https://builds.apache.org/job/Tobago%20Trunk/ws/tobago-trunk/tobago-core/target/tobago-core-3.1.0-SNAPSHOT-sources.jar>
to org.apache.myfaces.tobago/tobago-core/3.1.0-SNAPSHOT/tobago-core-3.1.0-SNAPSHOT-sources.jar
[JENKINS] Archiving <https://builds.apache.org/job/Tobago%20Trunk/ws/tobago-trunk/tobago-tool/tobago-tool-apt/pom.xml>
to org.apache.myfaces.tobago/tobago-tool-apt/3.1.0-SNAPSHOT/tobago-tool-apt-3.1.0-SNAPSHOT.pom
[JENKINS] Archiving <https://builds.apache.org/job/Tobago%20Trunk/ws/tobago-trunk/tobago-tool/tobago-tool-apt/target/tobago-tool-apt-3.1.0-SNAPSHOT.jar>
to org.apache.myfaces.tobago/tobago-tool-apt/3.1.0-SNAPSHOT/tobago-tool-apt-3.1.0-SNAPSHOT.jar
[JENKINS] Archiving <https://builds.apache.org/job/Tobago%20Trunk/ws/tobago-trunk/tobago-extension/tobago-sandbox/pom.xml>
to org.apache.myfaces.tobago/tobago-sandbox/3.1.0-SNAPSHOT/tobago-sandbox-3.1.0-SNAPSHOT.pom
[JENKINS] Archiving <https://builds.apache.org/job/Tobago%20Trunk/ws/tobago-trunk/tobago-extension/tobago-sandbox/target/tobago-sandbox-3.1.0-SNAPSHOT.jar>
to org.apache.myfaces.tobago/tobago-sandbox/3.1.0-SNAPSHOT/tobago-sandbox-3.1.0-SNAPSHOT.jar
[JENKINS] Archiving <https://builds.apache.org/job/Tobago%20Trunk/ws/tobago-trunk/tobago-example/tobago-example-demo/pom.xml>
to org.apache.myfaces.tobago/tobago-example-demo/3.1.0-SNAPSHOT/tobago-example-demo-3.1.0-SNAPSHOT.pom
Sending e-mails to: commits@myfaces.apache.org
channel stopped
Updating TOBAGO-1698

Mime
View raw message