myfaces-commits mailing list archives

Site index · List index
Message view « Date » · « Thread »
Top « Date » · « Thread »
From Apache Jenkins Server <jenk...@builds.apache.org>
Subject Build failed in Jenkins: Tobago 1.5.x (deploy) #111
Date Tue, 07 Feb 2017 10:11:31 GMT
See <https://builds.apache.org/job/Tobago%201.5.x%20(deploy)/111/>

------------------------------------------
[...truncated 2893 lines...]
Downloading: http://repo1.maven.org/maven2/ch/qos/logback/logback-core/1.0.11/logback-core-1.0.11.pom
5K downloaded  (logback-core-1.0.11.pom)
Downloading: http://repo1.maven.org/maven2/org/apache/myfaces/core/myfaces-api/1.2.12/myfaces-api-1.2.12.jar
412K downloaded  (myfaces-api-1.2.12.jar)
Downloading: http://repo1.maven.org/maven2/org/codehaus/mojo/java-boot-classpath-detector/1.6/java-boot-classpath-detector-1.6.pom
2K downloaded  (java-boot-classpath-detector-1.6.pom)
Downloading: http://repo1.maven.org/maven2/org/codehaus/mojo/java-boot-classpath-detector/1.6/java-boot-classpath-detector-1.6.jar
4K downloaded  (java-boot-classpath-detector-1.6.jar)
[INFO] [animal-sniffer:check {execution: default-cli}]
[INFO] Checking unresolved references to org.codehaus.mojo.signature:java15:1.0
Downloading: http://repo1.maven.org/maven2/org/apache/maven/plugins/maven-site-plugin/2.3/maven-site-plugin-2.3.pom
14K downloaded  (maven-site-plugin-2.3.pom)
Downloading: http://repo1.maven.org/maven2/org/apache/maven/plugins/maven-plugins/20/maven-plugins-20.pom
12K downloaded  (maven-plugins-20.pom)
Downloading: http://repo1.maven.org/maven2/org/apache/maven/plugins/maven-site-plugin/2.3/maven-site-plugin-2.3.jar
96K downloaded  (maven-site-plugin-2.3.jar)
Downloading: http://repo1.maven.org/maven2/ch/qos/logback/logback-classic/1.0.11/logback-classic-1.0.11.jar
249K downloaded  (logback-classic-1.0.11.jar)
Downloading: http://repo1.maven.org/maven2/ch/qos/logback/logback-core/1.0.11/logback-core-1.0.11.jar
361K downloaded  (logback-core-1.0.11.jar)
Downloading: http://repo1.maven.org/maven2/org/apache/maven/wagon/wagon-webdav/1.0-beta-2/wagon-webdav-1.0-beta-2.pom
1K downloaded  (wagon-webdav-1.0-beta-2.pom)
Downloading: http://repo1.maven.org/maven2/slide/slide-webdavlib/2.1/slide-webdavlib-2.1.pom
648b downloaded  (slide-webdavlib-2.1.pom)
Downloading: http://repo1.maven.org/maven2/de/zeigermann/xml/xml-im-exporter/1.1/xml-im-exporter-1.1.pom
248b downloaded  (xml-im-exporter-1.1.pom)
Downloading: http://repo1.maven.org/maven2/org/apache/maven/enforcer/enforcer-api/1.1/enforcer-api-1.1.pom
3K downloaded  (enforcer-api-1.1.pom)
Downloading: http://repo1.maven.org/maven2/org/apache/maven/enforcer/enforcer-rules/1.1/enforcer-rules-1.1.pom
3K downloaded  (enforcer-rules-1.1.pom)
Downloading: http://repo1.maven.org/maven2/org/apache/maven/enforcer/enforcer-api/1.1/enforcer-api-1.1.jar
9K downloaded  (enforcer-api-1.1.jar)
Downloading: http://repo1.maven.org/maven2/org/apache/maven/enforcer/enforcer-rules/1.1/enforcer-rules-1.1.jar
66K downloaded  (enforcer-rules-1.1.jar)
[INFO] [enforcer:enforce {execution: enforce}]
[INFO] [buildnumber:create {execution: default}]
[INFO] Checking for local modifications: skipped.
[INFO] Updating project files from SCM: skipped.
[INFO] Executing: /bin/sh -c cd "<https://builds.apache.org/job/Tobago%201.5.x%20(deploy)/ws/trunk-1.5.x-deploy">
&& svn --non-interactive info
[INFO] Working directory: <https://builds.apache.org/job/Tobago%201.5.x%20(deploy)/ws/trunk-1.5.x-deploy>
[INFO] Storing buildNumber: 1781983 at timestamp: 1486462234422
[INFO] Executing: /bin/sh -c cd "<https://builds.apache.org/job/Tobago%201.5.x%20(deploy)/ws/trunk-1.5.x-deploy">
&& svn --non-interactive info
[INFO] Working directory: <https://builds.apache.org/job/Tobago%201.5.x%20(deploy)/ws/trunk-1.5.x-deploy>
[INFO] Storing buildScmBranch: branches/tobago-1.5.x
[INFO] [remote-resources:process {execution: default}]
[INFO] [build-helper:add-source {execution: default}]
[INFO] Source directory: <https://builds.apache.org/job/Tobago%201.5.x%20(deploy)/ws/trunk-1.5.x-deploy/src/main/java-jsf-1.2>
added.
Downloading: http://repo1.maven.org/maven2/org/mortbay/jetty/jetty/6.1.5/jetty-6.1.5.pom
4K downloaded  (jetty-6.1.5.pom)
Downloading: http://repo1.maven.org/maven2/org/mortbay/jetty/project/6.1.5/project-6.1.5.pom
12K downloaded  (project-6.1.5.pom)
Downloading: http://snapshots.repository.codehaus.org/org/mortbay/jetty/jetty-util/6.1.5/jetty-util-6.1.5.pom
[WARNING] Unable to get resource 'org.mortbay.jetty:jetty-util:pom:6.1.5' from repository
codehaus.org (http://snapshots.repository.codehaus.org): Error transferring file: snapshots.repository.codehaus.org
Downloading: http://people.apache.org/repo/m2-snapshot-repository//org/mortbay/jetty/jetty-util/6.1.5/jetty-util-6.1.5.pom
[INFO] Unable to find resource 'org.mortbay.jetty:jetty-util:pom:6.1.5' in repository apache.m2.incubator
(http://people.apache.org/repo/m2-snapshot-repository/)
Downloading: http://repo1.maven.org/maven2/org/mortbay/jetty/jetty-util/6.1.5/jetty-util-6.1.5.pom
3K downloaded  (jetty-util-6.1.5.pom)
Downloading: http://snapshots.repository.codehaus.org/org/mortbay/jetty/servlet-api-2.5/6.1.5/servlet-api-2.5-6.1.5.pom
[WARNING] Unable to get resource 'org.mortbay.jetty:servlet-api-2.5:pom:6.1.5' from repository
codehaus.org (http://snapshots.repository.codehaus.org): Error transferring file: snapshots.repository.codehaus.org
Downloading: http://people.apache.org/repo/m2-snapshot-repository//org/mortbay/jetty/servlet-api-2.5/6.1.5/servlet-api-2.5-6.1.5.pom
[INFO] Unable to find resource 'org.mortbay.jetty:servlet-api-2.5:pom:6.1.5' in repository
apache.m2.incubator (http://people.apache.org/repo/m2-snapshot-repository/)
Downloading: http://repo1.maven.org/maven2/org/mortbay/jetty/servlet-api-2.5/6.1.5/servlet-api-2.5-6.1.5.pom
3K downloaded  (servlet-api-2.5-6.1.5.pom)
Downloading: http://repo1.maven.org/maven2/org/mortbay/jetty/jetty/6.1.5/jetty-6.1.5.jar
474K downloaded  (jetty-6.1.5.jar)
Downloading: http://snapshots.repository.codehaus.org/org/mortbay/jetty/jetty-util/6.1.5/jetty-util-6.1.5.jar
[WARNING] Unable to get resource 'org.mortbay.jetty:jetty-util:jar:6.1.5' from repository
codehaus.org (http://snapshots.repository.codehaus.org): Error transferring file: snapshots.repository.codehaus.org
Downloading: http://people.apache.org/repo/m2-snapshot-repository//org/mortbay/jetty/jetty-util/6.1.5/jetty-util-6.1.5.jar
[INFO] Unable to find resource 'org.mortbay.jetty:jetty-util:jar:6.1.5' in repository apache.m2.incubator
(http://people.apache.org/repo/m2-snapshot-repository/)
Downloading: http://repo1.maven.org/maven2/org/mortbay/jetty/jetty-util/6.1.5/jetty-util-6.1.5.jar
134K downloaded  (jetty-util-6.1.5.jar)
Downloading: http://snapshots.repository.codehaus.org/org/mortbay/jetty/servlet-api-2.5/6.1.5/servlet-api-2.5-6.1.5.jar
[WARNING] Unable to get resource 'org.mortbay.jetty:servlet-api-2.5:jar:6.1.5' from repository
codehaus.org (http://snapshots.repository.codehaus.org): Error transferring file: snapshots.repository.codehaus.org
Downloading: http://people.apache.org/repo/m2-snapshot-repository//org/mortbay/jetty/servlet-api-2.5/6.1.5/servlet-api-2.5-6.1.5.jar
[INFO] Unable to find resource 'org.mortbay.jetty:servlet-api-2.5:jar:6.1.5' in repository
apache.m2.incubator (http://people.apache.org/repo/m2-snapshot-repository/)
Downloading: http://repo1.maven.org/maven2/org/mortbay/jetty/servlet-api-2.5/6.1.5/servlet-api-2.5-6.1.5.jar
129K downloaded  (servlet-api-2.5-6.1.5.jar)
[INFO] [site:attach-descriptor {execution: default-attach-descriptor}]
[INFO] [javadoc:jar {execution: attach-javadoc}]
[INFO] Not executing Javadoc as the project is not a Java classpath-capable package
[INFO] Preparing source:jar
[WARNING] Removing: jar from forked lifecycle, to prevent recursive invocation.
[INFO] [enforcer:enforce {execution: enforce}]
[INFO] [buildnumber:create {execution: default}]
ERROR: Could not find local repository for 2.2.1
[INFO] [source:jar {execution: attach-source}]
Downloading: http://repo1.maven.org/maven2/org/apache/apache/resources/apache-source-release-assembly-descriptor/1.0.2/apache-source-release-assembly-descriptor-1.0.2.pom
8K downloaded  (apache-source-release-assembly-descriptor-1.0.2.pom)
Downloading: http://repo1.maven.org/maven2/org/apache/apache/resources/apache-resource-bundles/3/apache-resource-bundles-3.pom
2K downloaded  (apache-resource-bundles-3.pom)
Downloading: http://repo1.maven.org/maven2/org/apache/apache/resources/apache-source-release-assembly-descriptor/1.0.2/apache-source-release-assembly-descriptor-1.0.2.jar
9K downloaded  (apache-source-release-assembly-descriptor-1.0.2.jar)
[INFO] [assembly:single {execution: source-release-assembly}]
[INFO] tobago-1.5.14-SNAPSHOT/ already added, skipping
[INFO] Building zip: <https://builds.apache.org/job/Tobago%201.5.x%20(deploy)/ws/trunk-1.5.x-deploy/target/tobago-1.5.14-SNAPSHOT-source-release.zip>
[INFO] tobago-1.5.14-SNAPSHOT/ already added, skipping
[INFO] [checkstyle:check {execution: verify-style}]
[INFO] Starting audit...
Audit done.

[INFO] [install:install {execution: default-install}]
[INFO] Installing <https://builds.apache.org/job/Tobago%201.5.x%20(deploy)/ws/trunk-1.5.x-deploy/pom.xml>
to /home/jenkins/jenkins-slave/maven-repositories/0/org/apache/myfaces/tobago/tobago/1.5.14-SNAPSHOT/tobago-1.5.14-SNAPSHOT.pom
[INFO] Installing <https://builds.apache.org/job/Tobago%201.5.x%20(deploy)/ws/trunk-1.5.x-deploy/target/tobago-1.5.14-SNAPSHOT-site.xml>
to /home/jenkins/jenkins-slave/maven-repositories/0/org/apache/myfaces/tobago/tobago/1.5.14-SNAPSHOT/tobago-1.5.14-SNAPSHOT-site.xml
[INFO] Installing <https://builds.apache.org/job/Tobago%201.5.x%20(deploy)/ws/trunk-1.5.x-deploy/target/tobago-1.5.14-SNAPSHOT-source-release.zip>
to /home/jenkins/jenkins-slave/maven-repositories/0/org/apache/myfaces/tobago/tobago/1.5.14-SNAPSHOT/tobago-1.5.14-SNAPSHOT-source-release.zip
[INFO] [deploy:deploy {execution: default-deploy}]
[INFO] Retrieving previous build number from apache.snapshots.https
[WARNING] *** CHECKSUM FAILED - Checksum failed on download: local = 'abb09846b72504357b0a3612cc14b8d217f90dec';
remote = '2e1891f1b65844cae95472a0269e4962236f74bd' - RETRYING
[WARNING] *** CHECKSUM FAILED - Checksum failed on download: local = 'abb09846b72504357b0a3612cc14b8d217f90dec';
remote = '2e1891f1b65844cae95472a0269e4962236f74bd' - IGNORING
Uploading: https://repository.apache.org/content/repositories/snapshots/org/apache/myfaces/tobago/tobago/1.5.14-SNAPSHOT/tobago-1.5.14-SNAPSHOT.pom
63K uploaded  (tobago-1.5.14-SNAPSHOT.pom)
[INFO] Retrieving previous metadata from apache.snapshots.https
[WARNING] *** CHECKSUM FAILED - Checksum failed on download: local = 'abb09846b72504357b0a3612cc14b8d217f90dec';
remote = '2e1891f1b65844cae95472a0269e4962236f74bd' - RETRYING
[WARNING] *** CHECKSUM FAILED - Checksum failed on download: local = 'abb09846b72504357b0a3612cc14b8d217f90dec';
remote = '2e1891f1b65844cae95472a0269e4962236f74bd' - IGNORING
[INFO] Uploading repository metadata for: 'snapshot org.apache.myfaces.tobago:tobago:1.5.14-SNAPSHOT'
[INFO] Retrieving previous metadata from apache.snapshots.https
[INFO] Uploading repository metadata for: 'artifact org.apache.myfaces.tobago:tobago'
[INFO] Retrieving previous build number from apache.snapshots.https
Uploading: https://repository.apache.org/content/repositories/snapshots/org/apache/myfaces/tobago/tobago/1.5.14-SNAPSHOT/tobago-1.5.14-SNAPSHOT-site.xml
3K uploaded  (tobago-1.5.14-SNAPSHOT-site.xml)
[INFO] Retrieving previous build number from apache.snapshots.https
Uploading: https://repository.apache.org/content/repositories/snapshots/org/apache/myfaces/tobago/tobago/1.5.14-SNAPSHOT/tobago-1.5.14-SNAPSHOT-source-release.zip
8881K uploaded  (tobago-1.5.14-SNAPSHOT-source-release.zip)
[INFO] ------------------------------------------------------------------------
[INFO] Building Tobago Tool
[INFO]    task-segment: [clean, animal-sniffer:check, deploy]
[INFO] ------------------------------------------------------------------------
[INFO] [clean:clean {execution: default-clean}]
[INFO] [animal-sniffer:check {execution: default-cli}]
[INFO] Checking unresolved references to org.codehaus.mojo.signature:java15:1.0
[INFO] [enforcer:enforce {execution: enforce}]
[INFO] [buildnumber:create {execution: default}]
[INFO] [remote-resources:process {execution: default}]
[INFO] [build-helper:add-source {execution: default}]
[INFO] Source directory: <https://builds.apache.org/job/Tobago%201.5.x%20(deploy)/ws/trunk-1.5.x-deploy/tobago-tool/src/main/java-jsf-1.2>
added.
[INFO] [site:attach-descriptor {execution: default-attach-descriptor}]
[INFO] [javadoc:jar {execution: attach-javadoc}]
[INFO] Not executing Javadoc as the project is not a Java classpath-capable package
[INFO] Preparing source:jar
[WARNING] Removing: jar from forked lifecycle, to prevent recursive invocation.
[INFO] [enforcer:enforce {execution: enforce}]
[INFO] [buildnumber:create {execution: default}]
ERROR: Could not find local repository for 2.2.1
[INFO] [source:jar {execution: attach-source}]
[INFO] [assembly:single {execution: source-release-assembly}]
[INFO] Skipping the assembly in this project because it's not the Execution Root
[INFO] [checkstyle:check {execution: verify-style}]
[INFO] Starting audit...
Audit done.

[INFO] [install:install {execution: default-install}]
[INFO] Installing <https://builds.apache.org/job/Tobago%201.5.x%20(deploy)/ws/trunk-1.5.x-deploy/tobago-tool/pom.xml>
to /home/jenkins/jenkins-slave/maven-repositories/0/org/apache/myfaces/tobago/tobago-tool/1.5.14-SNAPSHOT/tobago-tool-1.5.14-SNAPSHOT.pom
[INFO] [deploy:deploy {execution: default-deploy}]
[INFO] Retrieving previous build number from apache.snapshots.https
[WARNING] *** CHECKSUM FAILED - Checksum failed on download: local = '01b995e636942d317ad86b0925cdc21489c922ab';
remote = '5d49849a69dd5192f93a3f5b7c75305b4f24cf93' - RETRYING
[WARNING] *** CHECKSUM FAILED - Checksum failed on download: local = '01b995e636942d317ad86b0925cdc21489c922ab';
remote = '5d49849a69dd5192f93a3f5b7c75305b4f24cf93' - IGNORING
Uploading: https://repository.apache.org/content/repositories/snapshots/org/apache/myfaces/tobago/tobago-tool/1.5.14-SNAPSHOT/tobago-tool-1.5.14-SNAPSHOT.pom
1K uploaded  (tobago-tool-1.5.14-SNAPSHOT.pom)
[INFO] Retrieving previous metadata from apache.snapshots.https
[INFO] Uploading repository metadata for: 'artifact org.apache.myfaces.tobago:tobago-tool'
[INFO] Retrieving previous metadata from apache.snapshots.https
[WARNING] *** CHECKSUM FAILED - Checksum failed on download: local = '01b995e636942d317ad86b0925cdc21489c922ab';
remote = '5d49849a69dd5192f93a3f5b7c75305b4f24cf93' - RETRYING
[WARNING] *** CHECKSUM FAILED - Checksum failed on download: local = '01b995e636942d317ad86b0925cdc21489c922ab';
remote = '5d49849a69dd5192f93a3f5b7c75305b4f24cf93' - IGNORING
[INFO] Uploading repository metadata for: 'snapshot org.apache.myfaces.tobago:tobago-tool:1.5.14-SNAPSHOT'
[INFO] ------------------------------------------------------------------------
[INFO] Building Tobago Tool Annotation
[INFO]    task-segment: [clean, animal-sniffer:check, deploy]
[INFO] ------------------------------------------------------------------------
[INFO] [clean:clean {execution: default-clean}]
[INFO] [animal-sniffer:check {execution: default-cli}]
[INFO] Checking unresolved references to org.codehaus.mojo.signature:java15:1.0
[INFO] [enforcer:enforce {execution: enforce}]
[INFO] [buildnumber:create {execution: default}]
[INFO] [remote-resources:process {execution: default}]
[debug] execute contextualize
[INFO] [resources:resources {execution: default-resources}]
[INFO] Using 'UTF-8' encoding to copy filtered resources.
[INFO] skip non existing resourceDirectory <https://builds.apache.org/job/Tobago%201.5.x%20(deploy)/ws/trunk-1.5.x-deploy/tobago-tool/tobago-tool-annotation/src/main/resources>
[INFO] Copying 3 resources
[INFO] [build-helper:add-source {execution: default}]
[INFO] Source directory: <https://builds.apache.org/job/Tobago%201.5.x%20(deploy)/ws/trunk-1.5.x-deploy/tobago-tool/tobago-tool-annotation/src/main/java-jsf-1.2>
added.
[INFO] [compiler:compile {execution: default-compile}]
[INFO] Compiling 15 source files to <https://builds.apache.org/job/Tobago%201.5.x%20(deploy)/ws/trunk-1.5.x-deploy/tobago-tool/tobago-tool-annotation/target/classes>
[debug] execute contextualize
[INFO] [resources:testResources {execution: default-testResources}]
[INFO] Using 'UTF-8' encoding to copy filtered resources.
[INFO] skip non existing resourceDirectory <https://builds.apache.org/job/Tobago%201.5.x%20(deploy)/ws/trunk-1.5.x-deploy/tobago-tool/tobago-tool-annotation/src/test/resources>
[INFO] Copying 3 resources
[INFO] [compiler:testCompile {execution: default-testCompile}]
[INFO] No sources to compile
[INFO] [surefire:test {execution: default-test}]
[INFO] Surefire report directory: <https://builds.apache.org/job/Tobago%201.5.x%20(deploy)/ws/trunk-1.5.x-deploy/tobago-tool/tobago-tool-annotation/target/surefire-reports>

-------------------------------------------------------
 T E S T S
-------------------------------------------------------

Results :

Tests run: 0, Failures: 0, Errors: 0, Skipped: 0

[JENKINS] Recording test results
[INFO] [jar:jar {execution: default-jar}]
[INFO] Building jar: <https://builds.apache.org/job/Tobago%201.5.x%20(deploy)/ws/trunk-1.5.x-deploy/tobago-tool/tobago-tool-annotation/target/tobago-tool-annotation-1.5.14-SNAPSHOT.jar>
[INFO] [javadoc:jar {execution: attach-javadoc}]
Downloading: http://repo1.maven.org/maven2/com/google/doclava/doclava/1.0.3/doclava-1.0.3.pom
17K downloaded  (doclava-1.0.3.pom)
Downloading: http://repo1.maven.org/maven2/com/google/doclava/doclava/1.0.3/doclava-1.0.3.jar
1758K downloaded  (doclava-1.0.3.jar)
Downloading: http://repo1.maven.org/maven2/com/google/jsilver/jsilver/1.0.0/jsilver-1.0.0.pom
14K downloaded  (jsilver-1.0.0.pom)
Downloading: http://repo1.maven.org/maven2/com/google/guava/guava/r06/guava-r06.pom
3K downloaded  (guava-r06.pom)
Downloading: http://repo1.maven.org/maven2/com/google/guava/guava/r06/guava-r06.jar
Downloading: http://repo1.maven.org/maven2/com/google/jsilver/jsilver/1.0.0/jsilver-1.0.0.jar
914K downloaded  (guava-r06.jar)
532K downloaded  (jsilver-1.0.0.jar)
[INFO] 
2 errors
[INFO] ------------------------------------------------------------------------
[ERROR] BUILD ERROR
[INFO] ------------------------------------------------------------------------
[INFO] MavenReportException: Error while creating archive: 
Exit code: 1 - javadoc: error - Illegal package name: "1.5.x"
javadoc: error - Illegal package name: "(deploy)/trunk-1.5.x-deploy/tobago-tool/tobago-tool-annotation/target/apidocs"

Command line was: /usr/local/asfpackages/java/jdk1.7.0_80/jre/../bin/javadoc -J-Xmx1024m @options
@packages

Refer to the generated Javadoc files in '<https://builds.apache.org/job/Tobago%201.5.x%20(deploy)/ws/trunk-1.5.x-deploy/tobago-tool/tobago-tool-annotation/target/apidocs'>
dir.


[INFO] ------------------------------------------------------------------------
[INFO] For more information, run Maven with the -e switch
[INFO] ------------------------------------------------------------------------
[INFO] Total time: 57 seconds
[INFO] Finished at: Tue Feb 07 10:11:18 UTC 2017
[INFO] Final Memory: 94M/778M
[INFO] ------------------------------------------------------------------------
Waiting for Jenkins to finish collecting data
[JENKINS] Archiving /home/jenkins/jenkins-slave/maven-repositories/0/org/apache/myfaces/tobago/tobago/1.5.14-SNAPSHOT/tobago-1.5.14-SNAPSHOT.pom
to org.apache.myfaces.tobago/tobago/1.5.14-SNAPSHOT/tobago-1.5.14-SNAPSHOT.pom
[JENKINS] Archiving <https://builds.apache.org/job/Tobago%201.5.x%20(deploy)/ws/trunk-1.5.x-deploy/target/tobago-1.5.14-SNAPSHOT-site.xml>
to org.apache.myfaces.tobago/tobago/1.5.14-SNAPSHOT/tobago-1.5.14-SNAPSHOT-site.xml
[JENKINS] Archiving <https://builds.apache.org/job/Tobago%201.5.x%20(deploy)/ws/trunk-1.5.x-deploy/target/tobago-1.5.14-SNAPSHOT-source-release.zip>
to org.apache.myfaces.tobago/tobago/1.5.14-SNAPSHOT/tobago-1.5.14-SNAPSHOT-source-release.zip
/home/jenkins/jenkins-slave/maven-repositories/0/org/apache/myfaces/tobago/tobago/1.5.14-SNAPSHOT/tobago-1.5.14-SNAPSHOT.pom
is not inside <https://builds.apache.org/job/Tobago%201.5.x%20(deploy)/ws/trunk-1.5.x-deploy/;>
will archive in a separate pass
Compressed 63.68 KB of artifacts by 50.3% relative to #110
[JENKINS] Archiving <https://builds.apache.org/job/Tobago%201.5.x%20(deploy)/ws/trunk-1.5.x-deploy/tobago-tool/tobago-tool-annotation/pom.xml>
to org.apache.myfaces.tobago/tobago-tool-annotation/1.5.14-SNAPSHOT/tobago-tool-annotation-1.5.14-SNAPSHOT.pom
[JENKINS] Archiving <https://builds.apache.org/job/Tobago%201.5.x%20(deploy)/ws/trunk-1.5.x-deploy/tobago-tool/tobago-tool-annotation/target/tobago-tool-annotation-1.5.14-SNAPSHOT.jar>
to org.apache.myfaces.tobago/tobago-tool-annotation/1.5.14-SNAPSHOT/tobago-tool-annotation-1.5.14-SNAPSHOT.jar
[JENKINS] Archiving /home/jenkins/jenkins-slave/maven-repositories/0/org/apache/myfaces/tobago/tobago-tool/1.5.14-SNAPSHOT/tobago-tool-1.5.14-SNAPSHOT.pom
to org.apache.myfaces.tobago/tobago-tool/1.5.14-SNAPSHOT/tobago-tool-1.5.14-SNAPSHOT.pom
/home/jenkins/jenkins-slave/maven-repositories/0/org/apache/myfaces/tobago/tobago-tool/1.5.14-SNAPSHOT/tobago-tool-1.5.14-SNAPSHOT.pom
is not inside <https://builds.apache.org/job/Tobago%201.5.x%20(deploy)/ws/trunk-1.5.x-deploy/tobago-tool/;>
will archive in a separate pass
Sending e-mails to: commits@myfaces.apache.org
channel stopped

Mime
View raw message