myfaces-commits mailing list archives

Site index · List index
Message view « Date » · « Thread »
Top « Date » · « Thread »
From Apache Jenkins Server <jenk...@builds.apache.org>
Subject Build failed in Jenkins: Tobago Trunk #842
Date Tue, 04 Apr 2017 14:48:24 GMT
See <https://builds.apache.org/job/Tobago%20Trunk/842/display/redirect?page=changes>

Changes:

[hnoeth] improve demo
* add simple ConversationScope example
* add a test for labelLayout

------------------------------------------
[...truncated 499.35 KB...]
[INFO] Downloaded: https://repo.maven.apache.org/maven2/org/jboss/arquillian/core/arquillian-core-impl-base/1.1.13.Final/arquillian-core-impl-base-1.1.13.Final.pom
(2 KB at 101.4 KB/sec)
[INFO] Downloading: https://repo.maven.apache.org/maven2/org/jboss/arquillian/test/arquillian-test-impl-base/1.1.13.Final/arquillian-test-impl-base-1.1.13.Final.pom
[INFO] Downloaded: https://repo.maven.apache.org/maven2/org/jboss/arquillian/test/arquillian-test-impl-base/1.1.13.Final/arquillian-test-impl-base-1.1.13.Final.pom
(3 KB at 132.2 KB/sec)
[INFO] Downloading: https://repo.maven.apache.org/maven2/org/jboss/arquillian/container/arquillian-container-impl-base/1.1.13.Final/arquillian-container-impl-base-1.1.13.Final.pom
[INFO] Downloaded: https://repo.maven.apache.org/maven2/org/jboss/arquillian/container/arquillian-container-impl-base/1.1.13.Final/arquillian-container-impl-base-1.1.13.Final.pom
(4 KB at 106.4 KB/sec)
[INFO] Downloading: https://repo.maven.apache.org/maven2/org/jboss/arquillian/container/arquillian-container-test-impl-base/1.1.13.Final/arquillian-container-test-impl-base-1.1.13.Final.pom
[INFO] Downloaded: https://repo.maven.apache.org/maven2/org/jboss/arquillian/container/arquillian-container-test-impl-base/1.1.13.Final/arquillian-container-test-impl-base-1.1.13.Final.pom
(4 KB at 207.1 KB/sec)
[INFO] Downloading: https://repo.maven.apache.org/maven2/com/google/guava/guava/21.0/guava-21.0.pom
[INFO] Downloaded: https://repo.maven.apache.org/maven2/com/google/guava/guava/21.0/guava-21.0.pom
(7 KB at 311.0 KB/sec)
[INFO] Downloading: https://repo.maven.apache.org/maven2/com/google/guava/guava-parent/21.0/guava-parent-21.0.pom
[INFO] Downloaded: https://repo.maven.apache.org/maven2/com/google/guava/guava-parent/21.0/guava-parent-21.0.pom
(10 KB at 496.8 KB/sec)
[INFO] Downloading: https://repo.maven.apache.org/maven2/org/jboss/arquillian/graphene/graphene-webdriver/2.2.0/graphene-webdriver-2.2.0.pom
[INFO] Downloaded: https://repo.maven.apache.org/maven2/org/jboss/arquillian/graphene/graphene-webdriver/2.2.0/graphene-webdriver-2.2.0.pom
(2 KB at 21.4 KB/sec)
[INFO] Downloading: https://repo.maven.apache.org/maven2/org/jboss/arquillian/graphene/graphene-parent/2.2.0/graphene-parent-2.2.0.pom
[INFO] Downloaded: https://repo.maven.apache.org/maven2/org/jboss/arquillian/graphene/graphene-parent/2.2.0/graphene-parent-2.2.0.pom
(16 KB at 667.5 KB/sec)
[INFO] Downloading: https://repo.maven.apache.org/maven2/org/jboss/arquillian/extension/arquillian-drone-bom/2.1.0.Alpha2/arquillian-drone-bom-2.1.0.Alpha2.pom
[INFO] Downloaded: https://repo.maven.apache.org/maven2/org/jboss/arquillian/extension/arquillian-drone-bom/2.1.0.Alpha2/arquillian-drone-bom-2.1.0.Alpha2.pom
(7 KB at 272.1 KB/sec)
[INFO] Downloading: https://repo.maven.apache.org/maven2/org/jboss/arquillian/selenium/selenium-bom/3.3.0/selenium-bom-3.3.0.pom
[INFO] Downloaded: https://repo.maven.apache.org/maven2/org/jboss/arquillian/selenium/selenium-bom/3.3.0/selenium-bom-3.3.0.pom
(6 KB at 313.9 KB/sec)
[INFO] Downloading: https://repo.maven.apache.org/maven2/org/jboss/arquillian/graphene/graphene-webdriver-api/2.2.0/graphene-webdriver-api-2.2.0.pom
[INFO] Downloaded: https://repo.maven.apache.org/maven2/org/jboss/arquillian/graphene/graphene-webdriver-api/2.2.0/graphene-webdriver-api-2.2.0.pom
(3 KB at 127.0 KB/sec)
[INFO] Downloading: https://repo.maven.apache.org/maven2/org/jboss/arquillian/graphene/graphene-webdriver-spi/2.2.0/graphene-webdriver-spi-2.2.0.pom
[INFO] Downloaded: https://repo.maven.apache.org/maven2/org/jboss/arquillian/graphene/graphene-webdriver-spi/2.2.0/graphene-webdriver-spi-2.2.0.pom
(3 KB at 150.1 KB/sec)
[INFO] Downloading: https://repo.maven.apache.org/maven2/org/jboss/arquillian/graphene/graphene-webdriver-impl/2.2.0/graphene-webdriver-impl-2.2.0.pom
[INFO] Downloaded: https://repo.maven.apache.org/maven2/org/jboss/arquillian/graphene/graphene-webdriver-impl/2.2.0/graphene-webdriver-impl-2.2.0.pom
(10 KB at 454.1 KB/sec)
[INFO] Downloading: https://repo.maven.apache.org/maven2/org/jboss/arquillian/extension/arquillian-drone-impl/2.1.0.Alpha3/arquillian-drone-impl-2.1.0.Alpha3.pom
[INFO] Downloaded: https://repo.maven.apache.org/maven2/org/jboss/arquillian/extension/arquillian-drone-impl/2.1.0.Alpha3/arquillian-drone-impl-2.1.0.Alpha3.pom
(5 KB at 214.2 KB/sec)
[INFO] Downloading: https://repo.maven.apache.org/maven2/org/jboss/arquillian/extension/arquillian-drone-build/2.1.0.Alpha3/arquillian-drone-build-2.1.0.Alpha3.pom
[INFO] Downloaded: https://repo.maven.apache.org/maven2/org/jboss/arquillian/extension/arquillian-drone-build/2.1.0.Alpha3/arquillian-drone-build-2.1.0.Alpha3.pom
(9 KB at 353.6 KB/sec)
[INFO] Downloading: https://repo.maven.apache.org/maven2/org/jboss/arquillian/extension/arquillian-drone-aggregator/2.1.0.Alpha3/arquillian-drone-aggregator-2.1.0.Alpha3.pom
[INFO] Downloaded: https://repo.maven.apache.org/maven2/org/jboss/arquillian/extension/arquillian-drone-aggregator/2.1.0.Alpha3/arquillian-drone-aggregator-2.1.0.Alpha3.pom
(5 KB at 260.5 KB/sec)
[INFO] Downloading: https://repo.maven.apache.org/maven2/org/jboss/arquillian/extension/arquillian-drone-api/2.1.0.Alpha3/arquillian-drone-api-2.1.0.Alpha3.pom
[INFO] Downloaded: https://repo.maven.apache.org/maven2/org/jboss/arquillian/extension/arquillian-drone-api/2.1.0.Alpha3/arquillian-drone-api-2.1.0.Alpha3.pom
(952 B at 38.7 KB/sec)
[INFO] Downloading: https://repo.maven.apache.org/maven2/org/jboss/arquillian/extension/arquillian-drone-spi/2.1.0.Alpha3/arquillian-drone-spi-2.1.0.Alpha3.pom
[INFO] Downloaded: https://repo.maven.apache.org/maven2/org/jboss/arquillian/extension/arquillian-drone-spi/2.1.0.Alpha3/arquillian-drone-spi-2.1.0.Alpha3.pom
(2 KB at 55.9 KB/sec)
[INFO] Downloading: https://repo.maven.apache.org/maven2/org/jboss/arquillian/extension/arquillian-drone-configuration/2.1.0.Alpha3/arquillian-drone-configuration-2.1.0.Alpha3.pom
[INFO] Downloaded: https://repo.maven.apache.org/maven2/org/jboss/arquillian/extension/arquillian-drone-configuration/2.1.0.Alpha3/arquillian-drone-configuration-2.1.0.Alpha3.pom
(4 KB at 168.2 KB/sec)
[INFO] Downloading: https://repo.maven.apache.org/maven2/org/jboss/arquillian/extension/arquillian-drone-webdriver-depchain/2.1.0.Alpha3/arquillian-drone-webdriver-depchain-2.1.0.Alpha3.pom
[INFO] Downloaded: https://repo.maven.apache.org/maven2/org/jboss/arquillian/extension/arquillian-drone-webdriver-depchain/2.1.0.Alpha3/arquillian-drone-webdriver-depchain-2.1.0.Alpha3.pom
(5 KB at 264.8 KB/sec)
[INFO] Downloading: https://repo.maven.apache.org/maven2/org/jboss/arquillian/extension/arquillian-drone-webdriver/2.1.0.Alpha3/arquillian-drone-webdriver-2.1.0.Alpha3.pom
[INFO] Downloaded: https://repo.maven.apache.org/maven2/org/jboss/arquillian/extension/arquillian-drone-webdriver/2.1.0.Alpha3/arquillian-drone-webdriver-2.1.0.Alpha3.pom
(18 KB at 562.4 KB/sec)
[INFO] Downloading: https://repo.maven.apache.org/maven2/org/arquillian/spacelift/arquillian-spacelift/1.0.0.Alpha9/arquillian-spacelift-1.0.0.Alpha9.pom
[INFO] Downloaded: https://repo.maven.apache.org/maven2/org/arquillian/spacelift/arquillian-spacelift/1.0.0.Alpha9/arquillian-spacelift-1.0.0.Alpha9.pom
(3 KB at 91.1 KB/sec)
[INFO] Downloading: https://repo.maven.apache.org/maven2/org/arquillian/spacelift/arquillian-spacelift-aggregator/1.0.0.Alpha9/arquillian-spacelift-aggregator-1.0.0.Alpha9.pom
[INFO] Downloaded: https://repo.maven.apache.org/maven2/org/arquillian/spacelift/arquillian-spacelift-aggregator/1.0.0.Alpha9/arquillian-spacelift-aggregator-1.0.0.Alpha9.pom
(6 KB at 245.3 KB/sec)
[INFO] Downloading: https://repo.maven.apache.org/maven2/org/arquillian/spacelift/arquillian-spacelift-api/1.0.0.Alpha9/arquillian-spacelift-api-1.0.0.Alpha9.pom
[INFO] Downloaded: https://repo.maven.apache.org/maven2/org/arquillian/spacelift/arquillian-spacelift-api/1.0.0.Alpha9/arquillian-spacelift-api-1.0.0.Alpha9.pom
(2 KB at 44.4 KB/sec)
[INFO] Downloading: https://repo.maven.apache.org/maven2/org/seleniumhq/selenium/selenium-api/3.3.1/selenium-api-3.3.1.pom
[INFO] Downloaded: https://repo.maven.apache.org/maven2/org/seleniumhq/selenium/selenium-api/3.3.1/selenium-api-3.3.1.pom
(3 KB at 151.3 KB/sec)
[INFO] Downloading: https://repo.maven.apache.org/maven2/org/seleniumhq/selenium/selenium-java/3.3.1/selenium-java-3.3.1.pom
[INFO] Downloaded: https://repo.maven.apache.org/maven2/org/seleniumhq/selenium/selenium-java/3.3.1/selenium-java-3.3.1.pom
(5 KB at 230.5 KB/sec)
[INFO] Downloading: https://repo.maven.apache.org/maven2/org/seleniumhq/selenium/selenium-chrome-driver/3.3.1/selenium-chrome-driver-3.3.1.pom
[INFO] Downloaded: https://repo.maven.apache.org/maven2/org/seleniumhq/selenium/selenium-chrome-driver/3.3.1/selenium-chrome-driver-3.3.1.pom
(3 KB at 94.1 KB/sec)
[INFO] Downloading: https://repo.maven.apache.org/maven2/org/seleniumhq/selenium/selenium-remote-driver/3.3.1/selenium-remote-driver-3.3.1.pom
[INFO] Downloaded: https://repo.maven.apache.org/maven2/org/seleniumhq/selenium/selenium-remote-driver/3.3.1/selenium-remote-driver-3.3.1.pom
(4 KB at 227.9 KB/sec)
[INFO] Downloading: https://repo.maven.apache.org/maven2/org/seleniumhq/selenium/selenium-edge-driver/3.3.1/selenium-edge-driver-3.3.1.pom
[INFO] Downloaded: https://repo.maven.apache.org/maven2/org/seleniumhq/selenium/selenium-edge-driver/3.3.1/selenium-edge-driver-3.3.1.pom
(3 KB at 165.8 KB/sec)
[INFO] Downloading: https://repo.maven.apache.org/maven2/org/seleniumhq/selenium/selenium-firefox-driver/3.3.1/selenium-firefox-driver-3.3.1.pom
[INFO] Downloaded: https://repo.maven.apache.org/maven2/org/seleniumhq/selenium/selenium-firefox-driver/3.3.1/selenium-firefox-driver-3.3.1.pom
(3 KB at 94.1 KB/sec)
[INFO] Downloading: https://repo.maven.apache.org/maven2/org/seleniumhq/selenium/selenium-ie-driver/3.3.1/selenium-ie-driver-3.3.1.pom
[INFO] Downloaded: https://repo.maven.apache.org/maven2/org/seleniumhq/selenium/selenium-ie-driver/3.3.1/selenium-ie-driver-3.3.1.pom
(3 KB at 165.6 KB/sec)
[INFO] Downloading: https://repo.maven.apache.org/maven2/org/seleniumhq/selenium/selenium-opera-driver/3.3.1/selenium-opera-driver-3.3.1.pom
[INFO] Downloaded: https://repo.maven.apache.org/maven2/org/seleniumhq/selenium/selenium-opera-driver/3.3.1/selenium-opera-driver-3.3.1.pom
(3 KB at 17.4 KB/sec)
[INFO] Downloading: https://repo.maven.apache.org/maven2/org/seleniumhq/selenium/selenium-safari-driver/3.3.1/selenium-safari-driver-3.3.1.pom
[INFO] Downloaded: https://repo.maven.apache.org/maven2/org/seleniumhq/selenium/selenium-safari-driver/3.3.1/selenium-safari-driver-3.3.1.pom
(3 KB at 176.4 KB/sec)
[INFO] Downloading: https://repo.maven.apache.org/maven2/com/codeborne/phantomjsdriver/1.4.0/phantomjsdriver-1.4.0.pom
[INFO] Downloaded: https://repo.maven.apache.org/maven2/com/codeborne/phantomjsdriver/1.4.0/phantomjsdriver-1.4.0.pom
(3 KB at 108.6 KB/sec)
[INFO] Downloading: https://repo.maven.apache.org/maven2/org/seleniumhq/selenium/htmlunit-driver/2.24/htmlunit-driver-2.24.pom
[INFO] Downloaded: https://repo.maven.apache.org/maven2/org/seleniumhq/selenium/htmlunit-driver/2.24/htmlunit-driver-2.24.pom
(11 KB at 317.4 KB/sec)
[INFO] Downloading: https://repo.maven.apache.org/maven2/org/seleniumhq/selenium/selenium-support/3.3.1/selenium-support-3.3.1.pom
[INFO] Downloaded: https://repo.maven.apache.org/maven2/org/seleniumhq/selenium/selenium-support/3.3.1/selenium-support-3.3.1.pom
(4 KB at 185.3 KB/sec)
[INFO] Downloading: https://repo.maven.apache.org/maven2/org/jboss/arquillian/extension/arquillian-phantom-driver/1.2.1.1/arquillian-phantom-driver-1.2.1.1.pom
[INFO] Downloaded: https://repo.maven.apache.org/maven2/org/jboss/arquillian/extension/arquillian-phantom-driver/1.2.1.1/arquillian-phantom-driver-1.2.1.1.pom
(4 KB at 24.2 KB/sec)
[INFO] Downloading: https://repo.maven.apache.org/maven2/org/jboss/arquillian/selenium/selenium-bom/3.2.0/selenium-bom-3.2.0.pom
[INFO] Downloaded: https://repo.maven.apache.org/maven2/org/jboss/arquillian/selenium/selenium-bom/3.2.0/selenium-bom-3.2.0.pom
(6 KB at 235.4 KB/sec)
[INFO] Downloading: https://repo.maven.apache.org/maven2/org/apache/deltaspike/modules/deltaspike-jsf-module-impl/1.7.2/deltaspike-jsf-module-impl-1.7.2.jar
[INFO] Downloading: https://repo.maven.apache.org/maven2/org/apache/deltaspike/modules/deltaspike-security-module-api/1.7.2/deltaspike-security-module-api-1.7.2.jar
[INFO] Downloading: https://repo.maven.apache.org/maven2/org/apache/deltaspike/modules/deltaspike-security-module-impl/1.7.2/deltaspike-security-module-impl-1.7.2.jar
[INFO] Downloading: https://repo.maven.apache.org/maven2/org/apache/deltaspike/modules/deltaspike-jsf-module-api/1.7.2/deltaspike-jsf-module-api-1.7.2.jar
[INFO] Downloading: https://repo.maven.apache.org/maven2/org/apache/deltaspike/modules/deltaspike-proxy-module-api/1.7.2/deltaspike-proxy-module-api-1.7.2.jar
[INFO] Downloaded: https://repo.maven.apache.org/maven2/org/apache/deltaspike/modules/deltaspike-jsf-module-impl/1.7.2/deltaspike-jsf-module-impl-1.7.2.jar
(195 KB at 1947.7 KB/sec)
[INFO] Downloading: https://repo.maven.apache.org/maven2/org/apache/deltaspike/modules/deltaspike-proxy-module-impl-asm5/1.7.2/deltaspike-proxy-module-impl-asm5-1.7.2.jar
[INFO] Downloaded: https://repo.maven.apache.org/maven2/org/apache/deltaspike/modules/deltaspike-security-module-impl/1.7.2/deltaspike-security-module-impl-1.7.2.jar
(41 KB at 365.7 KB/sec)
[INFO] Downloading: https://repo.maven.apache.org/maven2/org/jboss/arquillian/junit/arquillian-junit-container/1.1.13.Final/arquillian-junit-container-1.1.13.Final.jar
[INFO] Downloaded: https://repo.maven.apache.org/maven2/org/apache/deltaspike/modules/deltaspike-security-module-api/1.7.2/deltaspike-security-module-api-1.7.2.jar
(23 KB at 201.3 KB/sec)
[INFO] Downloading: https://repo.maven.apache.org/maven2/org/jboss/arquillian/junit/arquillian-junit-core/1.1.13.Final/arquillian-junit-core-1.1.13.Final.jar
[INFO] Downloaded: https://repo.maven.apache.org/maven2/org/apache/deltaspike/modules/deltaspike-jsf-module-api/1.7.2/deltaspike-jsf-module-api-1.7.2.jar
(46 KB at 354.7 KB/sec)
[INFO] Downloading: https://repo.maven.apache.org/maven2/org/jboss/arquillian/test/arquillian-test-api/1.1.13.Final/arquillian-test-api-1.1.13.Final.jar
[INFO] Downloaded: https://repo.maven.apache.org/maven2/org/jboss/arquillian/junit/arquillian-junit-container/1.1.13.Final/arquillian-junit-container-1.1.13.Final.jar
(10 KB at 70.6 KB/sec)
[INFO] Downloading: https://repo.maven.apache.org/maven2/org/jboss/arquillian/core/arquillian-core-api/1.1.13.Final/arquillian-core-api-1.1.13.Final.jar
[INFO] Downloaded: https://repo.maven.apache.org/maven2/org/jboss/arquillian/test/arquillian-test-api/1.1.13.Final/arquillian-test-api-1.1.13.Final.jar
(4 KB at 23.9 KB/sec)
[INFO] Downloading: https://repo.maven.apache.org/maven2/org/jboss/arquillian/test/arquillian-test-spi/1.1.13.Final/arquillian-test-spi-1.1.13.Final.jar
[INFO] Downloaded: https://repo.maven.apache.org/maven2/org/jboss/arquillian/core/arquillian-core-api/1.1.13.Final/arquillian-core-api-1.1.13.Final.jar
(10 KB at 64.3 KB/sec)
[INFO] Downloading: https://repo.maven.apache.org/maven2/org/jboss/arquillian/core/arquillian-core-spi/1.1.13.Final/arquillian-core-spi-1.1.13.Final.jar
[INFO] Downloaded: https://repo.maven.apache.org/maven2/org/jboss/arquillian/junit/arquillian-junit-core/1.1.13.Final/arquillian-junit-core-1.1.13.Final.jar
(40 KB at 256.6 KB/sec)
[INFO] Downloading: https://repo.maven.apache.org/maven2/org/jboss/arquillian/container/arquillian-container-test-api/1.1.13.Final/arquillian-container-test-api-1.1.13.Final.jar
[INFO] Downloaded: https://repo.maven.apache.org/maven2/org/apache/deltaspike/modules/deltaspike-proxy-module-impl-asm5/1.7.2/deltaspike-proxy-module-impl-asm5-1.7.2.jar
(155 KB at 983.8 KB/sec)
[INFO] Downloading: https://repo.maven.apache.org/maven2/org/jboss/arquillian/container/arquillian-container-test-spi/1.1.13.Final/arquillian-container-test-spi-1.1.13.Final.jar
[INFO] Downloaded: https://repo.maven.apache.org/maven2/org/jboss/arquillian/container/arquillian-container-test-api/1.1.13.Final/arquillian-container-test-api-1.1.13.Final.jar
(9 KB at 51.8 KB/sec)
[INFO] Downloading: https://repo.maven.apache.org/maven2/org/jboss/arquillian/container/arquillian-container-spi/1.1.13.Final/arquillian-container-spi-1.1.13.Final.jar
[INFO] Downloaded: https://repo.maven.apache.org/maven2/org/jboss/arquillian/test/arquillian-test-spi/1.1.13.Final/arquillian-test-spi-1.1.13.Final.jar
(45 KB at 261.6 KB/sec)
[INFO] Downloading: https://repo.maven.apache.org/maven2/org/jboss/arquillian/core/arquillian-core-impl-base/1.1.13.Final/arquillian-core-impl-base-1.1.13.Final.jar
[INFO] Downloaded: https://repo.maven.apache.org/maven2/org/apache/deltaspike/modules/deltaspike-proxy-module-api/1.7.2/deltaspike-proxy-module-api-1.7.2.jar
(23 KB at 119.0 KB/sec)
[INFO] Downloading: https://repo.maven.apache.org/maven2/org/jboss/arquillian/test/arquillian-test-impl-base/1.1.13.Final/arquillian-test-impl-base-1.1.13.Final.jar
[INFO] Downloaded: https://repo.maven.apache.org/maven2/org/jboss/arquillian/container/arquillian-container-spi/1.1.13.Final/arquillian-container-spi-1.1.13.Final.jar
(53 KB at 270.1 KB/sec)
[INFO] Downloading: https://repo.maven.apache.org/maven2/org/jboss/arquillian/container/arquillian-container-impl-base/1.1.13.Final/arquillian-container-impl-base-1.1.13.Final.jar
[INFO] Downloaded: https://repo.maven.apache.org/maven2/org/jboss/arquillian/test/arquillian-test-impl-base/1.1.13.Final/arquillian-test-impl-base-1.1.13.Final.jar
(29 KB at 137.5 KB/sec)
[INFO] Downloading: https://repo.maven.apache.org/maven2/org/jboss/arquillian/config/arquillian-config-api/1.1.13.Final/arquillian-config-api-1.1.13.Final.jar
[INFO] Downloaded: https://repo.maven.apache.org/maven2/org/jboss/arquillian/core/arquillian-core-impl-base/1.1.13.Final/arquillian-core-impl-base-1.1.13.Final.jar
(65 KB at 301.0 KB/sec)
[INFO] Downloading: https://repo.maven.apache.org/maven2/org/jboss/arquillian/config/arquillian-config-impl-base/1.1.13.Final/arquillian-config-impl-base-1.1.13.Final.jar
[INFO] Downloaded: https://repo.maven.apache.org/maven2/org/jboss/arquillian/config/arquillian-config-api/1.1.13.Final/arquillian-config-api-1.1.13.Final.jar
(8 KB at 32.5 KB/sec)
[INFO] Downloading: https://repo.maven.apache.org/maven2/org/jboss/arquillian/container/arquillian-container-test-impl-base/1.1.13.Final/arquillian-container-test-impl-base-1.1.13.Final.jar
[INFO] Downloaded: https://repo.maven.apache.org/maven2/org/jboss/arquillian/container/arquillian-container-impl-base/1.1.13.Final/arquillian-container-impl-base-1.1.13.Final.jar
(80 KB at 354.2 KB/sec)
[INFO] Downloading: https://repo.maven.apache.org/maven2/com/google/guava/guava/21.0/guava-21.0.jar
[INFO] Downloaded: https://repo.maven.apache.org/maven2/org/jboss/arquillian/config/arquillian-config-impl-base/1.1.13.Final/arquillian-config-impl-base-1.1.13.Final.jar
(42 KB at 175.1 KB/sec)
[INFO] Downloading: https://repo.maven.apache.org/maven2/org/jboss/arquillian/graphene/graphene-webdriver-api/2.2.0/graphene-webdriver-api-2.2.0.jar
[INFO] Downloaded: https://repo.maven.apache.org/maven2/org/jboss/arquillian/core/arquillian-core-spi/1.1.13.Final/arquillian-core-spi-1.1.13.Final.jar
(28 KB at 107.9 KB/sec)
[INFO] Downloading: https://repo.maven.apache.org/maven2/org/jboss/arquillian/graphene/graphene-webdriver-spi/2.2.0/graphene-webdriver-spi-2.2.0.jar
[INFO] Downloaded: https://repo.maven.apache.org/maven2/org/jboss/arquillian/container/arquillian-container-test-impl-base/1.1.13.Final/arquillian-container-test-impl-base-1.1.13.Final.jar
(110 KB at 424.7 KB/sec)
[INFO] Downloaded: https://repo.maven.apache.org/maven2/org/jboss/arquillian/graphene/graphene-webdriver-api/2.2.0/graphene-webdriver-api-2.2.0.jar
(32 KB at 121.1 KB/sec)
[INFO] Downloading: https://repo.maven.apache.org/maven2/org/jboss/arquillian/graphene/graphene-webdriver-impl/2.2.0/graphene-webdriver-impl-2.2.0.jar
[INFO] Downloading: https://repo.maven.apache.org/maven2/org/jboss/arquillian/extension/arquillian-drone-impl/2.1.0.Alpha3/arquillian-drone-impl-2.1.0.Alpha3.jar
[INFO] Downloaded: https://repo.maven.apache.org/maven2/org/jboss/arquillian/container/arquillian-container-test-spi/1.1.13.Final/arquillian-container-test-spi-1.1.13.Final.jar
(27 KB at 98.2 KB/sec)
[INFO] Downloading: https://repo.maven.apache.org/maven2/org/jboss/arquillian/extension/arquillian-drone-configuration/2.1.0.Alpha3/arquillian-drone-configuration-2.1.0.Alpha3.jar
[INFO] Downloaded: https://repo.maven.apache.org/maven2/org/jboss/arquillian/graphene/graphene-webdriver-spi/2.2.0/graphene-webdriver-spi-2.2.0.jar
(21 KB at 75.0 KB/sec)
[INFO] Downloading: https://repo.maven.apache.org/maven2/org/jboss/arquillian/extension/arquillian-drone-api/2.1.0.Alpha3/arquillian-drone-api-2.1.0.Alpha3.jar
[INFO] Downloaded: https://repo.maven.apache.org/maven2/org/jboss/arquillian/extension/arquillian-drone-impl/2.1.0.Alpha3/arquillian-drone-impl-2.1.0.Alpha3.jar
(66 KB at 235.7 KB/sec)
[INFO] Downloading: https://repo.maven.apache.org/maven2/org/jboss/arquillian/extension/arquillian-drone-spi/2.1.0.Alpha3/arquillian-drone-spi-2.1.0.Alpha3.jar
[INFO] Downloaded: https://repo.maven.apache.org/maven2/org/jboss/arquillian/extension/arquillian-drone-configuration/2.1.0.Alpha3/arquillian-drone-configuration-2.1.0.Alpha3.jar
(35 KB at 120.3 KB/sec)
[INFO] Downloading: https://repo.maven.apache.org/maven2/org/jboss/arquillian/extension/arquillian-drone-webdriver/2.1.0.Alpha3/arquillian-drone-webdriver-2.1.0.Alpha3.jar
[INFO] Downloaded: https://repo.maven.apache.org/maven2/org/jboss/arquillian/extension/arquillian-drone-api/2.1.0.Alpha3/arquillian-drone-api-2.1.0.Alpha3.jar
(7 KB at 21.3 KB/sec)
[INFO] Downloading: https://repo.maven.apache.org/maven2/org/arquillian/spacelift/arquillian-spacelift/1.0.0.Alpha9/arquillian-spacelift-1.0.0.Alpha9.jar
[INFO] Downloaded: https://repo.maven.apache.org/maven2/org/jboss/arquillian/extension/arquillian-drone-spi/2.1.0.Alpha3/arquillian-drone-spi-2.1.0.Alpha3.jar
(30 KB at 99.6 KB/sec)
[INFO] Downloading: https://repo.maven.apache.org/maven2/org/arquillian/spacelift/arquillian-spacelift-api/1.0.0.Alpha9/arquillian-spacelift-api-1.0.0.Alpha9.jar
[INFO] Downloaded: https://repo.maven.apache.org/maven2/org/arquillian/spacelift/arquillian-spacelift-api/1.0.0.Alpha9/arquillian-spacelift-api-1.0.0.Alpha9.jar
(52 KB at 155.8 KB/sec)
[INFO] Downloading: https://repo.maven.apache.org/maven2/org/seleniumhq/selenium/selenium-api/3.3.1/selenium-api-3.3.1.jar
[INFO] Downloaded: https://repo.maven.apache.org/maven2/org/jboss/arquillian/extension/arquillian-drone-webdriver/2.1.0.Alpha3/arquillian-drone-webdriver-2.1.0.Alpha3.jar
(157 KB at 473.8 KB/sec)
[INFO] Downloading: https://repo.maven.apache.org/maven2/org/seleniumhq/selenium/selenium-support/3.3.1/selenium-support-3.3.1.jar
[INFO] Downloaded: https://repo.maven.apache.org/maven2/org/seleniumhq/selenium/selenium-support/3.3.1/selenium-support-3.3.1.jar
(167 KB at 453.8 KB/sec)
[INFO] Downloaded: https://repo.maven.apache.org/maven2/org/seleniumhq/selenium/selenium-api/3.3.1/selenium-api-3.3.1.jar
(101 KB at 273.2 KB/sec)
[INFO] Downloading: https://repo.maven.apache.org/maven2/org/seleniumhq/selenium/selenium-chrome-driver/3.3.1/selenium-chrome-driver-3.3.1.jar
[INFO] Downloading: https://repo.maven.apache.org/maven2/org/seleniumhq/selenium/selenium-firefox-driver/3.3.1/selenium-firefox-driver-3.3.1.jar
[INFO] Downloaded: https://repo.maven.apache.org/maven2/org/seleniumhq/selenium/selenium-chrome-driver/3.3.1/selenium-chrome-driver-3.3.1.jar
(10 KB at 24.7 KB/sec)
[INFO] Downloading: https://repo.maven.apache.org/maven2/org/seleniumhq/selenium/selenium-ie-driver/3.3.1/selenium-ie-driver-3.3.1.jar
[INFO] Downloaded: https://repo.maven.apache.org/maven2/org/jboss/arquillian/graphene/graphene-webdriver-impl/2.2.0/graphene-webdriver-impl-2.2.0.jar
(702 KB at 1728.2 KB/sec)
[INFO] Downloading: https://repo.maven.apache.org/maven2/org/seleniumhq/selenium/selenium-remote-driver/3.3.1/selenium-remote-driver-3.3.1.jar
[INFO] Downloaded: https://repo.maven.apache.org/maven2/org/seleniumhq/selenium/selenium-ie-driver/3.3.1/selenium-ie-driver-3.3.1.jar
(10 KB at 22.7 KB/sec)
[INFO] Downloading: https://repo.maven.apache.org/maven2/org/seleniumhq/selenium/htmlunit-driver/2.24/htmlunit-driver-2.24.jar
[INFO] Downloaded: https://repo.maven.apache.org/maven2/org/seleniumhq/selenium/selenium-firefox-driver/3.3.1/selenium-firefox-driver-3.3.1.jar
(778 KB at 1748.1 KB/sec)
[INFO] Downloading: https://repo.maven.apache.org/maven2/org/seleniumhq/selenium/selenium-opera-driver/3.3.1/selenium-opera-driver-3.3.1.jar
[INFO] Downloaded: https://repo.maven.apache.org/maven2/org/seleniumhq/selenium/htmlunit-driver/2.24/htmlunit-driver-2.24.jar
(64 KB at 137.1 KB/sec)
[INFO] Downloading: https://repo.maven.apache.org/maven2/org/jboss/arquillian/extension/arquillian-phantom-driver/1.2.1.1/arquillian-phantom-driver-1.2.1.1.jar
[INFO] Downloaded: https://repo.maven.apache.org/maven2/org/seleniumhq/selenium/selenium-remote-driver/3.3.1/selenium-remote-driver-3.3.1.jar
(306 KB at 664.1 KB/sec)
[INFO] Downloading: https://repo.maven.apache.org/maven2/org/seleniumhq/selenium/selenium-edge-driver/3.3.1/selenium-edge-driver-3.3.1.jar
[INFO] Downloaded: https://repo.maven.apache.org/maven2/com/google/guava/guava/21.0/guava-21.0.jar
(2463 KB at 5317.5 KB/sec)
[INFO] Downloading: https://repo.maven.apache.org/maven2/org/seleniumhq/selenium/selenium-java/3.3.1/selenium-java-3.3.1.jar
[INFO] Downloaded: https://repo.maven.apache.org/maven2/org/seleniumhq/selenium/selenium-opera-driver/3.3.1/selenium-opera-driver-3.3.1.jar
(8 KB at 16.5 KB/sec)
[INFO] Downloading: https://repo.maven.apache.org/maven2/org/seleniumhq/selenium/selenium-safari-driver/3.3.1/selenium-safari-driver-3.3.1.jar
[INFO] Downloaded: https://repo.maven.apache.org/maven2/org/seleniumhq/selenium/selenium-edge-driver/3.3.1/selenium-edge-driver-3.3.1.jar
(5 KB at 10.1 KB/sec)
[INFO] Downloading: https://repo.maven.apache.org/maven2/com/codeborne/phantomjsdriver/1.4.0/phantomjsdriver-1.4.0.jar
[INFO] Downloaded: https://repo.maven.apache.org/maven2/org/seleniumhq/selenium/selenium-java/3.3.1/selenium-java-3.3.1.jar
(382 B at 0.8 KB/sec)
[INFO] Downloaded: https://repo.maven.apache.org/maven2/org/seleniumhq/selenium/selenium-safari-driver/3.3.1/selenium-safari-driver-3.3.1.jar
(8 KB at 15.9 KB/sec)
[INFO] Downloaded: https://repo.maven.apache.org/maven2/org/jboss/arquillian/extension/arquillian-phantom-driver/1.2.1.1/arquillian-phantom-driver-1.2.1.1.jar
(25 KB at 50.8 KB/sec)
[INFO] Downloaded: https://repo.maven.apache.org/maven2/org/arquillian/spacelift/arquillian-spacelift/1.0.0.Alpha9/arquillian-spacelift-1.0.0.Alpha9.jar
(57 KB at 116.3 KB/sec)
[INFO] Downloaded: https://repo.maven.apache.org/maven2/com/codeborne/phantomjsdriver/1.4.0/phantomjsdriver-1.4.0.jar
(12 KB at 23.1 KB/sec)
[INFO] 
[INFO] --- maven-clean-plugin:2.6.1:clean (default-clean) @ tobago-example-demo ---
[INFO] 
[INFO] --- animal-sniffer-maven-plugin:1.14:check (default-cli) @ tobago-example-demo ---
[INFO] Checking unresolved references to org.codehaus.mojo.signature:java16:1.1
[INFO] 
[INFO] --- maven-checkstyle-plugin:2.17:check (default-cli) @ tobago-example-demo ---
[INFO] Starting audit...
<https://builds.apache.org/job/Tobago%20Trunk/ws/tobago-trunk/tobago-example/tobago-example-demo/src/main/java/org/apache/myfaces/tobago/example/demo/ConversationController.java>:38:16:
error: Variable 'conversation' must be private and have accessor methods.
Audit done.
[INFO] There is 1 error reported by Checkstyle 6.11.2 with tobago/checkstyle.xml ruleset.
[ERROR] src/main/java/org/apache/myfaces/tobago/example/demo/ConversationController.java:[38,16]
(design) VisibilityModifier: Variable 'conversation' must be private and have accessor methods.
[INFO] ------------------------------------------------------------------------
[INFO] Reactor Summary:
[INFO] 
[INFO] Apache Tobago ...................................... SUCCESS [  6.868 s]
[INFO] Tobago Tool ........................................ SUCCESS [  1.677 s]
[INFO] Tobago Tool Annotation ............................. SUCCESS [  3.988 s]
[INFO] Tobago Tool Apt .................................... SUCCESS [ 12.855 s]
[INFO] Tobago Core ........................................ SUCCESS [ 23.255 s]
[INFO] Tobago Themes ...................................... SUCCESS [  1.457 s]
[INFO] Tobago Theme Standard .............................. SUCCESS [ 14.348 s]
[INFO] Tobago Theme Speyside .............................. SUCCESS [  2.156 s]
[INFO] Tobago Extensions .................................. SUCCESS [  1.289 s]
[INFO] Tobago Sandbox ..................................... SUCCESS [  5.641 s]
[INFO] Tobago Examples .................................... SUCCESS [  1.804 s]
[INFO] Tobago Example Blank ............................... SUCCESS [  3.198 s]
[INFO] Tobago Example Data ................................ SUCCESS [  2.127 s]
[INFO] Tobago Example Demo ................................ FAILURE [  7.982 s]
[INFO] Tobago Example for Portlets ........................ SKIPPED
[INFO] Tobago Example Assembly ............................ SKIPPED
[INFO] Tobago Assembly .................................... SKIPPED
[INFO] ------------------------------------------------------------------------
[INFO] BUILD FAILURE
[INFO] ------------------------------------------------------------------------
[INFO] Total time: 01:40 min
[INFO] Finished at: 2017-04-04T14:48:04+00:00
[INFO] Final Memory: 67M/857M
[INFO] ------------------------------------------------------------------------
Waiting for Jenkins to finish collecting data
[ERROR] Failed to execute goal org.apache.maven.plugins:maven-checkstyle-plugin:2.17:check
(default-cli) on project tobago-example-demo: You have 1 Checkstyle violation. -> [Help
1]
[ERROR] 
[ERROR] To see the full stack trace of the errors, re-run Maven with the -e switch.
[ERROR] Re-run Maven using the -X switch to enable full debug logging.
[ERROR] 
[ERROR] For more information about the errors and possible solutions, please read the following
articles:
[ERROR] [Help 1] http://cwiki.apache.org/confluence/display/MAVEN/MojoFailureException
[ERROR] 
[ERROR] After correcting the problems, you can resume the build with the command
[ERROR]   mvn <goals> -rf :tobago-example-demo
[JENKINS] Archiving <https://builds.apache.org/job/Tobago%20Trunk/ws/tobago-trunk/tobago-theme/pom.xml>
to org.apache.myfaces.tobago/tobago-theme/3.1.0-SNAPSHOT/tobago-theme-3.1.0-SNAPSHOT.pom
[JENKINS] Archiving <https://builds.apache.org/job/Tobago%20Trunk/ws/tobago-trunk/tobago-example/tobago-example-blank/pom.xml>
to org.apache.myfaces.tobago/tobago-example-blank/3.1.0-SNAPSHOT/tobago-example-blank-3.1.0-SNAPSHOT.pom
[JENKINS] Archiving <https://builds.apache.org/job/Tobago%20Trunk/ws/tobago-trunk/tobago-example/tobago-example-blank/target/tobago-example-blank.war>
to org.apache.myfaces.tobago/tobago-example-blank/3.1.0-SNAPSHOT/tobago-example-blank-3.1.0-SNAPSHOT.war
Compressed 7.09 MB of artifacts by 62.1% relative to #841
[JENKINS] Archiving <https://builds.apache.org/job/Tobago%20Trunk/ws/tobago-trunk/tobago-assembly/pom.xml>
to org.apache.myfaces.tobago/tobago-assembly/3.1.0-SNAPSHOT/tobago-assembly-3.1.0-SNAPSHOT.pom
[JENKINS] Archiving <https://builds.apache.org/job/Tobago%20Trunk/ws/tobago-trunk/pom.xml>
to org.apache.myfaces.tobago/tobago/3.1.0-SNAPSHOT/tobago-3.1.0-SNAPSHOT.pom
[JENKINS] Archiving <https://builds.apache.org/job/Tobago%20Trunk/ws/tobago-trunk/target/tobago-3.1.0-SNAPSHOT-site.xml>
to org.apache.myfaces.tobago/tobago/3.1.0-SNAPSHOT/tobago-3.1.0-SNAPSHOT-site.xml
Compressed 52.45 KB of artifacts by 61.0% relative to #841
[JENKINS] Archiving <https://builds.apache.org/job/Tobago%20Trunk/ws/tobago-trunk/tobago-theme/tobago-theme-standard/pom.xml>
to org.apache.myfaces.tobago/tobago-theme-standard/3.1.0-SNAPSHOT/tobago-theme-standard-3.1.0-SNAPSHOT.pom
[JENKINS] Archiving <https://builds.apache.org/job/Tobago%20Trunk/ws/tobago-trunk/tobago-theme/tobago-theme-standard/target/tobago-theme-standard-3.1.0-SNAPSHOT.jar>
to org.apache.myfaces.tobago/tobago-theme-standard/3.1.0-SNAPSHOT/tobago-theme-standard-3.1.0-SNAPSHOT.jar
Compressed 1.31 MB of artifacts by 47.9% relative to #841
[JENKINS] Archiving <https://builds.apache.org/job/Tobago%20Trunk/ws/tobago-trunk/tobago-example/tobago-example-assembly/pom.xml>
to org.apache.myfaces.tobago/tobago-example-assembly/3.1.0-SNAPSHOT/tobago-example-assembly-3.1.0-SNAPSHOT.pom
[JENKINS] Archiving <https://builds.apache.org/job/Tobago%20Trunk/ws/tobago-trunk/tobago-theme/tobago-theme-speyside/pom.xml>
to org.apache.myfaces.tobago/tobago-theme-speyside/3.1.0-SNAPSHOT/tobago-theme-speyside-3.1.0-SNAPSHOT.pom
[JENKINS] Archiving <https://builds.apache.org/job/Tobago%20Trunk/ws/tobago-trunk/tobago-theme/tobago-theme-speyside/target/tobago-theme-speyside-3.1.0-SNAPSHOT.jar>
to org.apache.myfaces.tobago/tobago-theme-speyside/3.1.0-SNAPSHOT/tobago-theme-speyside-3.1.0-SNAPSHOT.jar
Compressed 152.77 KB of artifacts by 20.9% relative to #841
[JENKINS] Archiving <https://builds.apache.org/job/Tobago%20Trunk/ws/tobago-trunk/tobago-extension/pom.xml>
to org.apache.myfaces.tobago/tobago-extension/3.1.0-SNAPSHOT/tobago-extension-3.1.0-SNAPSHOT.pom
[JENKINS] Archiving <https://builds.apache.org/job/Tobago%20Trunk/ws/tobago-trunk/tobago-example/tobago-example-portlet/pom.xml>
to org.apache.myfaces.tobago/tobago-example-portlet/3.1.0-SNAPSHOT/tobago-example-portlet-3.1.0-SNAPSHOT.pom
[JENKINS] Archiving <https://builds.apache.org/job/Tobago%20Trunk/ws/tobago-trunk/tobago-tool/tobago-tool-annotation/pom.xml>
to org.apache.myfaces.tobago/tobago-tool-annotation/3.1.0-SNAPSHOT/tobago-tool-annotation-3.1.0-SNAPSHOT.pom
[JENKINS] Archiving <https://builds.apache.org/job/Tobago%20Trunk/ws/tobago-trunk/tobago-tool/tobago-tool-annotation/target/tobago-tool-annotation-3.1.0-SNAPSHOT.jar>
to org.apache.myfaces.tobago/tobago-tool-annotation/3.1.0-SNAPSHOT/tobago-tool-annotation-3.1.0-SNAPSHOT.jar
[JENKINS] Archiving <https://builds.apache.org/job/Tobago%20Trunk/ws/tobago-trunk/tobago-example/pom.xml>
to org.apache.myfaces.tobago/tobago-example/3.1.0-SNAPSHOT/tobago-example-3.1.0-SNAPSHOT.pom
[JENKINS] Archiving <https://builds.apache.org/job/Tobago%20Trunk/ws/tobago-trunk/tobago-example/tobago-example-data/pom.xml>
to org.apache.myfaces.tobago/tobago-example-data/3.1.0-SNAPSHOT/tobago-example-data-3.1.0-SNAPSHOT.pom
[JENKINS] Archiving <https://builds.apache.org/job/Tobago%20Trunk/ws/tobago-trunk/tobago-example/tobago-example-data/target/tobago-example-data-3.1.0-SNAPSHOT.jar>
to org.apache.myfaces.tobago/tobago-example-data/3.1.0-SNAPSHOT/tobago-example-data-3.1.0-SNAPSHOT.jar
[JENKINS] Archiving <https://builds.apache.org/job/Tobago%20Trunk/ws/tobago-trunk/tobago-tool/pom.xml>
to org.apache.myfaces.tobago/tobago-tool/3.1.0-SNAPSHOT/tobago-tool-3.1.0-SNAPSHOT.pom
[JENKINS] Archiving <https://builds.apache.org/job/Tobago%20Trunk/ws/tobago-trunk/tobago-core/pom.xml>
to org.apache.myfaces.tobago/tobago-core/3.1.0-SNAPSHOT/tobago-core-3.1.0-SNAPSHOT.pom
[JENKINS] Archiving <https://builds.apache.org/job/Tobago%20Trunk/ws/tobago-trunk/tobago-core/target/tobago-core-3.1.0-SNAPSHOT.jar>
to org.apache.myfaces.tobago/tobago-core/3.1.0-SNAPSHOT/tobago-core-3.1.0-SNAPSHOT.jar
[JENKINS] Archiving <https://builds.apache.org/job/Tobago%20Trunk/ws/tobago-trunk/tobago-core/target/tobago-core-3.1.0-SNAPSHOT-tests.jar>
to org.apache.myfaces.tobago/tobago-core/3.1.0-SNAPSHOT/tobago-core-3.1.0-SNAPSHOT-tests.jar
[JENKINS] Archiving <https://builds.apache.org/job/Tobago%20Trunk/ws/tobago-trunk/tobago-core/target/tobago-core-3.1.0-SNAPSHOT-sources.jar>
to org.apache.myfaces.tobago/tobago-core/3.1.0-SNAPSHOT/tobago-core-3.1.0-SNAPSHOT-sources.jar
[JENKINS] Archiving <https://builds.apache.org/job/Tobago%20Trunk/ws/tobago-trunk/tobago-tool/tobago-tool-apt/pom.xml>
to org.apache.myfaces.tobago/tobago-tool-apt/3.1.0-SNAPSHOT/tobago-tool-apt-3.1.0-SNAPSHOT.pom
[JENKINS] Archiving <https://builds.apache.org/job/Tobago%20Trunk/ws/tobago-trunk/tobago-tool/tobago-tool-apt/target/tobago-tool-apt-3.1.0-SNAPSHOT.jar>
to org.apache.myfaces.tobago/tobago-tool-apt/3.1.0-SNAPSHOT/tobago-tool-apt-3.1.0-SNAPSHOT.jar
[JENKINS] Archiving <https://builds.apache.org/job/Tobago%20Trunk/ws/tobago-trunk/tobago-extension/tobago-sandbox/pom.xml>
to org.apache.myfaces.tobago/tobago-sandbox/3.1.0-SNAPSHOT/tobago-sandbox-3.1.0-SNAPSHOT.pom
[JENKINS] Archiving <https://builds.apache.org/job/Tobago%20Trunk/ws/tobago-trunk/tobago-extension/tobago-sandbox/target/tobago-sandbox-3.1.0-SNAPSHOT.jar>
to org.apache.myfaces.tobago/tobago-sandbox/3.1.0-SNAPSHOT/tobago-sandbox-3.1.0-SNAPSHOT.jar
[JENKINS] Archiving <https://builds.apache.org/job/Tobago%20Trunk/ws/tobago-trunk/tobago-example/tobago-example-demo/pom.xml>
to org.apache.myfaces.tobago/tobago-example-demo/3.1.0-SNAPSHOT/tobago-example-demo-3.1.0-SNAPSHOT.pom
Sending e-mails to: commits@myfaces.apache.org
channel stopped

Mime
View raw message