myfaces-commits mailing list archives

Site index · List index
Message view « Date » · « Thread »
Top « Date » · « Thread »
From Apache Jenkins Server <jenk...@builds.apache.org>
Subject Build failed in Jenkins: myfaces-current-2.0 #3346
Date Sat, 01 Apr 2017 13:48:10 GMT
See <https://builds.apache.org/job/myfaces-current-2.0/3346/display/redirect>

------------------------------------------
[...truncated 353.57 KB...]
[INFO] Downloading: https://repo.maven.apache.org/maven2/org/codehaus/plexus/plexus-component-api/1.0-alpha-15/plexus-component-api-1.0-alpha-15.pom
[INFO] Downloaded: https://repo.maven.apache.org/maven2/org/codehaus/plexus/plexus-component-api/1.0-alpha-15/plexus-component-api-1.0-alpha-15.pom
(948 B at 33.1 KB/sec)
[INFO] Downloading: https://repo.maven.apache.org/maven2/org/codehaus/plexus/plexus-classworlds/1.2-alpha-6/plexus-classworlds-1.2-alpha-6.pom
[INFO] Downloaded: https://repo.maven.apache.org/maven2/org/codehaus/plexus/plexus-classworlds/1.2-alpha-6/plexus-classworlds-1.2-alpha-6.pom
(3 KB at 82.7 KB/sec)
[INFO] Downloading: https://repo.maven.apache.org/maven2/org/codehaus/plexus/plexus-io/1.0-alpha-1/plexus-io-1.0-alpha-1.pom
[INFO] Downloaded: https://repo.maven.apache.org/maven2/org/codehaus/plexus/plexus-io/1.0-alpha-1/plexus-io-1.0-alpha-1.pom
(2 KB at 44.9 KB/sec)
[INFO] Downloading: https://repo.maven.apache.org/maven2/org/codehaus/plexus/plexus-component-api/1.0-alpha-16/plexus-component-api-1.0-alpha-16.pom
[INFO] Downloaded: https://repo.maven.apache.org/maven2/org/codehaus/plexus/plexus-component-api/1.0-alpha-16/plexus-component-api-1.0-alpha-16.pom
(3 KB at 80.1 KB/sec)
[INFO] Downloading: https://repo.maven.apache.org/maven2/org/codehaus/plexus/plexus-containers/1.0-alpha-16/plexus-containers-1.0-alpha-16.pom
[INFO] Downloaded: https://repo.maven.apache.org/maven2/org/codehaus/plexus/plexus-containers/1.0-alpha-16/plexus-containers-1.0-alpha-16.pom
(2 KB at 68.2 KB/sec)
[INFO] Downloading: https://repo.maven.apache.org/maven2/org/apache/maven/maven-archiver/2.3/maven-archiver-2.3.jar
[INFO] Downloading: https://repo.maven.apache.org/maven2/org/codehaus/plexus/plexus-archiver/1.0-alpha-9/plexus-archiver-1.0-alpha-9.jar
[INFO] Downloading: https://repo.maven.apache.org/maven2/org/codehaus/plexus/plexus-io/1.0-alpha-1/plexus-io-1.0-alpha-1.jar
[INFO] Downloading: https://repo.maven.apache.org/maven2/org/codehaus/plexus/plexus-utils/1.4.9/plexus-utils-1.4.9.jar
[INFO] Downloaded: https://repo.maven.apache.org/maven2/org/apache/maven/maven-archiver/2.3/maven-archiver-2.3.jar
(18 KB at 558.9 KB/sec)
[INFO] Downloaded: https://repo.maven.apache.org/maven2/org/codehaus/plexus/plexus-io/1.0-alpha-1/plexus-io-1.0-alpha-1.jar
(12 KB at 351.3 KB/sec)
[INFO] Downloaded: https://repo.maven.apache.org/maven2/org/codehaus/plexus/plexus-archiver/1.0-alpha-9/plexus-archiver-1.0-alpha-9.jar
(154 KB at 3486.2 KB/sec)
[INFO] Downloaded: https://repo.maven.apache.org/maven2/org/codehaus/plexus/plexus-utils/1.4.9/plexus-utils-1.4.9.jar
(200 KB at 4528.0 KB/sec)
[INFO] Building jar: <https://builds.apache.org/job/myfaces-current-2.0/ws/current20/core/api/target/myfaces-api-2.0.25-SNAPSHOT.jar>
[INFO] 
[INFO] >>> maven-source-plugin:2.0.4:jar (attach-source) > generate-sources @
myfaces-api >>>
[INFO] 
[INFO] --- myfaces-builder-plugin:1.0.10:build-metadata (default) @ myfaces-api ---
[INFO] model is up to date
[INFO] 
[INFO] --- myfaces-builder-plugin:1.0.10:make-components (makecomp) @ myfaces-api ---
[INFO] generated component files are up to date
[WARNING] Failed to getClass for org.apache.maven.plugin.source.SourceJarMojo
[INFO] 
[INFO] <<< maven-source-plugin:2.0.4:jar (attach-source) < generate-sources @
myfaces-api <<<
[INFO] 
[INFO] --- maven-source-plugin:2.0.4:jar (attach-source) @ myfaces-api ---
[INFO] Building jar: <https://builds.apache.org/job/myfaces-current-2.0/ws/current20/core/api/target/myfaces-api-2.0.25-SNAPSHOT-sources.jar>
[INFO] 
[INFO] --- maven-site-plugin:3.1:attach-descriptor (attach-descriptor) @ myfaces-api ---
[INFO] 
[INFO] --- maven-jar-plugin:2.2:test-jar (default) @ myfaces-api ---
[INFO] Building jar: <https://builds.apache.org/job/myfaces-current-2.0/ws/current20/core/api/target/myfaces-api-2.0.25-SNAPSHOT-tests.jar>
[INFO] 
[INFO] --- maven-checkstyle-plugin:2.6:check (verify-style) @ myfaces-api ---
[INFO] Starting audit...
Audit done.

[INFO] 
[INFO] --- maven-install-plugin:2.3.1:install (default-install) @ myfaces-api ---
[INFO] Installing <https://builds.apache.org/job/myfaces-current-2.0/ws/current20/core/api/target/myfaces-api-2.0.25-SNAPSHOT.jar>
to /home/jenkins/jenkins-slave/maven-repositories/0/org/apache/myfaces/core/myfaces-api/2.0.25-SNAPSHOT/myfaces-api-2.0.25-SNAPSHOT.jar
[INFO] Installing <https://builds.apache.org/job/myfaces-current-2.0/ws/current20/core/api/pom.xml>
to /home/jenkins/jenkins-slave/maven-repositories/0/org/apache/myfaces/core/myfaces-api/2.0.25-SNAPSHOT/myfaces-api-2.0.25-SNAPSHOT.pom
[INFO] Installing <https://builds.apache.org/job/myfaces-current-2.0/ws/current20/core/api/target/myfaces-api-2.0.25-SNAPSHOT-sources.jar>
to /home/jenkins/jenkins-slave/maven-repositories/0/org/apache/myfaces/core/myfaces-api/2.0.25-SNAPSHOT/myfaces-api-2.0.25-SNAPSHOT-sources.jar
[INFO] Installing <https://builds.apache.org/job/myfaces-current-2.0/ws/current20/core/api/target/myfaces-api-2.0.25-SNAPSHOT-tests.jar>
to /home/jenkins/jenkins-slave/maven-repositories/0/org/apache/myfaces/core/myfaces-api/2.0.25-SNAPSHOT/myfaces-api-2.0.25-SNAPSHOT-tests.jar
[INFO] 
[INFO] --- maven-deploy-plugin:2.7:deploy (default-deploy) @ myfaces-api ---
[INFO] Downloading: https://repository.apache.org/content/repositories/snapshots/org/apache/myfaces/core/myfaces-api/2.0.25-SNAPSHOT/maven-metadata.xml
[INFO] Downloaded: https://repository.apache.org/content/repositories/snapshots/org/apache/myfaces/core/myfaces-api/2.0.25-SNAPSHOT/maven-metadata.xml
(2 KB at 3.5 KB/sec)
[INFO] Uploading: https://repository.apache.org/content/repositories/snapshots/org/apache/myfaces/core/myfaces-api/2.0.25-SNAPSHOT/myfaces-api-2.0.25-20170401.134742-86.jar
[INFO] Uploaded: https://repository.apache.org/content/repositories/snapshots/org/apache/myfaces/core/myfaces-api/2.0.25-SNAPSHOT/myfaces-api-2.0.25-20170401.134742-86.jar
(1113 KB at 1824.3 KB/sec)
[INFO] Uploading: https://repository.apache.org/content/repositories/snapshots/org/apache/myfaces/core/myfaces-api/2.0.25-SNAPSHOT/myfaces-api-2.0.25-20170401.134742-86.pom
[INFO] Uploaded: https://repository.apache.org/content/repositories/snapshots/org/apache/myfaces/core/myfaces-api/2.0.25-SNAPSHOT/myfaces-api-2.0.25-20170401.134742-86.pom
(34 KB at 80.2 KB/sec)
[INFO] Downloading: https://repository.apache.org/content/repositories/snapshots/org/apache/myfaces/core/myfaces-api/maven-metadata.xml
[INFO] Downloaded: https://repository.apache.org/content/repositories/snapshots/org/apache/myfaces/core/myfaces-api/maven-metadata.xml
(613 B at 2.6 KB/sec)
[INFO] Uploading: https://repository.apache.org/content/repositories/snapshots/org/apache/myfaces/core/myfaces-api/2.0.25-SNAPSHOT/maven-metadata.xml
[INFO] Uploaded: https://repository.apache.org/content/repositories/snapshots/org/apache/myfaces/core/myfaces-api/2.0.25-SNAPSHOT/maven-metadata.xml
(2 KB at 3.1 KB/sec)
[INFO] Uploading: https://repository.apache.org/content/repositories/snapshots/org/apache/myfaces/core/myfaces-api/maven-metadata.xml
[INFO] Uploaded: https://repository.apache.org/content/repositories/snapshots/org/apache/myfaces/core/myfaces-api/maven-metadata.xml
(613 B at 1.7 KB/sec)
[INFO] Uploading: https://repository.apache.org/content/repositories/snapshots/org/apache/myfaces/core/myfaces-api/2.0.25-SNAPSHOT/myfaces-api-2.0.25-20170401.134742-86-sources.jar
[INFO] Uploaded: https://repository.apache.org/content/repositories/snapshots/org/apache/myfaces/core/myfaces-api/2.0.25-SNAPSHOT/myfaces-api-2.0.25-20170401.134742-86-sources.jar
(871 KB at 1498.5 KB/sec)
[INFO] Uploading: https://repository.apache.org/content/repositories/snapshots/org/apache/myfaces/core/myfaces-api/2.0.25-SNAPSHOT/maven-metadata.xml
[INFO] Uploaded: https://repository.apache.org/content/repositories/snapshots/org/apache/myfaces/core/myfaces-api/2.0.25-SNAPSHOT/maven-metadata.xml
(2 KB at 3.3 KB/sec)
[INFO] Uploading: https://repository.apache.org/content/repositories/snapshots/org/apache/myfaces/core/myfaces-api/2.0.25-SNAPSHOT/myfaces-api-2.0.25-20170401.134742-86-tests.jar
[INFO] Uploaded: https://repository.apache.org/content/repositories/snapshots/org/apache/myfaces/core/myfaces-api/2.0.25-SNAPSHOT/myfaces-api-2.0.25-20170401.134742-86-tests.jar
(200 KB at 399.1 KB/sec)
[INFO] Uploading: https://repository.apache.org/content/repositories/snapshots/org/apache/myfaces/core/myfaces-api/2.0.25-SNAPSHOT/maven-metadata.xml
[INFO] Uploaded: https://repository.apache.org/content/repositories/snapshots/org/apache/myfaces/core/myfaces-api/2.0.25-SNAPSHOT/maven-metadata.xml
(2 KB at 3.2 KB/sec)
[INFO]                                                                         
[INFO] ------------------------------------------------------------------------
[INFO] Building Apache MyFaces Shared Public API For JSF 2.0 - Core 2.0.25-SNAPSHOT
[INFO] ------------------------------------------------------------------------
[INFO] 
[INFO] --- maven-clean-plugin:2.5:clean (default-clean) @ myfaces-impl-shared-public ---
[INFO] Deleting <https://builds.apache.org/job/myfaces-current-2.0/ws/current20/core/shared-public/target>
[INFO] 
[INFO] --- myfaces-builder-plugin:1.0.10:build-metadata (makemyfacesmetadata) @ myfaces-impl-shared-public
---
log4j:WARN No appenders could be found for logger (org.apache.commons.digester.Digester.sax).
log4j:WARN Please initialize the log4j system properly.
Artifact: myfaces-api-2.0.25-SNAPSHOT.jar have META-INF/myfaces-metadata.xml
[INFO] 
[INFO] --- maven-remote-resources-plugin:1.4:process (default) @ myfaces-impl-shared-public
---
[INFO] 
[INFO] --- maven-resources-plugin:2.5:resources (default-resources) @ myfaces-impl-shared-public
---
[debug] execute contextualize
[INFO] Using 'UTF-8' encoding to copy filtered resources.
[INFO] Copying 2 resources
[INFO] Copying 1 resource
[INFO] Copying 3 resources
[INFO] 
[INFO] --- maven-compiler-plugin:2.0.2:compile (default-compile) @ myfaces-impl-shared-public
---
[INFO] Compiling 21 source files to <https://builds.apache.org/job/myfaces-current-2.0/ws/current20/core/shared-public/target/classes>
[INFO] 
[INFO] --- maven-resources-plugin:2.5:testResources (default-testResources) @ myfaces-impl-shared-public
---
[debug] execute contextualize
[INFO] Using 'UTF-8' encoding to copy filtered resources.
[INFO] Copying 15 resources
[INFO] Copying 3 resources
[INFO] 
[INFO] --- maven-compiler-plugin:2.0.2:testCompile (default-testCompile) @ myfaces-impl-shared-public
---
[INFO] Compiling 1 source file to <https://builds.apache.org/job/myfaces-current-2.0/ws/current20/core/shared-public/target/test-classes>
[INFO] 
[INFO] --- maven-surefire-plugin:2.9:test (default-test) @ myfaces-impl-shared-public ---
[INFO] Surefire report directory: <https://builds.apache.org/job/myfaces-current-2.0/ws/current20/core/shared-public/target/surefire-reports>

-------------------------------------------------------
 T E S T S
-------------------------------------------------------
Running org.apache.myfaces.shared.util.MessageUtilsTest
currency £100.00
Exception in thread "ThreadedStreamConsumer" java.lang.OutOfMemoryError: PermGen space
	at org.apache.maven.surefire.shade.org.codehaus.plexus.util.xml.Xpp3Dom.<clinit>(Xpp3Dom.java:54)
	at org.apache.maven.surefire.report.XMLReporter.createTestElement(XMLReporter.java:178)
	at org.apache.maven.surefire.report.XMLReporter.testSucceeded(XMLReporter.java:171)
	at org.apache.maven.surefire.report.MulticastingReporter.testSucceeded(MulticastingReporter.java:66)
	at org.apache.maven.surefire.report.TestSetRunListener.testSucceeded(TestSetRunListener.java:133)
	at org.apache.maven.plugin.surefire.booterclient.output.ForkClient.consumeLine(ForkClient.java:103)
	at org.apache.maven.plugin.surefire.booterclient.output.ThreadedStreamConsumer$Pumper.run(ThreadedStreamConsumer.java:67)
	at java.lang.Thread.run(Thread.java:745)

Results :

Tests run: 0, Failures: 0, Errors: 0, Skipped: 0

[JENKINS] Recording test results
[INFO] 
[INFO] --- maven-jar-plugin:2.3.2:jar (default-jar) @ myfaces-impl-shared-public ---
[INFO] Building jar: <https://builds.apache.org/job/myfaces-current-2.0/ws/current20/core/shared-public/target/myfaces-impl-shared-public-2.0.25-SNAPSHOT.jar>
[INFO] 
[INFO] >>> maven-source-plugin:2.0.4:jar (attach-source) > generate-sources @
myfaces-impl-shared-public >>>
[INFO] 
[INFO] --- myfaces-builder-plugin:1.0.10:build-metadata (makemyfacesmetadata) @ myfaces-impl-shared-public
---
[INFO] model is up to date
[WARNING] Failed to getClass for org.apache.maven.plugin.source.SourceJarMojo
[INFO] 
[INFO] <<< maven-source-plugin:2.0.4:jar (attach-source) < generate-sources @
myfaces-impl-shared-public <<<
[INFO] 
[INFO] --- maven-source-plugin:2.0.4:jar (attach-source) @ myfaces-impl-shared-public ---
[INFO] Building jar: <https://builds.apache.org/job/myfaces-current-2.0/ws/current20/core/shared-public/target/myfaces-impl-shared-public-2.0.25-SNAPSHOT-sources.jar>
[INFO] 
[INFO] --- maven-site-plugin:3.1:attach-descriptor (attach-descriptor) @ myfaces-impl-shared-public
---
[INFO] 
[INFO] --- maven-checkstyle-plugin:2.6:check (verify-style) @ myfaces-impl-shared-public ---
[INFO] Starting audit...
Audit done.

[INFO] 
[INFO] --- maven-install-plugin:2.3.1:install (default-install) @ myfaces-impl-shared-public
---
[INFO] Installing <https://builds.apache.org/job/myfaces-current-2.0/ws/current20/core/shared-public/target/myfaces-impl-shared-public-2.0.25-SNAPSHOT.jar>
to /home/jenkins/jenkins-slave/maven-repositories/0/org/apache/myfaces/core/internal/myfaces-impl-shared-public/2.0.25-SNAPSHOT/myfaces-impl-shared-public-2.0.25-SNAPSHOT.jar
[INFO] Installing <https://builds.apache.org/job/myfaces-current-2.0/ws/current20/core/shared-public/pom.xml>
to /home/jenkins/jenkins-slave/maven-repositories/0/org/apache/myfaces/core/internal/myfaces-impl-shared-public/2.0.25-SNAPSHOT/myfaces-impl-shared-public-2.0.25-SNAPSHOT.pom
[INFO] Installing <https://builds.apache.org/job/myfaces-current-2.0/ws/current20/core/shared-public/target/myfaces-impl-shared-public-2.0.25-SNAPSHOT-sources.jar>
to /home/jenkins/jenkins-slave/maven-repositories/0/org/apache/myfaces/core/internal/myfaces-impl-shared-public/2.0.25-SNAPSHOT/myfaces-impl-shared-public-2.0.25-SNAPSHOT-sources.jar
[INFO] 
[INFO] --- maven-deploy-plugin:2.7:deploy (default-deploy) @ myfaces-impl-shared-public ---
[INFO] Downloading: https://repository.apache.org/content/repositories/snapshots/org/apache/myfaces/core/internal/myfaces-impl-shared-public/2.0.25-SNAPSHOT/maven-metadata.xml
[INFO] Downloaded: https://repository.apache.org/content/repositories/snapshots/org/apache/myfaces/core/internal/myfaces-impl-shared-public/2.0.25-SNAPSHOT/maven-metadata.xml
(2 KB at 3.0 KB/sec)
[INFO] Uploading: https://repository.apache.org/content/repositories/snapshots/org/apache/myfaces/core/internal/myfaces-impl-shared-public/2.0.25-SNAPSHOT/myfaces-impl-shared-public-2.0.25-20170401.134757-85.jar
[INFO] Uploaded: https://repository.apache.org/content/repositories/snapshots/org/apache/myfaces/core/internal/myfaces-impl-shared-public/2.0.25-SNAPSHOT/myfaces-impl-shared-public-2.0.25-20170401.134757-85.jar
(89 KB at 192.3 KB/sec)
[INFO] Uploading: https://repository.apache.org/content/repositories/snapshots/org/apache/myfaces/core/internal/myfaces-impl-shared-public/2.0.25-SNAPSHOT/myfaces-impl-shared-public-2.0.25-20170401.134757-85.pom
[INFO] Uploaded: https://repository.apache.org/content/repositories/snapshots/org/apache/myfaces/core/internal/myfaces-impl-shared-public/2.0.25-SNAPSHOT/myfaces-impl-shared-public-2.0.25-20170401.134757-85.pom
(7 KB at 18.6 KB/sec)
[INFO] Downloading: https://repository.apache.org/content/repositories/snapshots/org/apache/myfaces/core/internal/myfaces-impl-shared-public/maven-metadata.xml
[INFO] Downloaded: https://repository.apache.org/content/repositories/snapshots/org/apache/myfaces/core/internal/myfaces-impl-shared-public/maven-metadata.xml
(555 B at 2.3 KB/sec)
[INFO] Uploading: https://repository.apache.org/content/repositories/snapshots/org/apache/myfaces/core/internal/myfaces-impl-shared-public/2.0.25-SNAPSHOT/maven-metadata.xml
[INFO] Uploaded: https://repository.apache.org/content/repositories/snapshots/org/apache/myfaces/core/internal/myfaces-impl-shared-public/2.0.25-SNAPSHOT/maven-metadata.xml
(2 KB at 2.7 KB/sec)
[INFO] Uploading: https://repository.apache.org/content/repositories/snapshots/org/apache/myfaces/core/internal/myfaces-impl-shared-public/maven-metadata.xml
[INFO] Uploaded: https://repository.apache.org/content/repositories/snapshots/org/apache/myfaces/core/internal/myfaces-impl-shared-public/maven-metadata.xml
(555 B at 1.5 KB/sec)
[INFO] Uploading: https://repository.apache.org/content/repositories/snapshots/org/apache/myfaces/core/internal/myfaces-impl-shared-public/2.0.25-SNAPSHOT/myfaces-impl-shared-public-2.0.25-20170401.134757-85-sources.jar
[INFO] Uploaded: https://repository.apache.org/content/repositories/snapshots/org/apache/myfaces/core/internal/myfaces-impl-shared-public/2.0.25-SNAPSHOT/myfaces-impl-shared-public-2.0.25-20170401.134757-85-sources.jar
(85 KB at 176.5 KB/sec)
[INFO] Uploading: https://repository.apache.org/content/repositories/snapshots/org/apache/myfaces/core/internal/myfaces-impl-shared-public/2.0.25-SNAPSHOT/maven-metadata.xml
[INFO] Uploaded: https://repository.apache.org/content/repositories/snapshots/org/apache/myfaces/core/internal/myfaces-impl-shared-public/2.0.25-SNAPSHOT/maven-metadata.xml
(2 KB at 2.7 KB/sec)
[INFO]                                                                         
[INFO] ------------------------------------------------------------------------
[INFO] Building Apache MyFaces Shared For JSF 2.0 - Core 2.0.25-SNAPSHOT
[INFO] ------------------------------------------------------------------------
[INFO] Downloading: https://repo.maven.apache.org/maven2/org/apache/maven/plugins/maven-shade-plugin/1.3.3/maven-shade-plugin-1.3.3.pom
[INFO] Downloaded: https://repo.maven.apache.org/maven2/org/apache/maven/plugins/maven-shade-plugin/1.3.3/maven-shade-plugin-1.3.3.pom
(6 KB at 177.7 KB/sec)
[INFO] Downloading: https://repo.maven.apache.org/maven2/org/apache/maven/plugins/maven-shade-plugin/1.3.3/maven-shade-plugin-1.3.3.jar
[INFO] Downloaded: https://repo.maven.apache.org/maven2/org/apache/maven/plugins/maven-shade-plugin/1.3.3/maven-shade-plugin-1.3.3.jar
(79 KB at 2306.8 KB/sec)
[INFO] 
[INFO] --- maven-clean-plugin:2.5:clean (default-clean) @ myfaces-impl-shared ---
[INFO] Deleting <https://builds.apache.org/job/myfaces-current-2.0/ws/current20/core/shared/target>
[INFO] 
[INFO] --- myfaces-builder-plugin:1.0.10:build-metadata (makemyfacesmetadata) @ myfaces-impl-shared
---
Artifact: myfaces-api-2.0.25-SNAPSHOT.jar have META-INF/myfaces-metadata.xml
Artifact: myfaces-impl-shared-public-2.0.25-SNAPSHOT.jar have META-INF/myfaces-metadata.xml
[INFO] 
[INFO] --- maven-remote-resources-plugin:1.4:process (default) @ myfaces-impl-shared ---
[INFO] 
[INFO] --- build-helper-maven-plugin:1.5:add-resource (add-resource) @ myfaces-impl-shared
---
[INFO] 
[INFO] --- myfaces-javascript-plugin:1.0.1:compile (compile-myfacesscripts) @ myfaces-impl-shared
---
[INFO] Reading assembler descriptor <https://builds.apache.org/job/myfaces-current-2.0/ws/current20/core/shared/src/assembler/myfacesscripts-compiler.xml>
[INFO] 
[INFO] --- myfaces-javascript-plugin:1.0.1:compile (compile-myfacesscripts-uncompressed) @
myfaces-impl-shared ---
[INFO] Reading assembler descriptor <https://builds.apache.org/job/myfaces-current-2.0/ws/current20/core/shared/src/assembler/myfacesscripts-uncompressed-compiler.xml>
[INFO] 
[INFO] --- myfaces-javascript-plugin:1.0.1:compress (compress-myfacesscripts) @ myfaces-impl-shared
---
[INFO] Compressing javascript using YahooUI
[INFO] ------------------------------------------------------------------------------

[WARNING] [WARNING] The variable i has already been declared in the same scope...
&&params!=null){for(var i ---> = <--- 0,param;(param=params[

[WARNING] [WARNING] The variable param has already been declared in the same scope...
){for(var i=0,param ---> ; <--- (param=params[i]);
[INFO] oamSubmit.js (5,741 bytes) ................................. compressed at 67%
[INFO] ------------------------------------------------------------------------------
[INFO] compression saved 3,867 bytes
[INFO] 
[INFO] --- maven-resources-plugin:2.5:resources (default-resources) @ myfaces-impl-shared
---
[debug] execute contextualize
[INFO] Using 'UTF-8' encoding to copy filtered resources.
[INFO] Copying 2 resources
[INFO] Copying 1 resource
[INFO] Copying 3 resources
[INFO] Copying 2 resources
[INFO] 
[INFO] --- maven-compiler-plugin:2.0.2:compile (default-compile) @ myfaces-impl-shared ---
[INFO] Compiling 120 source files to <https://builds.apache.org/job/myfaces-current-2.0/ws/current20/core/shared/target/classes>
[ERROR] Unexpected error in channel channel
java.lang.OutOfMemoryError: PermGen space
channel stopped
[WARNING] Failed to notify spy hudson.maven.Maven3Builder$JenkinsEventSpy: java.io.IOException:
Remote call on channel failed
[INFO] ------------------------------------------------------------------------
[INFO] Reactor Summary:
[INFO] 
[INFO] Apache MyFaces Shared For JSF 2.0 - Project ........ SUCCESS [ 13.817 s]
[INFO] Apache MyFaces Shared For JSF 2.0 - Core Mirror .... SUCCESS [ 41.248 s]
[INFO] MyFaces Shared Tomahawk ............................ SUCCESS [ 14.588 s]
[INFO] Apache MyFaces JSF-2.0 Core Project ................ SUCCESS [  4.680 s]
[INFO] Apache MyFaces JSF-2.0 Core API .................... SUCCESS [ 49.731 s]
[INFO] Apache MyFaces Shared Public API For JSF 2.0 - Core  SUCCESS [ 13.019 s]
[INFO] Apache MyFaces Shared For JSF 2.0 - Core ........... FAILURE [  5.003 s]
[INFO] Apache MyFaces JSF-2.0 Core Impl for Java EE 6 ..... SKIPPED
[INFO] Apache MyFaces JSF-2.0 Core Impl ................... SKIPPED
[INFO] Apache MyFaces JSF-2.0 Core OSGi Bundle ............ SKIPPED
[INFO] Apache MyFaces JSF-2.0 Core Module ................. SKIPPED
[INFO] Apache MyFaces Composite Build ..................... SKIPPED
[INFO] ------------------------------------------------------------------------
[INFO] BUILD FAILURE
[INFO] ------------------------------------------------------------------------
[INFO] Total time: 02:33 min
[INFO] Finished at: 2017-04-01T13:48:05+00:00
[INFO] Final Memory: 70M/1631M
[INFO] ------------------------------------------------------------------------
ERROR: Maven JVM terminated unexpectedly with exit code 0


Mime
View raw message