myfaces-commits mailing list archives

Site index · List index
Message view « Date » · « Thread »
Top « Date » · « Thread »
From Apache Jenkins Server <jenk...@builds.apache.org>
Subject Build failed in Jenkins: myfaces-current-2.0 #3359
Date Mon, 01 May 2017 23:46:52 GMT
See <https://builds.apache.org/job/myfaces-current-2.0/3359/display/redirect>

------------------------------------------
[...truncated 480.57 KB...]
	at java.lang.reflect.Method.invoke(Method.java:606)
	at hudson.maven.Maven3Builder.call(Maven3Builder.java:139)
	at hudson.maven.Maven3Builder.call(Maven3Builder.java:70)
	at hudson.remoting.UserRequest.perform(UserRequest.java:153)
	at hudson.remoting.UserRequest.perform(UserRequest.java:50)
	at hudson.remoting.Request$2.run(Request.java:336)
	at hudson.remoting.InterceptingExecutorService$1.call(InterceptingExecutorService.java:68)
	at java.util.concurrent.FutureTask.run(FutureTask.java:262)
	at java.util.concurrent.ThreadPoolExecutor.runWorker(ThreadPoolExecutor.java:1145)
	at java.util.concurrent.ThreadPoolExecutor$Worker.run(ThreadPoolExecutor.java:615)
	at java.lang.Thread.run(Thread.java:745)
Caused by: java.lang.OutOfMemoryError: PermGen space
	at sun.misc.Unsafe.defineClass(Native Method)
	at sun.reflect.ClassDefiner.defineClass(ClassDefiner.java:63)
	at sun.reflect.MethodAccessorGenerator$1.run(MethodAccessorGenerator.java:399)
	at sun.reflect.MethodAccessorGenerator$1.run(MethodAccessorGenerator.java:396)
	at java.security.AccessController.doPrivileged(Native Method)
	at sun.reflect.MethodAccessorGenerator.generate(MethodAccessorGenerator.java:395)
	at sun.reflect.MethodAccessorGenerator.generateSerializationConstructor(MethodAccessorGenerator.java:113)
	at sun.reflect.ReflectionFactory.newConstructorForSerialization(ReflectionFactory.java:331)
	at java.io.ObjectStreamClass.getSerializableConstructor(ObjectStreamClass.java:1376)
	at java.io.ObjectStreamClass.access$1500(ObjectStreamClass.java:72)
	at java.io.ObjectStreamClass$2.run(ObjectStreamClass.java:493)
	at java.io.ObjectStreamClass$2.run(ObjectStreamClass.java:468)
	at java.security.AccessController.doPrivileged(Native Method)
	at java.io.ObjectStreamClass.<init>(ObjectStreamClass.java:468)
	at java.io.ObjectStreamClass.lookup(ObjectStreamClass.java:365)
	at java.io.ObjectOutputStream.writeObject0(ObjectOutputStream.java:1133)
	at java.io.ObjectOutputStream.writeArray(ObjectOutputStream.java:1377)
	at java.io.ObjectOutputStream.writeObject0(ObjectOutputStream.java:1173)
	at java.io.ObjectOutputStream.defaultWriteFields(ObjectOutputStream.java:1547)
	at java.io.ObjectOutputStream.defaultWriteObject(ObjectOutputStream.java:440)
	at java.lang.Throwable.writeObject(Throwable.java:985)
	at sun.reflect.NativeMethodAccessorImpl.invoke0(Native Method)
	at sun.reflect.NativeMethodAccessorImpl.invoke(NativeMethodAccessorImpl.java:57)
	at sun.reflect.DelegatingMethodAccessorImpl.invoke(DelegatingMethodAccessorImpl.java:43)
	at java.lang.reflect.Method.invoke(Method.java:606)
	at java.io.ObjectStreamClass.invokeWriteObject(ObjectStreamClass.java:988)
	at java.io.ObjectOutputStream.writeSerialData(ObjectOutputStream.java:1495)
	at java.io.ObjectOutputStream.writeOrdinaryObject(ObjectOutputStream.java:1431)
	at java.io.ObjectOutputStream.writeObject0(ObjectOutputStream.java:1177)
	at java.io.ObjectOutputStream.defaultWriteFields(ObjectOutputStream.java:1547)
	at java.io.ObjectOutputStream.writeSerialData(ObjectOutputStream.java:1508)
	at java.io.ObjectOutputStream.writeOrdinaryObject(ObjectOutputStream.java:1431)
[INFO] 
[INFO] --- maven-jar-plugin:2.3.2:jar (default-jar) @ myfaces-impl-shared-public ---
[INFO] Building jar: <https://builds.apache.org/job/myfaces-current-2.0/ws/current20/core/shared-public/target/myfaces-impl-shared-public-2.0.25-SNAPSHOT.jar>
[WARNING] Failed to notify spy hudson.maven.Maven3Builder$JenkinsEventSpy: java.io.IOException:
Remote call on channel failed
[INFO] 
[INFO] >>> maven-source-plugin:2.0.4:jar (attach-source) > generate-sources @
myfaces-impl-shared-public >>>
[INFO] 
[INFO] --- myfaces-builder-plugin:1.0.10:build-metadata (makemyfacesmetadata) @ myfaces-impl-shared-public
---
[INFO] model is up to date
[WARNING] Failed to notify spy hudson.maven.Maven3Builder$JenkinsEventSpy: java.io.IOException:
Remote call on channel failed
[WARNING] Failed to getClass for org.apache.maven.plugin.source.SourceJarMojo
[WARNING] Failed to notify spy hudson.maven.Maven3Builder$JenkinsEventSpy: java.io.IOException:
Remote call on channel failed
[INFO] 
[INFO] <<< maven-source-plugin:2.0.4:jar (attach-source) < generate-sources @
myfaces-impl-shared-public <<<
[INFO] 
[INFO] --- maven-source-plugin:2.0.4:jar (attach-source) @ myfaces-impl-shared-public ---
[INFO] Building jar: <https://builds.apache.org/job/myfaces-current-2.0/ws/current20/core/shared-public/target/myfaces-impl-shared-public-2.0.25-SNAPSHOT-sources.jar>
[WARNING] Failed to notify spy hudson.maven.Maven3Builder$JenkinsEventSpy: java.io.IOException:
Remote call on channel failed
[INFO] 
[INFO] --- maven-site-plugin:3.1:attach-descriptor (attach-descriptor) @ myfaces-impl-shared-public
---
[WARNING] Failed to notify spy hudson.maven.Maven3Builder$JenkinsEventSpy: java.io.IOException:
Remote call on channel failed
[INFO] 
[INFO] --- maven-checkstyle-plugin:2.6:check (verify-style) @ myfaces-impl-shared-public ---
[INFO] Starting audit...
Audit done.

[WARNING] Failed to notify spy hudson.maven.Maven3Builder$JenkinsEventSpy: java.io.IOException:
Remote call on channel failed
[INFO] 
[INFO] --- maven-install-plugin:2.3.1:install (default-install) @ myfaces-impl-shared-public
---
[INFO] Installing <https://builds.apache.org/job/myfaces-current-2.0/ws/current20/core/shared-public/target/myfaces-impl-shared-public-2.0.25-SNAPSHOT.jar>
to /home/jenkins/jenkins-slave/maven-repositories/0/org/apache/myfaces/core/internal/myfaces-impl-shared-public/2.0.25-SNAPSHOT/myfaces-impl-shared-public-2.0.25-SNAPSHOT.jar
[INFO] Installing <https://builds.apache.org/job/myfaces-current-2.0/ws/current20/core/shared-public/pom.xml>
to /home/jenkins/jenkins-slave/maven-repositories/0/org/apache/myfaces/core/internal/myfaces-impl-shared-public/2.0.25-SNAPSHOT/myfaces-impl-shared-public-2.0.25-SNAPSHOT.pom
[INFO] Installing <https://builds.apache.org/job/myfaces-current-2.0/ws/current20/core/shared-public/target/myfaces-impl-shared-public-2.0.25-SNAPSHOT-sources.jar>
to /home/jenkins/jenkins-slave/maven-repositories/0/org/apache/myfaces/core/internal/myfaces-impl-shared-public/2.0.25-SNAPSHOT/myfaces-impl-shared-public-2.0.25-SNAPSHOT-sources.jar
[WARNING] Failed to notify spy hudson.maven.Maven3Builder$JenkinsEventSpy: java.io.IOException:
Remote call on channel failed
[INFO] 
[INFO] --- maven-deploy-plugin:2.7:deploy (default-deploy) @ myfaces-impl-shared-public ---
[INFO] Downloading: https://repository.apache.org/content/repositories/snapshots/org/apache/myfaces/core/internal/myfaces-impl-shared-public/2.0.25-SNAPSHOT/maven-metadata.xml
[INFO] Downloaded: https://repository.apache.org/content/repositories/snapshots/org/apache/myfaces/core/internal/myfaces-impl-shared-public/2.0.25-SNAPSHOT/maven-metadata.xml
(2 KB at 1.4 KB/sec)
[INFO] Uploading: https://repository.apache.org/content/repositories/snapshots/org/apache/myfaces/core/internal/myfaces-impl-shared-public/2.0.25-SNAPSHOT/myfaces-impl-shared-public-2.0.25-20170501.234603-94.jar
[INFO] Uploaded: https://repository.apache.org/content/repositories/snapshots/org/apache/myfaces/core/internal/myfaces-impl-shared-public/2.0.25-SNAPSHOT/myfaces-impl-shared-public-2.0.25-20170501.234603-94.jar
(89 KB at 83.3 KB/sec)
[INFO] Uploading: https://repository.apache.org/content/repositories/snapshots/org/apache/myfaces/core/internal/myfaces-impl-shared-public/2.0.25-SNAPSHOT/myfaces-impl-shared-public-2.0.25-20170501.234603-94.pom
[INFO] Uploaded: https://repository.apache.org/content/repositories/snapshots/org/apache/myfaces/core/internal/myfaces-impl-shared-public/2.0.25-SNAPSHOT/myfaces-impl-shared-public-2.0.25-20170501.234603-94.pom
(7 KB at 8.2 KB/sec)
[INFO] Downloading: https://repository.apache.org/content/repositories/snapshots/org/apache/myfaces/core/internal/myfaces-impl-shared-public/maven-metadata.xml
[INFO] Downloaded: https://repository.apache.org/content/repositories/snapshots/org/apache/myfaces/core/internal/myfaces-impl-shared-public/maven-metadata.xml
(555 B at 1.0 KB/sec)
[INFO] Uploading: https://repository.apache.org/content/repositories/snapshots/org/apache/myfaces/core/internal/myfaces-impl-shared-public/2.0.25-SNAPSHOT/maven-metadata.xml
[INFO] Uploaded: https://repository.apache.org/content/repositories/snapshots/org/apache/myfaces/core/internal/myfaces-impl-shared-public/2.0.25-SNAPSHOT/maven-metadata.xml
(2 KB at 1.2 KB/sec)
[INFO] Uploading: https://repository.apache.org/content/repositories/snapshots/org/apache/myfaces/core/internal/myfaces-impl-shared-public/maven-metadata.xml
[INFO] Uploaded: https://repository.apache.org/content/repositories/snapshots/org/apache/myfaces/core/internal/myfaces-impl-shared-public/maven-metadata.xml
(555 B at 0.7 KB/sec)
[INFO] Uploading: https://repository.apache.org/content/repositories/snapshots/org/apache/myfaces/core/internal/myfaces-impl-shared-public/2.0.25-SNAPSHOT/myfaces-impl-shared-public-2.0.25-20170501.234603-94-sources.jar
[INFO] Uploaded: https://repository.apache.org/content/repositories/snapshots/org/apache/myfaces/core/internal/myfaces-impl-shared-public/2.0.25-SNAPSHOT/myfaces-impl-shared-public-2.0.25-20170501.234603-94-sources.jar
(85 KB at 83.6 KB/sec)
[INFO] Uploading: https://repository.apache.org/content/repositories/snapshots/org/apache/myfaces/core/internal/myfaces-impl-shared-public/2.0.25-SNAPSHOT/maven-metadata.xml
[INFO] Uploaded: https://repository.apache.org/content/repositories/snapshots/org/apache/myfaces/core/internal/myfaces-impl-shared-public/2.0.25-SNAPSHOT/maven-metadata.xml
(2 KB at 1.2 KB/sec)
[WARNING] Failed to notify spy hudson.maven.Maven3Builder$JenkinsEventSpy: java.io.IOException:
Remote call on channel failed
[WARNING] Failed to notify spy hudson.maven.Maven3Builder$JenkinsEventSpy: java.io.IOException:
Remote call on channel failed
[WARNING] Failed to notify spy hudson.maven.Maven3Builder$JenkinsEventSpy: java.io.IOException:
Remote call on channel failed
[INFO]                                                                         
[INFO] ------------------------------------------------------------------------
[INFO] Building Apache MyFaces Shared For JSF 2.0 - Core 2.0.25-SNAPSHOT
[INFO] ------------------------------------------------------------------------
[INFO] 
[INFO] --- maven-clean-plugin:2.5:clean (default-clean) @ myfaces-impl-shared ---
[WARNING] Failed to notify spy hudson.maven.Maven3Builder$JenkinsEventSpy: java.io.IOException:
Remote call on channel failed
[INFO] 
[INFO] --- myfaces-builder-plugin:1.0.10:build-metadata (makemyfacesmetadata) @ myfaces-impl-shared
---
Artifact: myfaces-api-2.0.25-SNAPSHOT.jar have META-INF/myfaces-metadata.xml
Artifact: myfaces-impl-shared-public-2.0.25-SNAPSHOT.jar have META-INF/myfaces-metadata.xml
[WARNING] Failed to notify spy hudson.maven.Maven3Builder$JenkinsEventSpy: java.io.IOException:
Remote call on channel failed
[INFO] 
[INFO] --- maven-remote-resources-plugin:1.4:process (default) @ myfaces-impl-shared ---
[WARNING] Failed to notify spy hudson.maven.Maven3Builder$JenkinsEventSpy: java.io.IOException:
Remote call on channel failed
[INFO] 
[INFO] --- build-helper-maven-plugin:1.5:add-resource (add-resource) @ myfaces-impl-shared
---
[WARNING] Failed to notify spy hudson.maven.Maven3Builder$JenkinsEventSpy: java.io.IOException:
Remote call on channel failed
[INFO] 
[INFO] --- myfaces-javascript-plugin:1.0.1:compile (compile-myfacesscripts) @ myfaces-impl-shared
---
[INFO] Reading assembler descriptor <https://builds.apache.org/job/myfaces-current-2.0/ws/current20/core/shared/src/assembler/myfacesscripts-compiler.xml>
[WARNING] Failed to notify spy hudson.maven.Maven3Builder$JenkinsEventSpy: java.io.IOException:
Remote call on channel failed
[INFO] 
[INFO] --- myfaces-javascript-plugin:1.0.1:compile (compile-myfacesscripts-uncompressed) @
myfaces-impl-shared ---
[INFO] Reading assembler descriptor <https://builds.apache.org/job/myfaces-current-2.0/ws/current20/core/shared/src/assembler/myfacesscripts-uncompressed-compiler.xml>
[WARNING] Failed to notify spy hudson.maven.Maven3Builder$JenkinsEventSpy: java.io.IOException:
Remote call on channel failed
[INFO] 
[INFO] --- myfaces-javascript-plugin:1.0.1:compress (compress-myfacesscripts) @ myfaces-impl-shared
---
[INFO] Compressing javascript using YahooUI
[INFO] ------------------------------------------------------------------------------

[WARNING] [WARNING] The variable i has already been declared in the same scope...
&&params!=null){for(var i ---> = <--- 0,param;(param=params[

[WARNING] [WARNING] The variable param has already been declared in the same scope...
){for(var i=0,param ---> ; <--- (param=params[i]);
[INFO] oamSubmit.js (5,741 bytes) ................................. compressed at 67%
[INFO] ------------------------------------------------------------------------------
[INFO] compression saved 3,867 bytes
[WARNING] Failed to notify spy hudson.maven.Maven3Builder$JenkinsEventSpy: java.io.IOException:
Remote call on channel failed
[INFO] 
[INFO] --- maven-resources-plugin:2.5:resources (default-resources) @ myfaces-impl-shared
---
[debug] execute contextualize
[INFO] Using 'UTF-8' encoding to copy filtered resources.
[INFO] Copying 2 resources
[INFO] Copying 1 resource
[INFO] Copying 3 resources
[INFO] Copying 2 resources
[WARNING] Failed to notify spy hudson.maven.Maven3Builder$JenkinsEventSpy: java.io.IOException:
Remote call on channel failed
[INFO] 
[INFO] --- maven-compiler-plugin:2.0.2:compile (default-compile) @ myfaces-impl-shared ---
[INFO] Compiling 120 source files to <https://builds.apache.org/job/myfaces-current-2.0/ws/current20/core/shared/target/classes>
[WARNING] Failed to notify spy hudson.maven.Maven3Builder$JenkinsEventSpy: cannot change build
result while in NOT_STARTED
[INFO] ------------------------------------------------------------------------
[INFO] Reactor Summary:
[INFO] 
[INFO] Apache MyFaces Shared For JSF 2.0 - Project ........ SUCCESS [ 10.835 s]
[INFO] Apache MyFaces Shared For JSF 2.0 - Core Mirror .... SUCCESS [ 31.374 s]
[INFO] MyFaces Shared Tomahawk ............................ SUCCESS [ 17.075 s]
[INFO] Apache MyFaces JSF-2.0 Core Project ................ SUCCESS [  7.331 s]
[INFO] Apache MyFaces JSF-2.0 Core API .................... SUCCESS [ 45.385 s]
[INFO] Apache MyFaces Shared Public API For JSF 2.0 - Core  SUCCESS [ 16.551 s]
[INFO] Apache MyFaces Shared For JSF 2.0 - Core ........... FAILURE [  4.012 s]
[INFO] Apache MyFaces JSF-2.0 Core Impl for Java EE 6 ..... SKIPPED
[INFO] Apache MyFaces JSF-2.0 Core Impl ................... SKIPPED
[INFO] Apache MyFaces JSF-2.0 Core OSGi Bundle ............ SKIPPED
[INFO] Apache MyFaces JSF-2.0 Core Module ................. SKIPPED
[INFO] Apache MyFaces Composite Build ..................... SKIPPED
[INFO] ------------------------------------------------------------------------
[INFO] BUILD FAILURE
[INFO] ------------------------------------------------------------------------
[INFO] Total time: 02:20 min
[INFO] Finished at: 2017-05-01T23:46:16+00:00
[INFO] Final Memory: 75M/1921M
[INFO] ------------------------------------------------------------------------
Waiting for Jenkins to finish collecting data
[ERROR] Failed to execute goal org.apache.maven.plugins:maven-compiler-plugin:2.0.2:compile
(default-compile) on project myfaces-impl-shared: Compilation failure
[ERROR] Failure executing javac, but could not parse the error:
[ERROR] 
[ERROR] 
[ERROR] The system is out of resources.
[ERROR] Consult the following stack trace for details.
[ERROR] java.lang.OutOfMemoryError: PermGen space
[ERROR] at java.lang.ClassLoader.defineClass1(Native Method)
[ERROR] at java.lang.ClassLoader.defineClass(ClassLoader.java:800)
[ERROR] at java.security.SecureClassLoader.defineClass(SecureClassLoader.java:142)
[ERROR] at java.net.URLClassLoader.defineClass(URLClassLoader.java:449)
[ERROR] at java.net.URLClassLoader.access$100(URLClassLoader.java:71)
[ERROR] at java.net.URLClassLoader$1.run(URLClassLoader.java:361)
[ERROR] at java.net.URLClassLoader$1.run(URLClassLoader.java:355)
[ERROR] at java.security.AccessController.doPrivileged(Native Method)
[ERROR] at java.net.URLClassLoader.findClass(URLClassLoader.java:354)
[ERROR] at org.codehaus.plexus.compiler.javac.IsolatedClassLoader.loadClass(IsolatedClassLoader.java:56)
[ERROR] at com.sun.tools.javac.comp.MemberEnter.<init>(MemberEnter.java:95)
[ERROR] at com.sun.tools.javac.comp.MemberEnter.instance(MemberEnter.java:85)
[ERROR] at com.sun.tools.javac.comp.Enter.<init>(Enter.java:126)
[ERROR] at com.sun.tools.javac.comp.Enter.instance(Enter.java:114)
[ERROR] at com.sun.tools.javac.comp.Check.<init>(Check.java:96)
[ERROR] at com.sun.tools.javac.comp.Check.instance(Check.java:86)
[ERROR] at com.sun.tools.javac.code.Types.<init>(Types.java:101)
[ERROR] at com.sun.tools.javac.code.Types.instance(Types.java:88)
[ERROR] at com.sun.tools.javac.jvm.ClassReader.<init>(ClassReader.java:264)
[ERROR] at com.sun.tools.javac.jvm.ClassReader.instance(ClassReader.java:226)
[ERROR] at com.sun.tools.javac.main.JavaCompiler.<init>(JavaCompiler.java:331)
[ERROR] at com.sun.tools.javac.main.JavaCompiler.instance(JavaCompiler.java:88)
[ERROR] at com.sun.tools.javac.main.Main.compile(Main.java:424)
[ERROR] at com.sun.tools.javac.main.Main.compile(Main.java:353)
[ERROR] at com.sun.tools.javac.main.Main.compile(Main.java:342)
[ERROR] at com.sun.tools.javac.main.Main.compile(Main.java:333)
[ERROR] at com.sun.tools.javac.Main.compile(Main.java:94)
[ERROR] at sun.reflect.NativeMethodAccessorImpl.invoke0(Native Method)
[ERROR] at sun.reflect.NativeMethodAccessorImpl.invoke(NativeMethodAccessorImpl.java:57)
[ERROR] at sun.reflect.DelegatingMethodAccessorImpl.invoke(DelegatingMethodAccessorImpl.java:43)
[ERROR] at java.lang.reflect.Method.invoke(Method.java:606)
[ERROR] at org.codehaus.plexus.compiler.javac.JavacCompiler.compileInProcess(JavacCompiler.java:420)
[ERROR] -> [Help 1]
[ERROR] 
[ERROR] To see the full stack trace of the errors, re-run Maven with the -e switch.
[ERROR] Re-run Maven using the -X switch to enable full debug logging.
[ERROR] 
[ERROR] For more information about the errors and possible solutions, please read the following
articles:
[ERROR] [Help 1] http://cwiki.apache.org/confluence/display/MAVEN/MojoFailureException
[ERROR] 
[ERROR] After correcting the problems, you can resume the build with the command
[ERROR]   mvn <goals> -rf :myfaces-impl-shared
[JENKINS] Archiving <https://builds.apache.org/job/myfaces-current-2.0/ws/current20/core/implee6/pom.xml>
to org.apache.myfaces.core.internal/myfaces-impl-ee6/2.0.25-SNAPSHOT/myfaces-impl-ee6-2.0.25-SNAPSHOT.pom
[JENKINS] Archiving <https://builds.apache.org/job/myfaces-current-2.0/ws/current20/core/api/pom.xml>
to org.apache.myfaces.core/myfaces-api/2.0.25-SNAPSHOT/myfaces-api-2.0.25-SNAPSHOT.pom
[JENKINS] Archiving <https://builds.apache.org/job/myfaces-current-2.0/ws/current20/core/api/target/myfaces-api-2.0.25-SNAPSHOT.jar>
to org.apache.myfaces.core/myfaces-api/2.0.25-20170501.234543-99/myfaces-api-2.0.25-20170501.234543-99.jar
[JENKINS] Archiving <https://builds.apache.org/job/myfaces-current-2.0/ws/current20/core/api/target/myfaces-api-2.0.25-SNAPSHOT-sources.jar>
to org.apache.myfaces.core/myfaces-api/2.0.25-20170501.234543-99/myfaces-api-2.0.25-20170501.234543-99-sources.jar
[JENKINS] Archiving <https://builds.apache.org/job/myfaces-current-2.0/ws/current20/core/api/target/myfaces-api-2.0.25-SNAPSHOT-tests.jar>
to org.apache.myfaces.core/myfaces-api/2.0.25-20170501.234543-99/myfaces-api-2.0.25-20170501.234543-99-tests.jar
[JENKINS] Archiving <https://builds.apache.org/job/myfaces-current-2.0/ws/current20/shared/pom.xml>
to org.apache.myfaces.shared/myfaces-shared-project/4.0.24-SNAPSHOT/myfaces-shared-project-4.0.24-SNAPSHOT.pom
[JENKINS] Archiving <https://builds.apache.org/job/myfaces-current-2.0/ws/current20/shared/target/myfaces-shared-project-4.0.24-SNAPSHOT-site.xml>
to org.apache.myfaces.shared/myfaces-shared-project/4.0.24-20170501.234403-99/myfaces-shared-project-4.0.24-20170501.234403-99-site.xml
[JENKINS] Archiving <https://builds.apache.org/job/myfaces-current-2.0/ws/current20/shared/core/pom.xml>
to org.apache.myfaces.shared/myfaces-shared-core/4.0.24-SNAPSHOT/myfaces-shared-core-4.0.24-SNAPSHOT.pom
[JENKINS] Archiving <https://builds.apache.org/job/myfaces-current-2.0/ws/current20/shared/core/target/myfaces-shared-core-4.0.24-SNAPSHOT.jar>
to org.apache.myfaces.shared/myfaces-shared-core/4.0.24-20170501.234434-99/myfaces-shared-core-4.0.24-20170501.234434-99.jar
[JENKINS] Archiving <https://builds.apache.org/job/myfaces-current-2.0/ws/current20/shared/core/target/myfaces-shared-core-4.0.24-SNAPSHOT-sources.jar>
to org.apache.myfaces.shared/myfaces-shared-core/4.0.24-20170501.234434-99/myfaces-shared-core-4.0.24-20170501.234434-99-sources.jar
[JENKINS] Archiving <https://builds.apache.org/job/myfaces-current-2.0/ws/current20/shared/shared-tomahawk/pom.xml>
to org.apache.myfaces.shared/myfaces-shared-tomahawk/4.0.24-SNAPSHOT/myfaces-shared-tomahawk-4.0.24-SNAPSHOT.pom
[JENKINS] Archiving <https://builds.apache.org/job/myfaces-current-2.0/ws/current20/shared/shared-tomahawk/target/myfaces-shared-tomahawk-4.0.24-SNAPSHOT.jar>
to org.apache.myfaces.shared/myfaces-shared-tomahawk/4.0.24-20170501.234452-99/myfaces-shared-tomahawk-4.0.24-20170501.234452-99.jar
[JENKINS] Archiving <https://builds.apache.org/job/myfaces-current-2.0/ws/current20/shared/shared-tomahawk/target/myfaces-shared-tomahawk-4.0.24-SNAPSHOT-sources.jar>
to org.apache.myfaces.shared/myfaces-shared-tomahawk/4.0.24-20170501.234452-99/myfaces-shared-tomahawk-4.0.24-20170501.234452-99-sources.jar
[JENKINS] Archiving <https://builds.apache.org/job/myfaces-current-2.0/ws/current20/core/shared/pom.xml>
to org.apache.myfaces.core.internal/myfaces-impl-shared/2.0.25-SNAPSHOT/myfaces-impl-shared-2.0.25-SNAPSHOT.pom
[JENKINS] Archiving <https://builds.apache.org/job/myfaces-current-2.0/ws/current20/pom.xml>
to org.apache.myfaces/myfaces-base/2.0.5-SNAPSHOT/myfaces-base-2.0.5-SNAPSHOT.pom
[JENKINS] Archiving <https://builds.apache.org/job/myfaces-current-2.0/ws/current20/core/impl/pom.xml>
to org.apache.myfaces.core/myfaces-impl/2.0.25-SNAPSHOT/myfaces-impl-2.0.25-SNAPSHOT.pom
Compressed 57.57 KB of artifacts by 55.6% relative to #3340
[JENKINS] Archiving <https://builds.apache.org/job/myfaces-current-2.0/ws/current20/core/bundle/pom.xml>
to org.apache.myfaces.core/myfaces-bundle/2.0.25-SNAPSHOT/myfaces-bundle-2.0.25-SNAPSHOT.pom
[JENKINS] Archiving <https://builds.apache.org/job/myfaces-current-2.0/ws/current20/core/pom.xml>
to org.apache.myfaces.core/myfaces-core-module/2.0.25-SNAPSHOT/myfaces-core-module-2.0.25-SNAPSHOT.pom
[JENKINS] Archiving <https://builds.apache.org/job/myfaces-current-2.0/ws/current20/core/shared-public/pom.xml>
to org.apache.myfaces.core.internal/myfaces-impl-shared-public/2.0.25-SNAPSHOT/myfaces-impl-shared-public-2.0.25-SNAPSHOT.pom
[JENKINS] Archiving <https://builds.apache.org/job/myfaces-current-2.0/ws/current20/core/shared-public/target/myfaces-impl-shared-public-2.0.25-SNAPSHOT.jar>
to org.apache.myfaces.core.internal/myfaces-impl-shared-public/2.0.25-20170501.234603-94/myfaces-impl-shared-public-2.0.25-20170501.234603-94.jar
[JENKINS] Archiving <https://builds.apache.org/job/myfaces-current-2.0/ws/current20/core/shared-public/target/myfaces-impl-shared-public-2.0.25-SNAPSHOT-sources.jar>
to org.apache.myfaces.core.internal/myfaces-impl-shared-public/2.0.25-20170501.234603-94/myfaces-impl-shared-public-2.0.25-20170501.234603-94-sources.jar
No artifacts from myfaces-current-2.0 ยป Apache MyFaces Shared Public API For JSF 2.0 - Core
#3356 to compare, so performing full copy of artifacts
[JENKINS] Archiving <https://builds.apache.org/job/myfaces-current-2.0/ws/current20/core/parent/pom.xml>
to org.apache.myfaces.core/myfaces-core-project/2.0.25-SNAPSHOT/myfaces-core-project-2.0.25-SNAPSHOT.pom
[JENKINS] Archiving <https://builds.apache.org/job/myfaces-current-2.0/ws/current20/core/parent/target/myfaces-core-project-2.0.25-SNAPSHOT-site.xml>
to org.apache.myfaces.core/myfaces-core-project/2.0.25-20170501.234501-99/myfaces-core-project-2.0.25-20170501.234501-99-site.xml
channel stopped

Mime
View raw message