myfaces-commits mailing list archives

Site index · List index
Message view « Date » · « Thread »
Top « Date » · « Thread »
From Apache Jenkins Server <jenk...@builds.apache.org>
Subject Build failed in Jenkins: myfaces-current23 #118
Date Thu, 10 Aug 2017 18:41:30 GMT
See <https://builds.apache.org/job/myfaces-current23/118/display/redirect?page=changes>

Changes:

[tandraschko] (MYFACES-3163) [perf] review working with SelectItem(s)

------------------------------------------
[...truncated 854.02 KB...]
[INFO] 
[INFO] --- maven-site-plugin:3.3:attach-descriptor (attach-descriptor) @ myfaces-impl-shared-public
---
[INFO] 
[INFO] --- maven-checkstyle-plugin:2.17:check (verify-style) @ myfaces-impl-shared-public
---
[INFO] Starting audit...
Audit done.
[INFO] 
[INFO] --- maven-install-plugin:2.3.1:install (default-install) @ myfaces-impl-shared-public
---
[INFO] Installing <https://builds.apache.org/job/myfaces-current23/ws/2.3.x/shared-public/target/myfaces-impl-shared-public-2.3.0-SNAPSHOT.jar>
to /home/jenkins/jenkins-slave/maven-repositories/1/org/apache/myfaces/core/internal/myfaces-impl-shared-public/2.3.0-SNAPSHOT/myfaces-impl-shared-public-2.3.0-SNAPSHOT.jar
[INFO] Installing <https://builds.apache.org/job/myfaces-current23/ws/2.3.x/shared-public/pom.xml>
to /home/jenkins/jenkins-slave/maven-repositories/1/org/apache/myfaces/core/internal/myfaces-impl-shared-public/2.3.0-SNAPSHOT/myfaces-impl-shared-public-2.3.0-SNAPSHOT.pom
[INFO] Installing <https://builds.apache.org/job/myfaces-current23/ws/2.3.x/shared-public/target/myfaces-impl-shared-public-2.3.0-SNAPSHOT-sources.jar>
to /home/jenkins/jenkins-slave/maven-repositories/1/org/apache/myfaces/core/internal/myfaces-impl-shared-public/2.3.0-SNAPSHOT/myfaces-impl-shared-public-2.3.0-SNAPSHOT-sources.jar
[INFO] Installing <https://builds.apache.org/job/myfaces-current23/ws/2.3.x/shared-public/target/myfaces-impl-shared-public-2.3.0-SNAPSHOT-sources.jar>
to /home/jenkins/jenkins-slave/maven-repositories/1/org/apache/myfaces/core/internal/myfaces-impl-shared-public/2.3.0-SNAPSHOT/myfaces-impl-shared-public-2.3.0-SNAPSHOT-sources.jar
[INFO] 
[INFO] --- maven-deploy-plugin:2.7:deploy (default-deploy) @ myfaces-impl-shared-public ---
[INFO] Downloading: https://repository.apache.org/content/repositories/snapshots/org/apache/myfaces/core/internal/myfaces-impl-shared-public/2.3.0-SNAPSHOT/maven-metadata.xml
[INFO] Downloaded: https://repository.apache.org/content/repositories/snapshots/org/apache/myfaces/core/internal/myfaces-impl-shared-public/2.3.0-SNAPSHOT/maven-metadata.xml
(1.0 kB at 4.2 kB/s)
[INFO] Uploading: https://repository.apache.org/content/repositories/snapshots/org/apache/myfaces/core/internal/myfaces-impl-shared-public/2.3.0-SNAPSHOT/myfaces-impl-shared-public-2.3.0-20170810.184047-167.jar
[INFO] Uploaded: https://repository.apache.org/content/repositories/snapshots/org/apache/myfaces/core/internal/myfaces-impl-shared-public/2.3.0-SNAPSHOT/myfaces-impl-shared-public-2.3.0-20170810.184047-167.jar
(96 kB at 179 kB/s)
[INFO] Uploading: https://repository.apache.org/content/repositories/snapshots/org/apache/myfaces/core/internal/myfaces-impl-shared-public/2.3.0-SNAPSHOT/myfaces-impl-shared-public-2.3.0-20170810.184047-167.pom
[INFO] Uploaded: https://repository.apache.org/content/repositories/snapshots/org/apache/myfaces/core/internal/myfaces-impl-shared-public/2.3.0-SNAPSHOT/myfaces-impl-shared-public-2.3.0-20170810.184047-167.pom
(6.9 kB at 15 kB/s)
[INFO] Downloading: https://repository.apache.org/content/repositories/snapshots/org/apache/myfaces/core/internal/myfaces-impl-shared-public/maven-metadata.xml
[INFO] Downloaded: https://repository.apache.org/content/repositories/snapshots/org/apache/myfaces/core/internal/myfaces-impl-shared-public/maven-metadata.xml
(555 B at 2.3 kB/s)
[INFO] Uploading: https://repository.apache.org/content/repositories/snapshots/org/apache/myfaces/core/internal/myfaces-impl-shared-public/2.3.0-SNAPSHOT/maven-metadata.xml
[INFO] Uploaded: https://repository.apache.org/content/repositories/snapshots/org/apache/myfaces/core/internal/myfaces-impl-shared-public/2.3.0-SNAPSHOT/maven-metadata.xml
(1.0 kB at 2.2 kB/s)
[INFO] Uploading: https://repository.apache.org/content/repositories/snapshots/org/apache/myfaces/core/internal/myfaces-impl-shared-public/maven-metadata.xml
[INFO] Uploaded: https://repository.apache.org/content/repositories/snapshots/org/apache/myfaces/core/internal/myfaces-impl-shared-public/maven-metadata.xml
(555 B at 1.2 kB/s)
[INFO] Uploading: https://repository.apache.org/content/repositories/snapshots/org/apache/myfaces/core/internal/myfaces-impl-shared-public/2.3.0-SNAPSHOT/myfaces-impl-shared-public-2.3.0-20170810.184047-167-sources.jar
[INFO] Uploaded: https://repository.apache.org/content/repositories/snapshots/org/apache/myfaces/core/internal/myfaces-impl-shared-public/2.3.0-SNAPSHOT/myfaces-impl-shared-public-2.3.0-20170810.184047-167-sources.jar
(88 kB at 165 kB/s)
[INFO] Uploading: https://repository.apache.org/content/repositories/snapshots/org/apache/myfaces/core/internal/myfaces-impl-shared-public/2.3.0-SNAPSHOT/maven-metadata.xml
[INFO] Uploaded: https://repository.apache.org/content/repositories/snapshots/org/apache/myfaces/core/internal/myfaces-impl-shared-public/2.3.0-SNAPSHOT/maven-metadata.xml
(1.0 kB at 1.9 kB/s)
[INFO] Uploading: https://repository.apache.org/content/repositories/snapshots/org/apache/myfaces/core/internal/myfaces-impl-shared-public/2.3.0-SNAPSHOT/myfaces-impl-shared-public-2.3.0-20170810.184047-167-sources.jar
[INFO] Uploaded: https://repository.apache.org/content/repositories/snapshots/org/apache/myfaces/core/internal/myfaces-impl-shared-public/2.3.0-SNAPSHOT/myfaces-impl-shared-public-2.3.0-20170810.184047-167-sources.jar
(88 kB at 164 kB/s)
[INFO] Uploading: https://repository.apache.org/content/repositories/snapshots/org/apache/myfaces/core/internal/myfaces-impl-shared-public/2.3.0-SNAPSHOT/maven-metadata.xml
[INFO] Uploaded: https://repository.apache.org/content/repositories/snapshots/org/apache/myfaces/core/internal/myfaces-impl-shared-public/2.3.0-SNAPSHOT/maven-metadata.xml
(1.0 kB at 2.2 kB/s)
[INFO] 
[INFO] ------------------------------------------------------------------------
[INFO] Building Apache MyFaces Core For JSF 2.3 - Shared 2.3.0-SNAPSHOT
[INFO] ------------------------------------------------------------------------
[INFO] 
[INFO] --- maven-clean-plugin:2.5:clean (default-clean) @ myfaces-impl-shared ---
[INFO] 
[INFO] --- myfaces-builder-plugin:1.0.10:build-metadata (makemyfacesmetadata) @ myfaces-impl-shared
---
Artifact: myfaces-api-2.3.0-SNAPSHOT.jar have META-INF/myfaces-metadata.xml
Artifact: myfaces-impl-shared-public-2.3.0-SNAPSHOT.jar have META-INF/myfaces-metadata.xml
[INFO] 
[INFO] --- maven-remote-resources-plugin:1.4:process (default) @ myfaces-impl-shared ---
[INFO] 
[INFO] --- build-helper-maven-plugin:1.5:add-resource (add-resource) @ myfaces-impl-shared
---
[INFO] 
[INFO] --- myfaces-javascript-plugin:1.0.1:compile (compile-myfacesscripts) @ myfaces-impl-shared
---
[INFO] Reading assembler descriptor <https://builds.apache.org/job/myfaces-current23/ws/2.3.x/shared/src/assembler/myfacesscripts-compiler.xml>
[INFO] 
[INFO] --- myfaces-javascript-plugin:1.0.1:compile (compile-myfacesscripts-uncompressed) @
myfaces-impl-shared ---
[INFO] Reading assembler descriptor <https://builds.apache.org/job/myfaces-current23/ws/2.3.x/shared/src/assembler/myfacesscripts-uncompressed-compiler.xml>
[INFO] 
[INFO] --- myfaces-javascript-plugin:1.0.1:compress (compress-myfacesscripts) @ myfaces-impl-shared
---
[INFO] Compressing javascript using YahooUI
[INFO] ------------------------------------------------------------------------------

[WARNING] [WARNING] The variable i has already been declared in the same scope...
&&params!=null){for(var i ---> = <--- 0,param;(param=params[

[WARNING] [WARNING] The variable param has already been declared in the same scope...
){for(var i=0,param ---> ; <--- (param=params[i]);
[INFO] oamSubmit.js (5,741 bytes) ................................. compressed at 67%
[INFO] ------------------------------------------------------------------------------
[INFO] compression saved 3,867 bytes
[INFO] 
[INFO] --- maven-resources-plugin:2.5:resources (default-resources) @ myfaces-impl-shared
---
[debug] execute contextualize
[INFO] Using 'UTF-8' encoding to copy filtered resources.
[INFO] Copying 2 resources
[INFO] Copying 1 resource
[INFO] Copying 3 resources
[INFO] Copying 2 resources
[INFO] 
[INFO] --- maven-compiler-plugin:3.6.1:compile (default-compile) @ myfaces-impl-shared ---
[INFO] Changes detected - recompiling the module!
[INFO] Compiling 138 source files to <https://builds.apache.org/job/myfaces-current23/ws/2.3.x/shared/target/classes>
[INFO] <https://builds.apache.org/job/myfaces-current23/ws/2.3.x/shared/src/main/java/org/apache/myfaces/shared/el/SimpleActionMethodBinding.java>:
Some input files use or override a deprecated API.
[INFO] <https://builds.apache.org/job/myfaces-current23/ws/2.3.x/shared/src/main/java/org/apache/myfaces/shared/el/SimpleActionMethodBinding.java>:
Recompile with -Xlint:deprecation for details.
[INFO] <https://builds.apache.org/job/myfaces-current23/ws/2.3.x/shared/src/main/java/org/apache/myfaces/shared/util/BiLevelCacheMap.java>:
Some input files use unchecked or unsafe operations.
[INFO] <https://builds.apache.org/job/myfaces-current23/ws/2.3.x/shared/src/main/java/org/apache/myfaces/shared/util/BiLevelCacheMap.java>:
Recompile with -Xlint:unchecked for details.
[INFO] 
[INFO] --- maven-resources-plugin:2.5:testResources (default-testResources) @ myfaces-impl-shared
---
[debug] execute contextualize
[INFO] Using 'UTF-8' encoding to copy filtered resources.
[INFO] Copying 15 resources
[INFO] Copying 3 resources
[INFO] 
[INFO] --- maven-compiler-plugin:3.6.1:testCompile (default-testCompile) @ myfaces-impl-shared
---
[INFO] Changes detected - recompiling the module!
[INFO] Compiling 25 source files to <https://builds.apache.org/job/myfaces-current23/ws/2.3.x/shared/target/test-classes>
[INFO] <https://builds.apache.org/job/myfaces-current23/ws/2.3.x/shared/src/test/java/org/apache/myfaces/shared/renderkit/RendererUtilsTest.java>:
Some input files use or override a deprecated API.
[INFO] <https://builds.apache.org/job/myfaces-current23/ws/2.3.x/shared/src/test/java/org/apache/myfaces/shared/renderkit/RendererUtilsTest.java>:
Recompile with -Xlint:deprecation for details.
[INFO] <https://builds.apache.org/job/myfaces-current23/ws/2.3.x/shared/src/test/java/org/apache/myfaces/shared/util/AbstractStateUtilsTest.java>:
Some input files use unchecked or unsafe operations.
[INFO] <https://builds.apache.org/job/myfaces-current23/ws/2.3.x/shared/src/test/java/org/apache/myfaces/shared/util/AbstractStateUtilsTest.java>:
Recompile with -Xlint:unchecked for details.
[INFO] 
[INFO] --- maven-surefire-plugin:2.16:test (default-test) @ myfaces-impl-shared ---
[INFO] Surefire report directory: <https://builds.apache.org/job/myfaces-current23/ws/2.3.x/shared/target/surefire-reports>
[INFO] parallel='classes', perCoreThreadCount=true, threadCount=4, useUnlimitedThreads=false,
threadCountSuites=0, threadCountClasses=0, threadCountMethods=0

-------------------------------------------------------
 T E S T S
-------------------------------------------------------
Running org.apache.myfaces.shared.renderkit.RendererUtilsTest
No Renderer found for component {Component-Path : [Class: javax.faces.component.html.HtmlGraphicImage,Id:
graphicImageId]} (component-family=javax.faces.Graphic, renderer-type=javax.faces.Image)
Aug 10, 2017 6:40:59 PM javax.faces.component.UIComponentBase getRenderer
WARNING: No Renderer found for component {Component-Path : [Class: javax.faces.component.html.HtmlGraphicImage,Id:
graphicImageId]} (component-family=javax.faces.Graphic, renderer-type=javax.faces.Image)
Tests run: 7, Failures: 0, Errors: 0, Skipped: 0, Time elapsed: 0.713 sec - in org.apache.myfaces.shared.renderkit.RendererUtilsTest
Running org.apache.myfaces.shared.renderkit.html.HtmlRendererUtilsTest
No Renderer found for component {Component-Path : [Class: javax.faces.component.html.HtmlInputText,Id:
j_id__v_0]} (component-family=javax.faces.Input, renderer-type=javax.faces.Text)
Aug 10, 2017 6:40:59 PM javax.faces.component.UIComponentBase getRenderer
WARNING: No Renderer found for component {Component-Path : [Class: javax.faces.component.html.HtmlInputText,Id:
j_id__v_0]} (component-family=javax.faces.Input, renderer-type=javax.faces.Text)
Tests run: 3, Failures: 0, Errors: 0, Skipped: 0, Time elapsed: 0.027 sec - in org.apache.myfaces.shared.renderkit.html.HtmlRendererUtilsTest
Running org.apache.myfaces.shared.renderkit.html.HtmlResponseWriterImplTest
Tests run: 13, Failures: 0, Errors: 0, Skipped: 0, Time elapsed: 0.06 sec - in org.apache.myfaces.shared.renderkit.html.HtmlResponseWriterImplTest
Running org.apache.myfaces.shared.renderkit.html.util.HTMLEncoderWriterTest
Tests run: 26, Failures: 0, Errors: 0, Skipped: 0, Time elapsed: 0.013 sec - in org.apache.myfaces.shared.renderkit.html.util.HTMLEncoderWriterTest
Running org.apache.myfaces.shared.renderkit.html.util.HTMLEncoderTest
Tests run: 27, Failures: 0, Errors: 0, Skipped: 0, Time elapsed: 0.011 sec - in org.apache.myfaces.shared.renderkit.html.util.HTMLEncoderTest
Running org.apache.myfaces.shared.webapp.webxml.ServletMappingTest
Tests run: 2, Failures: 0, Errors: 0, Skipped: 0, Time elapsed: 0.045 sec - in org.apache.myfaces.shared.webapp.webxml.ServletMappingTest
Running org.apache.myfaces.shared.util.CachedStateUtilsBlowfish_ECBTest
Tests run: 11, Failures: 0, Errors: 0, Skipped: 0, Time elapsed: 0.622 sec - in org.apache.myfaces.shared.util.CachedStateUtilsBlowfish_ECBTest
Running org.apache.myfaces.shared.util.StateUtilsAES_CBCTest
Tests run: 11, Failures: 0, Errors: 0, Skipped: 0, Time elapsed: 0.03 sec - in org.apache.myfaces.shared.util.StateUtilsAES_CBCTest
Running org.apache.myfaces.shared.util.StateUtilsTripleDES_ECBTest
Tests run: 11, Failures: 0, Errors: 0, Skipped: 0, Time elapsed: 0.054 sec - in org.apache.myfaces.shared.util.StateUtilsTripleDES_ECBTest
Running org.apache.myfaces.shared.util.SecretKeyCacheTest
Tests run: 3, Failures: 0, Errors: 0, Skipped: 0, Time elapsed: 0.002 sec - in org.apache.myfaces.shared.util.SecretKeyCacheTest
Running org.apache.myfaces.shared.util.CachedStateUtilsTripleDES_ECBTest
Tests run: 11, Failures: 0, Errors: 0, Skipped: 0, Time elapsed: 0.011 sec - in org.apache.myfaces.shared.util.CachedStateUtilsTripleDES_ECBTest
Running org.apache.myfaces.shared.util.CachedStateUtilsAES_CBCTest
Tests run: 11, Failures: 0, Errors: 0, Skipped: 0, Time elapsed: 0.052 sec - in org.apache.myfaces.shared.util.CachedStateUtilsAES_CBCTest
Running org.apache.myfaces.shared.util.SecretKeyConfigurationTest
Tests run: 4, Failures: 0, Errors: 0, Skipped: 0, Time elapsed: 0.002 sec - in org.apache.myfaces.shared.util.SecretKeyConfigurationTest
Running org.apache.myfaces.shared.util.MessageUtilsTest
currency £100.00
Tests run: 11, Failures: 0, Errors: 0, Skipped: 0, Time elapsed: 0.12 sec - in org.apache.myfaces.shared.util.MessageUtilsTest
Running org.apache.myfaces.shared.util.StateUtilsBlowfish_ECBTest
Tests run: 11, Failures: 0, Errors: 0, Skipped: 0, Time elapsed: 0.01 sec - in org.apache.myfaces.shared.util.StateUtilsBlowfish_ECBTest
Running org.apache.myfaces.shared.util.CachedStateUtilsDefaultTest
Tests run: 11, Failures: 0, Errors: 0, Skipped: 0, Time elapsed: 0.009 sec - in org.apache.myfaces.shared.util.CachedStateUtilsDefaultTest
Running org.apache.myfaces.shared.util.StateUtilsDefaultTest
Tests run: 11, Failures: 0, Errors: 0, Skipped: 0, Time elapsed: 0.008 sec - in org.apache.myfaces.shared.util.StateUtilsDefaultTest
Running org.apache.myfaces.shared.util.InitVector_CBCTestCase
Tests run: 2, Failures: 0, Errors: 0, Skipped: 0, Time elapsed: 0.001 sec - in org.apache.myfaces.shared.util.InitVector_CBCTestCase
Running org.apache.myfaces.shared.resource.ResourceValidationUtilsTest
Tests run: 3, Failures: 0, Errors: 0, Skipped: 0, Time elapsed: 0.003 sec - in org.apache.myfaces.shared.resource.ResourceValidationUtilsTest
Running org.apache.myfaces.shared.renderkit.ContentTypeUtilsTest
Tests run: 2, Failures: 0, Errors: 0, Skipped: 0, Time elapsed: 0.013 sec - in org.apache.myfaces.shared.renderkit.ContentTypeUtilsTest
Running org.apache.myfaces.shared.util.CommentUtilsTest
Tests run: 5, Failures: 0, Errors: 0, Skipped: 0, Time elapsed: 0.015 sec - in org.apache.myfaces.shared.util.CommentUtilsTest
Running org.apache.myfaces.shared.renderkit.html.util.UnicodeEncoderTest
Tests run: 4, Failures: 0, Errors: 0, Skipped: 0, Time elapsed: 0.002 sec - in org.apache.myfaces.shared.renderkit.html.util.UnicodeEncoderTest
Running org.apache.myfaces.shared.application.DefaultViewHandlerSupportTest
Tests run: 8, Failures: 0, Errors: 0, Skipped: 0, Time elapsed: 0.017 sec - in org.apache.myfaces.shared.application.DefaultViewHandlerSupportTest
Running org.apache.myfaces.shared.context.flash.FlashImplTest
Tests run: 13, Failures: 0, Errors: 0, Skipped: 0, Time elapsed: 0.041 sec - in org.apache.myfaces.shared.context.flash.FlashImplTest

Results :

Tests run: 221, Failures: 0, Errors: 0, Skipped: 0

[JENKINS] Recording test results
[INFO] 
[INFO] --- maven-jar-plugin:2.3.2:jar (default-jar) @ myfaces-impl-shared ---
[INFO] Building jar: <https://builds.apache.org/job/myfaces-current23/ws/2.3.x/shared/target/myfaces-impl-shared-2.3.0-SNAPSHOT.jar>
[INFO] 
[INFO] >>> maven-source-plugin:2.2.1:jar (attach-source) > generate-sources @
myfaces-impl-shared >>>
[INFO] 
[INFO] --- myfaces-builder-plugin:1.0.10:build-metadata (makemyfacesmetadata) @ myfaces-impl-shared
---
[INFO] model is up to date
[WARNING] Failed to getClass for org.apache.maven.plugin.source.SourceJarMojo
[INFO] 
[INFO] <<< maven-source-plugin:2.2.1:jar (attach-source) < generate-sources @
myfaces-impl-shared <<<
[INFO] 
[INFO] 
[INFO] --- maven-source-plugin:2.2.1:jar (attach-source) @ myfaces-impl-shared ---
[INFO] Building jar: <https://builds.apache.org/job/myfaces-current23/ws/2.3.x/shared/target/myfaces-impl-shared-2.3.0-SNAPSHOT-sources.jar>
[INFO] 
[INFO] --- maven-site-plugin:3.3:attach-descriptor (attach-descriptor) @ myfaces-impl-shared
---
[INFO] 
[INFO] --- maven-shade-plugin:2.4.3:shade (default) @ myfaces-impl-shared ---
[INFO] Excluding org.apache.myfaces.core:myfaces-api:jar:2.3.0-SNAPSHOT from the shaded jar.
[INFO] Excluding org.apache.geronimo.specs:geronimo-atinject_1.0_spec:jar:1.0 from the shaded
jar.
[INFO] Excluding org.apache.tomcat:tomcat-websocket-api:jar:7.0.78 from the shaded jar.
[INFO] Including org.apache.myfaces.core.internal:myfaces-impl-shared-public:jar:2.3.0-SNAPSHOT
in the shaded jar.
[INFO] Excluding commons-collections:commons-collections:jar:3.2.2 from the shaded jar.
[INFO] Excluding commons-codec:commons-codec:jar:1.10 from the shaded jar.
[INFO] Replacing original artifact with shaded artifact.
[INFO] Replacing <https://builds.apache.org/job/myfaces-current23/ws/2.3.x/shared/target/myfaces-impl-shared-2.3.0-SNAPSHOT.jar>
with <https://builds.apache.org/job/myfaces-current23/ws/2.3.x/shared/target/myfaces-impl-shared-2.3.0-SNAPSHOT-shaded.jar>
[INFO] Replacing original source artifact with shaded source artifact.
[INFO] Replacing <https://builds.apache.org/job/myfaces-current23/ws/2.3.x/shared/target/myfaces-impl-shared-2.3.0-SNAPSHOT-sources.jar>
with <https://builds.apache.org/job/myfaces-current23/ws/2.3.x/shared/target/myfaces-impl-shared-2.3.0-SNAPSHOT-shaded-sources.jar>
[INFO] 
[INFO] --- maven-checkstyle-plugin:2.17:check (verify-style) @ myfaces-impl-shared ---
[INFO] Starting audit...
<https://builds.apache.org/job/myfaces-current23/ws/2.3.x/shared/src/main/java/org/apache/myfaces/shared/renderkit/html/util/SelectItemsUtils.java>:23:8:
error: Unused import - java.util.Iterator.
Audit done.
[INFO] There is 1 error reported by Checkstyle 6.11.2 with default/myfaces-checks-standard.xml
ruleset.
[ERROR] src/main/java/org/apache/myfaces/shared/renderkit/html/util/SelectItemsUtils.java:[23,8]
(imports) UnusedImports: Unused import - java.util.Iterator.
[INFO] ------------------------------------------------------------------------
[INFO] Reactor Summary:
[INFO] 
[INFO] Apache MyFaces JSF-2.3 Core Project ................ SUCCESS [ 15.968 s]
[INFO] Apache MyFaces JSF-2.3 Core API .................... SUCCESS [01:07 min]
[INFO] Apache MyFaces Shared Public API For JSF 2.3 - Core  SUCCESS [ 13.234 s]
[INFO] Apache MyFaces Core For JSF 2.3 - Shared ........... FAILURE [ 11.927 s]
[INFO] Apache MyFaces JSF-2.3 Core Impl ................... SKIPPED
[INFO] Apache MyFaces JSF-2.3 Core OSGi Bundle ............ SKIPPED
[INFO] Apache MyFaces JSF-2.3 Impl Test ................... SKIPPED
[INFO] Apache MyFaces JSF-2.3 Core Module ................. SKIPPED
[INFO] ------------------------------------------------------------------------
[INFO] BUILD FAILURE
[INFO] ------------------------------------------------------------------------
[INFO] Total time: 02:09 min
[INFO] Finished at: 2017-08-10T18:41:13Z
[INFO] Final Memory: 89M/789M
[INFO] ------------------------------------------------------------------------
[ERROR] Failed to execute goal org.apache.maven.plugins:maven-checkstyle-plugin:2.17:check
(verify-style) on project myfaces-impl-shared: You have 1 Checkstyle violation. -> [Help
1]
[ERROR] 
[ERROR] To see the full stack trace of the errors, re-run Maven with the -e switch.
[ERROR] Re-run Maven using the -X switch to enable full debug logging.
[ERROR] 
[ERROR] For more information about the errors and possible solutions, please read the following
articles:
[ERROR] [Help 1] http://cwiki.apache.org/confluence/display/MAVEN/MojoFailureException
[ERROR] 
[ERROR] After correcting the problems, you can resume the build with the command
[ERROR]   mvn <goals> -rf :myfaces-impl-shared
[JENKINS] Archiving <https://builds.apache.org/job/myfaces-current23/ws/2.3.x/api/pom.xml>
to org.apache.myfaces.core/myfaces-api/2.3.0-SNAPSHOT/myfaces-api-2.3.0-SNAPSHOT.pom
[JENKINS] Archiving <https://builds.apache.org/job/myfaces-current23/ws/2.3.x/api/target/myfaces-api-2.3.0-SNAPSHOT.jar>
to org.apache.myfaces.core/myfaces-api/2.3.0-20170810.184028-167/myfaces-api-2.3.0-20170810.184028-167.jar
[JENKINS] Archiving <https://builds.apache.org/job/myfaces-current23/ws/2.3.x/api/target/myfaces-api-2.3.0-SNAPSHOT-sources.jar>
to org.apache.myfaces.core/myfaces-api/2.3.0-20170810.184028-167/myfaces-api-2.3.0-20170810.184028-167-sources.jar
[JENKINS] Archiving <https://builds.apache.org/job/myfaces-current23/ws/2.3.x/api/target/myfaces-api-2.3.0-SNAPSHOT-tests.jar>
to org.apache.myfaces.core/myfaces-api/2.3.0-20170810.184028-167/myfaces-api-2.3.0-20170810.184028-167-tests.jar
[JENKINS] Archiving <https://builds.apache.org/job/myfaces-current23/ws/2.3.x/shared/pom.xml>
to org.apache.myfaces.core.internal/myfaces-impl-shared/2.3.0-SNAPSHOT/myfaces-impl-shared-2.3.0-SNAPSHOT.pom
[JENKINS] Archiving <https://builds.apache.org/job/myfaces-current23/ws/2.3.x/shared/target/myfaces-impl-shared-2.3.0-SNAPSHOT.jar>
to org.apache.myfaces.core.internal/myfaces-impl-shared/2.3.0-SNAPSHOT/myfaces-impl-shared-2.3.0-SNAPSHOT.jar
[JENKINS] Archiving <https://builds.apache.org/job/myfaces-current23/ws/2.3.x/shared/target/myfaces-impl-shared-2.3.0-SNAPSHOT-sources.jar>
to org.apache.myfaces.core.internal/myfaces-impl-shared/2.3.0-SNAPSHOT/myfaces-impl-shared-2.3.0-SNAPSHOT-sources.jar
[JENKINS] Archiving <https://builds.apache.org/job/myfaces-current23/ws/2.3.x/impl/pom.xml>
to org.apache.myfaces.core/myfaces-impl/2.3.0-SNAPSHOT/myfaces-impl-2.3.0-SNAPSHOT.pom
[Fast Archiver] Compressed 67.20 KB of artifacts by 47.6% relative to #117
[JENKINS] Archiving <https://builds.apache.org/job/myfaces-current23/ws/2.3.x/bundle/pom.xml>
to org.apache.myfaces.core/myfaces-bundle/2.3.0-SNAPSHOT/myfaces-bundle-2.3.0-SNAPSHOT.pom
[JENKINS] Archiving <https://builds.apache.org/job/myfaces-current23/ws/2.3.x/pom.xml>
to org.apache.myfaces.core/myfaces-core-module/2.3.0-SNAPSHOT/myfaces-core-module-2.3.0-SNAPSHOT.pom
[JENKINS] Archiving <https://builds.apache.org/job/myfaces-current23/ws/2.3.x/shared-public/pom.xml>
to org.apache.myfaces.core.internal/myfaces-impl-shared-public/2.3.0-SNAPSHOT/myfaces-impl-shared-public-2.3.0-SNAPSHOT.pom
[JENKINS] Archiving <https://builds.apache.org/job/myfaces-current23/ws/2.3.x/shared-public/target/myfaces-impl-shared-public-2.3.0-SNAPSHOT.jar>
to org.apache.myfaces.core.internal/myfaces-impl-shared-public/2.3.0-20170810.184047-167/myfaces-impl-shared-public-2.3.0-20170810.184047-167.jar
[JENKINS] Archiving <https://builds.apache.org/job/myfaces-current23/ws/2.3.x/shared-public/target/myfaces-impl-shared-public-2.3.0-SNAPSHOT-sources.jar>
to org.apache.myfaces.core.internal/myfaces-impl-shared-public/2.3.0-20170810.184047-167/myfaces-impl-shared-public-2.3.0-20170810.184047-167-sources.jar
[JENKINS] Archiving <https://builds.apache.org/job/myfaces-current23/ws/2.3.x/impl-test/pom.xml>
to org.apache.myfaces.core/myfaces-impl-test/2.3.0-SNAPSHOT/myfaces-impl-test-2.3.0-SNAPSHOT.pom
[JENKINS] Archiving <https://builds.apache.org/job/myfaces-current23/ws/2.3.x/parent/pom.xml>
to org.apache.myfaces.core/myfaces-core-project/2.3.0-SNAPSHOT/myfaces-core-project-2.3.0-SNAPSHOT.pom
[JENKINS] Archiving <https://builds.apache.org/job/myfaces-current23/ws/2.3.x/parent/target/myfaces-core-project-2.3.0-SNAPSHOT-site.xml>
to org.apache.myfaces.core/myfaces-core-project/2.3.0-20170810.183921-193/myfaces-core-project-2.3.0-20170810.183921-193-site.xml
Sending e-mails to: commits@myfaces.apache.org grantsmith@apache.org tandraschko@apache.org
channel stopped

Mime
View raw message