myfaces-commits mailing list archives

Site index · List index
Message view « Date » · « Thread »
Top « Date » · « Thread »
From Apache Jenkins Server <jenk...@builds.apache.org>
Subject Build failed in Jenkins: myfaces-current-2.0 #3423
Date Fri, 23 Feb 2018 04:23:32 GMT
See <https://builds.apache.org/job/myfaces-current-2.0/3423/display/redirect>

------------------------------------------
[...truncated 351.75 KB...]
_contentEnd=-1,_tokenPos=0,_tokenForward ---> = <--- 1,tagNameStart=(!tagNameStart)?

[WARNING] [WARNING] The symbol _RT is declared but is apparently never used.
This code can probably be written in a more efficient way.
{var _Lang=this._Lang;var _RT ---> = <--- this._RT;try{var scopeThis=

[WARNING] [WARNING] The symbol _AJAXUTIL is declared but is apparently never used.
This code can probably be written in a more efficient way.
},getFormData:function (){var _AJAXUTIL ---> = <--- this._AJAXUTIL,myfacesOptions=this._context

[WARNING] [WARNING] The symbol myfacesOptions is declared but is apparently never used.
This code can probably be written in a more efficient way.
){var _AJAXUTIL=this._AJAXUTIL,myfacesOptions ---> = <--- this._context.myfaces;return
this.
[INFO] jsf-minimal-modern.js (267,606 bytes) ...................... compressed at 74%

[WARNING] [WARNING] Using 'eval' is not recommended...
[INFO] Using 'eval' reduces the level of compression!
function (){var _r=window.eval ---> . <--- call(window,code);if(

[WARNING] [WARNING] Using 'eval' is not recommended...
[INFO] Using 'eval' reduces the level of compression!
_T[_e]||((_w.eval ---> && <--- (!_b.isBlackBerry||_b.isBlackBerry

[WARNING] [WARNING] Using 'eval' is not recommended...
[INFO] Using 'eval' reduces the level of compression!
_T[_e]||((_w.eval ---> ) <--- ?"_evalHeadAppendix":null);}if(

[WARNING] [WARNING] Using 'eval' is not recommended...
[INFO] Using 'eval' reduces the level of compression!
[_e]](c);}eval ---> . <--- call(window,c);return null

[WARNING] [WARNING] The variable _T has already been declared in the same scope...
,tv=parseFloat(dav);var _T ---> = <--- this;_T.browser={};

[WARNING] [WARNING] The variable tagNameStart has already been declared in the same scope...
,_tokenPos=0,_tokenForward=1,tagNameStart ---> = <--- (!tagNameStart)?BEGIN_TAG:tagNameStart;

[WARNING] [WARNING] The variable i has already been declared in the same scope...
&&params!=null){for(var i ---> = <--- 0,param;(param=params[

[WARNING] [WARNING] The variable param has already been declared in the same scope...
){for(var i=0,param ---> ; <--- (param=params[i]);

[WARNING] [WARNING] The symbol assigned is declared but is apparently never used.
This code can probably be written in a more efficient way.
}:function (){};var assigned ---> = <--- true;}if("function"!=typeof newCls

[WARNING] [WARNING] The symbol found is declared but is apparently never used.
This code can probably be written in a more efficient way.
obj,finalAttr,value);}var found ---> = <--- false;var prefix=(value)?

[WARNING] [WARNING] The symbol _tokenPos is declared but is apparently never used.
This code can probably be written in a more efficient way.
=-1,_contentEnd=-1,_tokenPos ---> = <--- 0,_tokenForward=1,tagNameStart=(

[WARNING] [WARNING] The symbol _tokenForward is declared but is apparently never used.
This code can probably be written in a more efficient way.
_contentEnd=-1,_tokenPos=0,_tokenForward ---> = <--- 1,tagNameStart=(!tagNameStart)?

[WARNING] [WARNING] The symbol _RT is declared but is apparently never used.
This code can probably be written in a more efficient way.
{var _Lang=this._Lang;var _RT ---> = <--- this._RT;try{var scopeThis=

[WARNING] [WARNING] The symbol _AJAXUTIL is declared but is apparently never used.
This code can probably be written in a more efficient way.
},getFormData:function (){var _AJAXUTIL ---> = <--- this._AJAXUTIL,myfacesOptions=this._context

[WARNING] [WARNING] The symbol myfacesOptions is declared but is apparently never used.
This code can probably be written in a more efficient way.
){var _AJAXUTIL=this._AJAXUTIL,myfacesOptions ---> = <--- this._context.myfaces;return
this.
[INFO] jsf-minimal.js (303,416 bytes) ............................. compressed at 74%
[INFO] jsf.js (8,523 bytes) ....................................... compressed at 84%

[WARNING] [WARNING] Found an undeclared symbol: jsf
}catch(e){}if(jsf ---> . <--- getProjectStage()==="Development"){eventData.
[INFO] Impl.js (30,337 bytes) ..................................... compressed at 74%
[INFO] Object.js (3,563 bytes) .................................... compressed at 67%
[INFO] _EndImpl.js (1,552 bytes) .................................. compressed at 84%

[WARNING] [WARNING] Using 'eval' is not recommended...
[INFO] Using 'eval' reduces the level of compression!
function (){var _r=window.eval ---> . <--- call(window,code);if(

[WARNING] [WARNING] Using 'eval' is not recommended...
[INFO] Using 'eval' reduces the level of compression!
_T[_e]||((_w.eval ---> && <--- (!_b.isBlackBerry||_b.isBlackBerry

[WARNING] [WARNING] Using 'eval' is not recommended...
[INFO] Using 'eval' reduces the level of compression!
_T[_e]||((_w.eval ---> ) <--- ?"_evalHeadAppendix":null);}if(

[WARNING] [WARNING] Using 'eval' is not recommended...
[INFO] Using 'eval' reduces the level of compression!
[_e]](c);}eval ---> . <--- call(window,c);return null
[INFO] _EvalHandlers.js (6,836 bytes) ............................. compressed at 81%
[INFO] _ExtRuntime.js (7,643 bytes) ............................... compressed at 78%

[WARNING] [WARNING] The variable _T has already been declared in the same scope...
,tv=parseFloat(dav);var _T ---> = <--- this;_T.browser={};

[WARNING] [WARNING] The symbol assigned is declared but is apparently never used.
This code can probably be written in a more efficient way.
}:function (){};var assigned ---> = <--- true;}if("function"!=typeof newCls
[INFO] _Runtime.js (35,221 bytes) ................................. compressed at 79%
[INFO] _RuntimeQuirks.js (2,132 bytes) ............................ compressed at 78%
[INFO] _StartImpl.js (1,729 bytes) ................................ compressed at 75%
[INFO] Messages.js (5,664 bytes) .................................. compressed at 48%
[INFO] Messages_de.js (5,825 bytes) ............................... compressed at 45%
[INFO] Messages_es.js (5,488 bytes) ............................... compressed at 39%
[INFO] Messages_fr.js (5,613 bytes) ............................... compressed at 41%
[INFO] Messages_it.js (5,179 bytes) ............................... compressed at 39%
[INFO] Messages_nl.js (5,196 bytes) ............................... compressed at 40%
[INFO] Messages_ru.js (5,935 bytes) ............................... compressed at 34%
[INFO] Messages_zh_CN.js (5,758 bytes) ............................ compressed at 52%
[INFO] Messages_zh_HK.js (6,090 bytes) ............................ compressed at 55%
[INFO] Messages_zh_TW.js (6,499 bytes) ............................ compressed at 58%
[INFO] BaseRequest.js (5,747 bytes) ............................... compressed at 85%
[INFO] FormData.js (2,588 bytes) .................................. compressed at 71%
[INFO] IFrame.js (11,362 bytes) ................................... compressed at 69%
[INFO] Xhr1.js (6,589 bytes) ...................................... compressed at 60%
[INFO] XhrConst.js (1,469 bytes) .................................. compressed at 84%

[WARNING] [WARNING] Found an undeclared symbol: jsf
_mfInternal=context._mfInternal||{};jsf ---> . <--- ajax.response((xhr.getXHRObject)

[WARNING] [WARNING] The symbol _RT is declared but is apparently never used.
This code can probably be written in a more efficient way.
{var _Lang=this._Lang;var _RT ---> = <--- this._RT;try{var scopeThis=

[WARNING] [WARNING] The symbol _AJAXUTIL is declared but is apparently never used.
This code can probably be written in a more efficient way.
},getFormData:function (){var _AJAXUTIL ---> = <--- this._AJAXUTIL,myfacesOptions=this._context

[WARNING] [WARNING] The symbol myfacesOptions is declared but is apparently never used.
This code can probably be written in a more efficient way.
){var _AJAXUTIL=this._AJAXUTIL,myfacesOptions ---> = <--- this._context.myfaces;return
this.
[INFO] _AjaxRequest.js (11,755 bytes) ............................. compressed at 69%
[INFO] _AjaxRequestLevel2.js (2,065 bytes) ........................ compressed at 73%
[INFO] _AjaxRequestQueue.js (2,005 bytes) ......................... compressed at 79%
[INFO] _AjaxResponse.js (33,898 bytes) ............................ compressed at 69%
[INFO] _AjaxUtils.js (5,623 bytes) ................................ compressed at 81%
[INFO] _ExtAjaxRequest.js (2,664 bytes) ........................... compressed at 77%
[INFO] _ExtTransport.js (8,913 bytes) ............................. compressed at 86%
[INFO] _IFrameRequest.js (2,249 bytes) ............................ compressed at 77%
[INFO] _PartialSubmitUtils.js (5,244 bytes) ....................... compressed at 77%
[INFO] _Transports.js (7,015 bytes) ............................... compressed at 83%

[WARNING] [WARNING] Found an undeclared symbol: jsf
}}catch(e){if(jsf ---> . <--- getProjectStage()==="Development"){var defaultErrorOutput

[WARNING] [WARNING] The symbol jsf is declared but is apparently never used.
This code can probably be written in a more efficient way.
}}catch(e){if(jsf ---> . <--- getProjectStage()==="Development"){var defaultErrorOutput
[INFO] _Dom.js (50,124 bytes) ..................................... compressed at 73%
[INFO] _DomExperimental.js (5,921 bytes) .......................... compressed at 73%
[INFO] _DomQuirks.js (25,285 bytes) ............................... compressed at 77%
[INFO] _ExtDom.js (13,061 bytes) .................................. compressed at 74%
[INFO] _ExtLang.js (4,261 bytes) .................................. compressed at 73%

[WARNING] [WARNING] The variable tagNameStart has already been declared in the same scope...
,_tokenPos=0,_tokenForward=1,tagNameStart ---> = <--- (!tagNameStart)?BEGIN_TAG:tagNameStart;

[WARNING] [WARNING] The symbol _tokenPos is declared but is apparently never used.
This code can probably be written in a more efficient way.
=-1,_contentEnd=-1,_tokenPos ---> = <--- 0,_tokenForward=1,tagNameStart=(

[WARNING] [WARNING] The symbol _tokenForward is declared but is apparently never used.
This code can probably be written in a more efficient way.
_contentEnd=-1,_tokenPos=0,_tokenForward ---> = <--- 1,tagNameStart=(!tagNameStart)?
[INFO] _HtmlStripper.js (5,322 bytes) ............................. compressed at 84%

[WARNING] [WARNING] The symbol found is declared but is apparently never used.
This code can probably be written in a more efficient way.
obj,finalAttr,value);}var found ---> = <--- false;var prefix=(value)?
[INFO] _Lang.js (27,752 bytes) .................................... compressed at 69%
[INFO] _LangQuirks.js (8,387 bytes) ............................... compressed at 77%
[INFO] _ListenerQueue.js (2,898 bytes) ............................ compressed at 77%
[INFO] _Logging.js (4,749 bytes) .................................. compressed at 66%

[WARNING] [WARNING] The variable i has already been declared in the same scope...
&&params!=null){for(var i ---> = <--- 0,param;(param=params[

[WARNING] [WARNING] The variable param has already been declared in the same scope...
){for(var i=0,param ---> ; <--- (param=params[i]);
[INFO] _OamSubmit.js (5,900 bytes) ................................ compressed at 68%
[INFO] _Queue.js (5,450 bytes) .................................... compressed at 82%
[INFO] ------------------------------------------------------------------------------
[INFO] compression saved 4,522 bytes
[INFO] 
[INFO] --- maven-compiler-plugin:2.0.2:compile (default-compile) @ myfaces-api ---
[INFO] Compiling 386 source files to F:\jenkins\jenkins-slave\workspace\myfaces-current-2.0\current20\core\api\target\classes
[INFO] ------------------------------------------------------------------------
[INFO] Reactor Summary:
[INFO] 
[INFO] Apache MyFaces Shared For JSF 2.0 - Project ........ SUCCESS [ 13.781 s]
[INFO] Apache MyFaces Shared For JSF 2.0 - Core Mirror .... SUCCESS [ 35.630 s]
[INFO] MyFaces Shared Tomahawk ............................ SUCCESS [ 19.334 s]
[INFO] Apache MyFaces JSF-2.0 Core Project ................ SUCCESS [  9.468 s]
[INFO] Apache MyFaces JSF-2.0 Core API .................... FAILURE [ 11.215 s]
[INFO] Apache MyFaces Shared Public API For JSF 2.0 - Core  SKIPPED
[INFO] Apache MyFaces Shared For JSF 2.0 - Core ........... SKIPPED
[INFO] Apache MyFaces JSF-2.0 Core Impl for Java EE 6 ..... SKIPPED
[INFO] Apache MyFaces JSF-2.0 Core Impl ................... SKIPPED
[INFO] Apache MyFaces JSF-2.0 Core OSGi Bundle ............ SKIPPED
[INFO] Apache MyFaces JSF-2.0 Core Module ................. SKIPPED
[INFO] Apache MyFaces Composite Build ..................... SKIPPED
[INFO] ------------------------------------------------------------------------
[INFO] BUILD FAILURE
[INFO] ------------------------------------------------------------------------
[INFO] Total time: 01:36 min
[INFO] Finished at: 2018-02-23T04:23:22Z
[INFO] Final Memory: 79M/823M
[INFO] ------------------------------------------------------------------------
[ERROR] Failed to execute goal org.apache.maven.plugins:maven-compiler-plugin:2.0.2:compile
(default-compile) on project myfaces-api: Compilation failure
[ERROR] Unable to locate the Javac Compiler in:
[ERROR] C:\Program Files\Java\jre1.8.0_152\..\lib\tools.jar
[ERROR] Please ensure you are using JDK 1.4 or above and
[ERROR] not a JRE (the com.sun.tools.javac.Main class is required).
[ERROR] In most cases you can change the location of your Java
[ERROR] installation by setting the JAVA_HOME environment variable.
[ERROR] -> [Help 1]
[ERROR] 
[ERROR] To see the full stack trace of the errors, re-run Maven with the -e switch.
[ERROR] Re-run Maven using the -X switch to enable full debug logging.
[ERROR] 
[ERROR] For more information about the errors and possible solutions, please read the following
articles:
[ERROR] [Help 1] http://cwiki.apache.org/confluence/display/MAVEN/MojoFailureException
[ERROR] 
[ERROR] After correcting the problems, you can resume the build with the command
[ERROR]   mvn <goals> -rf :myfaces-api
[JENKINS] Archiving F:\jenkins\jenkins-slave\workspace\myfaces-current-2.0\current20\core\implee6\pom.xml
to org.apache.myfaces.core.internal/myfaces-impl-ee6/2.0.25-SNAPSHOT/myfaces-impl-ee6-2.0.25-SNAPSHOT.pom
[JENKINS] Archiving F:\jenkins\jenkins-slave\workspace\myfaces-current-2.0\current20\core\api\pom.xml
to org.apache.myfaces.core/myfaces-api/2.0.25-SNAPSHOT/myfaces-api-2.0.25-SNAPSHOT.pom
[JENKINS] Archiving F:\jenkins\jenkins-slave\workspace\myfaces-current-2.0\current20\shared\pom.xml
to org.apache.myfaces.shared/myfaces-shared-project/4.0.24-SNAPSHOT/myfaces-shared-project-4.0.24-SNAPSHOT.pom
[JENKINS] Archiving F:\jenkins\jenkins-slave\workspace\myfaces-current-2.0\current20\shared\target\myfaces-shared-project-4.0.24-SNAPSHOT-site.xml
to org.apache.myfaces.shared/myfaces-shared-project/4.0.24-20180223.042156-150/myfaces-shared-project-4.0.24-20180223.042156-150-site.xml
[JENKINS] Archiving F:\jenkins\jenkins-slave\workspace\myfaces-current-2.0\current20\shared\core\pom.xml
to org.apache.myfaces.shared/myfaces-shared-core/4.0.24-SNAPSHOT/myfaces-shared-core-4.0.24-SNAPSHOT.pom
[JENKINS] Archiving F:\jenkins\jenkins-slave\workspace\myfaces-current-2.0\current20\shared\core\target\myfaces-shared-core-4.0.24-SNAPSHOT.jar
to org.apache.myfaces.shared/myfaces-shared-core/4.0.24-20180223.042231-150/myfaces-shared-core-4.0.24-20180223.042231-150.jar
[JENKINS] Archiving F:\jenkins\jenkins-slave\workspace\myfaces-current-2.0\current20\shared\core\target\myfaces-shared-core-4.0.24-SNAPSHOT-sources.jar
to org.apache.myfaces.shared/myfaces-shared-core/4.0.24-20180223.042231-150/myfaces-shared-core-4.0.24-20180223.042231-150-sources.jar
[JENKINS] Archiving F:\jenkins\jenkins-slave\workspace\myfaces-current-2.0\current20\shared\shared-tomahawk\pom.xml
to org.apache.myfaces.shared/myfaces-shared-tomahawk/4.0.24-SNAPSHOT/myfaces-shared-tomahawk-4.0.24-SNAPSHOT.pom
[JENKINS] Archiving F:\jenkins\jenkins-slave\workspace\myfaces-current-2.0\current20\shared\shared-tomahawk\target\myfaces-shared-tomahawk-4.0.24-SNAPSHOT.jar
to org.apache.myfaces.shared/myfaces-shared-tomahawk/4.0.24-20180223.042250-150/myfaces-shared-tomahawk-4.0.24-20180223.042250-150.jar
[JENKINS] Archiving F:\jenkins\jenkins-slave\workspace\myfaces-current-2.0\current20\shared\shared-tomahawk\target\myfaces-shared-tomahawk-4.0.24-SNAPSHOT-sources.jar
to org.apache.myfaces.shared/myfaces-shared-tomahawk/4.0.24-20180223.042250-150/myfaces-shared-tomahawk-4.0.24-20180223.042250-150-sources.jar
[JENKINS] Archiving F:\jenkins\jenkins-slave\workspace\myfaces-current-2.0\current20\core\shared\pom.xml
to org.apache.myfaces.core.internal/myfaces-impl-shared/2.0.25-SNAPSHOT/myfaces-impl-shared-2.0.25-SNAPSHOT.pom
[JENKINS] Archiving <https://builds.apache.org/job/myfaces-current-2.0/ws/current20\pom.xml>
to org.apache.myfaces/myfaces-base/2.0.5-SNAPSHOT/myfaces-base-2.0.5-SNAPSHOT.pom
[JENKINS] Archiving F:\jenkins\jenkins-slave\workspace\myfaces-current-2.0\current20\core\impl\pom.xml
to org.apache.myfaces.core/myfaces-impl/2.0.25-SNAPSHOT/myfaces-impl-2.0.25-SNAPSHOT.pom
[JENKINS] Archiving F:\jenkins\jenkins-slave\workspace\myfaces-current-2.0\current20\core\bundle\pom.xml
to org.apache.myfaces.core/myfaces-bundle/2.0.25-SNAPSHOT/myfaces-bundle-2.0.25-SNAPSHOT.pom
[JENKINS] Archiving F:\jenkins\jenkins-slave\workspace\myfaces-current-2.0\current20\core\pom.xml
to org.apache.myfaces.core/myfaces-core-module/2.0.25-SNAPSHOT/myfaces-core-module-2.0.25-SNAPSHOT.pom
[JENKINS] Archiving F:\jenkins\jenkins-slave\workspace\myfaces-current-2.0\current20\core\shared-public\pom.xml
to org.apache.myfaces.core.internal/myfaces-impl-shared-public/2.0.25-SNAPSHOT/myfaces-impl-shared-public-2.0.25-SNAPSHOT.pom
[JENKINS] Archiving F:\jenkins\jenkins-slave\workspace\myfaces-current-2.0\current20\core\parent\pom.xml
to org.apache.myfaces.core/myfaces-core-project/2.0.25-SNAPSHOT/myfaces-core-project-2.0.25-SNAPSHOT.pom
[JENKINS] Archiving F:\jenkins\jenkins-slave\workspace\myfaces-current-2.0\current20\core\parent\target\myfaces-core-project-2.0.25-SNAPSHOT-site.xml
to org.apache.myfaces.core/myfaces-core-project/2.0.25-20180223.042302-150/myfaces-core-project-2.0.25-20180223.042302-150-site.xml
channel stopped

Mime
View raw message