myfaces-commits mailing list archives

Site index · List index
Message view « Date » · « Thread »
Top « Date » · « Thread »
From Apache Jenkins Server <jenk...@builds.apache.org>
Subject Build failed in Jenkins: Tobago Trunk #1440
Date Fri, 25 May 2018 07:47:18 GMT
See <https://builds.apache.org/job/Tobago%20Trunk/1440/display/redirect?page=changes>

Changes:

[hnoeth] Update FAQ, cleanup pom, improve comment

------------------------------------------
[...truncated 204.46 KB...]
[INFO] Copying 3 resources
[INFO] Copying 3 resources
[INFO] 
[INFO] --- maven-compiler-plugin:3.6.2:testCompile (default-testCompile) @ tobago-theme-charlotteville
---
[INFO] No sources to compile
[INFO] 
[INFO] --- maven-surefire-plugin:2.19.1:test (default-test) @ tobago-theme-charlotteville
---
[JENKINS] Recording test results
[INFO] 
[INFO] --- maven-jar-plugin:3.0.2:jar (default-jar) @ tobago-theme-charlotteville ---
[INFO] Building jar: <https://builds.apache.org/job/Tobago%20Trunk/ws/tobago-theme/tobago-theme-charlotteville/target/tobago-theme-charlotteville-4.2.2-SNAPSHOT.jar>
[INFO] 
[INFO] --- maven-site-plugin:3.6:attach-descriptor (attach-descriptor) @ tobago-theme-charlotteville
---
[INFO] Skipping because packaging 'jar' is not pom.
[INFO] 
[INFO] --- maven-install-plugin:2.5.2:install (default-install) @ tobago-theme-charlotteville
---
[INFO] Installing <https://builds.apache.org/job/Tobago%20Trunk/ws/tobago-theme/tobago-theme-charlotteville/target/tobago-theme-charlotteville-4.2.2-SNAPSHOT.jar>
to /home/jenkins/jenkins-slave/maven-repositories/0/org/apache/myfaces/tobago/tobago-theme-charlotteville/4.2.2-SNAPSHOT/tobago-theme-charlotteville-4.2.2-SNAPSHOT.jar
[INFO] Installing <https://builds.apache.org/job/Tobago%20Trunk/ws/tobago-theme/tobago-theme-charlotteville/pom.xml>
to /home/jenkins/jenkins-slave/maven-repositories/0/org/apache/myfaces/tobago/tobago-theme-charlotteville/4.2.2-SNAPSHOT/tobago-theme-charlotteville-4.2.2-SNAPSHOT.pom
[INFO] 
[INFO] ------------------------------------------------------------------------
[INFO] Building Tobago Examples 4.2.2-SNAPSHOT
[INFO] ------------------------------------------------------------------------
[INFO] 
[INFO] --- maven-clean-plugin:2.6.1:clean (default-clean) @ tobago-example ---
[INFO] Deleting <https://builds.apache.org/job/Tobago%20Trunk/ws/tobago-example/target>
[INFO] 
[INFO] --- animal-sniffer-maven-plugin:1.14:check (default-cli) @ tobago-example ---
[INFO] Checking unresolved references to org.codehaus.mojo.signature:java18:1.0
[INFO] 
[INFO] --- maven-checkstyle-plugin:2.17:check (default-cli) @ tobago-example ---
[INFO] Starting audit...
Audit done.
[INFO] 
[INFO] --- maven-enforcer-plugin:3.0.0-M1:enforce (enforce-maven-version) @ tobago-example
---
[INFO] 
[INFO] --- maven-enforcer-plugin:3.0.0-M1:enforce (enforce) @ tobago-example ---
[INFO] 
[INFO] --- maven-remote-resources-plugin:1.5:process (default) @ tobago-example ---
[INFO] 
[INFO] --- maven-remote-resources-plugin:1.5:process (process-resource-bundles) @ tobago-example
---
[INFO] 
[INFO] --- maven-site-plugin:3.6:attach-descriptor (attach-descriptor) @ tobago-example ---
[INFO] No site descriptor found: nothing to attach.
[INFO] 
[INFO] --- maven-install-plugin:2.5.2:install (default-install) @ tobago-example ---
[INFO] Installing <https://builds.apache.org/job/Tobago%20Trunk/ws/tobago-example/pom.xml>
to /home/jenkins/jenkins-slave/maven-repositories/0/org/apache/myfaces/tobago/tobago-example/4.2.2-SNAPSHOT/tobago-example-4.2.2-SNAPSHOT.pom
[INFO] 
[INFO] ------------------------------------------------------------------------
[INFO] Building Tobago Example Blank 4.2.2-SNAPSHOT
[INFO] ------------------------------------------------------------------------
[INFO] 
[INFO] --- maven-clean-plugin:2.6.1:clean (default-clean) @ tobago-example-blank ---
[INFO] Deleting <https://builds.apache.org/job/Tobago%20Trunk/ws/tobago-example/tobago-example-blank/target>
[INFO] 
[INFO] --- animal-sniffer-maven-plugin:1.14:check (default-cli) @ tobago-example-blank ---
[INFO] Checking unresolved references to org.codehaus.mojo.signature:java18:1.0
[INFO] 
[INFO] --- maven-checkstyle-plugin:2.17:check (default-cli) @ tobago-example-blank ---
[INFO] Starting audit...
Audit done.
[INFO] 
[INFO] --- maven-enforcer-plugin:3.0.0-M1:enforce (enforce-maven-version) @ tobago-example-blank
---
[INFO] 
[INFO] --- maven-enforcer-plugin:3.0.0-M1:enforce (enforce) @ tobago-example-blank ---
[INFO] 
[INFO] --- maven-remote-resources-plugin:1.5:process (default) @ tobago-example-blank ---
[INFO] 
[INFO] --- maven-remote-resources-plugin:1.5:process (process-resource-bundles) @ tobago-example-blank
---
[INFO] 
[INFO] --- maven-resources-plugin:2.7:resources (default-resources) @ tobago-example-blank
---
[INFO] Using 'UTF-8' encoding to copy filtered resources.
[INFO] Copying 1 resource
[INFO] Copying 3 resources
[INFO] Copying 3 resources
[INFO] 
[INFO] --- maven-compiler-plugin:3.6.2:compile (default-compile) @ tobago-example-blank ---
[INFO] Compiling 1 source file to <https://builds.apache.org/job/Tobago%20Trunk/ws/tobago-example/tobago-example-blank/target/classes>
[INFO] 
[INFO] --- maven-resources-plugin:2.7:testResources (default-testResources) @ tobago-example-blank
---
[INFO] Using 'UTF-8' encoding to copy filtered resources.
[INFO] skip non existing resourceDirectory <https://builds.apache.org/job/Tobago%20Trunk/ws/tobago-example/tobago-example-blank/src/test/resources>
[INFO] Copying 3 resources
[INFO] Copying 3 resources
[INFO] 
[INFO] --- maven-compiler-plugin:3.6.2:testCompile (default-testCompile) @ tobago-example-blank
---
[INFO] No sources to compile
[INFO] 
[INFO] --- maven-surefire-plugin:2.19.1:test (default-test) @ tobago-example-blank ---
[JENKINS] Recording test results
[INFO] 
[INFO] --- maven-war-plugin:3.1.0:war (default-war) @ tobago-example-blank ---
[INFO] Packaging webapp
[INFO] Assembling webapp [tobago-example-blank] in [<https://builds.apache.org/job/Tobago%20Trunk/ws/tobago-example/tobago-example-blank/target/tobago-example-blank]>
[INFO] Processing war project
[INFO] Copying webapp resources [<https://builds.apache.org/job/Tobago%20Trunk/ws/tobago-example/tobago-example-blank/src/main/webapp]>
[INFO] Webapp assembled in [61 msecs]
[INFO] Building war: <https://builds.apache.org/job/Tobago%20Trunk/ws/tobago-example/tobago-example-blank/target/tobago-example-blank.war>
[INFO] 
[INFO] --- maven-site-plugin:3.6:attach-descriptor (attach-descriptor) @ tobago-example-blank
---
[INFO] Skipping because packaging 'war' is not pom.
[INFO] 
[INFO] --- maven-install-plugin:2.5.2:install (default-install) @ tobago-example-blank ---
[INFO] Installing <https://builds.apache.org/job/Tobago%20Trunk/ws/tobago-example/tobago-example-blank/target/tobago-example-blank.war>
to /home/jenkins/jenkins-slave/maven-repositories/0/org/apache/myfaces/tobago/tobago-example-blank/4.2.2-SNAPSHOT/tobago-example-blank-4.2.2-SNAPSHOT.war
[INFO] Installing <https://builds.apache.org/job/Tobago%20Trunk/ws/tobago-example/tobago-example-blank/pom.xml>
to /home/jenkins/jenkins-slave/maven-repositories/0/org/apache/myfaces/tobago/tobago-example-blank/4.2.2-SNAPSHOT/tobago-example-blank-4.2.2-SNAPSHOT.pom
[INFO] 
[INFO] ------------------------------------------------------------------------
[INFO] Building Tobago Example Demo 4.2.2-SNAPSHOT
[INFO] ------------------------------------------------------------------------
[INFO] Downloading from Nexus: http://repository.apache.org/snapshots/org/apache/myfaces/tobago/tobago-example-data/4.2.2-SNAPSHOT/maven-metadata.xml
[INFO] Downloaded from Nexus: http://repository.apache.org/snapshots/org/apache/myfaces/tobago/tobago-example-data/4.2.2-SNAPSHOT/maven-metadata.xml
(1.2 kB at 3.7 kB/s)
[INFO] Downloading from central: https://repo.maven.apache.org/maven2/org/seleniumhq/selenium/selenium-java/3.12.0/selenium-java-3.12.0.pom
[INFO] Downloaded from central: https://repo.maven.apache.org/maven2/org/seleniumhq/selenium/selenium-java/3.12.0/selenium-java-3.12.0.pom
(6.3 kB at 394 kB/s)
[INFO] Downloading from central: https://repo.maven.apache.org/maven2/org/seleniumhq/selenium/selenium-api/3.12.0/selenium-api-3.12.0.pom
[INFO] Downloaded from central: https://repo.maven.apache.org/maven2/org/seleniumhq/selenium/selenium-api/3.12.0/selenium-api-3.12.0.pom
(2.6 kB at 188 kB/s)
[INFO] Downloading from central: https://repo.maven.apache.org/maven2/org/seleniumhq/selenium/selenium-chrome-driver/3.12.0/selenium-chrome-driver-3.12.0.pom
[INFO] Downloaded from central: https://repo.maven.apache.org/maven2/org/seleniumhq/selenium/selenium-chrome-driver/3.12.0/selenium-chrome-driver-3.12.0.pom
(4.9 kB at 378 kB/s)
[INFO] Downloading from central: https://repo.maven.apache.org/maven2/org/seleniumhq/selenium/selenium-remote-driver/3.12.0/selenium-remote-driver-3.12.0.pom
[INFO] Downloaded from central: https://repo.maven.apache.org/maven2/org/seleniumhq/selenium/selenium-remote-driver/3.12.0/selenium-remote-driver-3.12.0.pom
(4.7 kB at 392 kB/s)
[INFO] Downloading from central: https://repo.maven.apache.org/maven2/net/bytebuddy/byte-buddy/1.8.3/byte-buddy-1.8.3.pom
[INFO] Downloaded from central: https://repo.maven.apache.org/maven2/net/bytebuddy/byte-buddy/1.8.3/byte-buddy-1.8.3.pom
(12 kB at 901 kB/s)
[INFO] Downloading from central: https://repo.maven.apache.org/maven2/net/bytebuddy/byte-buddy-parent/1.8.3/byte-buddy-parent-1.8.3.pom
[INFO] Downloaded from central: https://repo.maven.apache.org/maven2/net/bytebuddy/byte-buddy-parent/1.8.3/byte-buddy-parent-1.8.3.pom
(26 kB at 2.0 MB/s)
[INFO] Downloading from central: https://repo.maven.apache.org/maven2/org/seleniumhq/selenium/selenium-edge-driver/3.12.0/selenium-edge-driver-3.12.0.pom
[INFO] Downloaded from central: https://repo.maven.apache.org/maven2/org/seleniumhq/selenium/selenium-edge-driver/3.12.0/selenium-edge-driver-3.12.0.pom
(4.9 kB at 351 kB/s)
[INFO] Downloading from central: https://repo.maven.apache.org/maven2/org/seleniumhq/selenium/selenium-firefox-driver/3.12.0/selenium-firefox-driver-3.12.0.pom
[INFO] Downloaded from central: https://repo.maven.apache.org/maven2/org/seleniumhq/selenium/selenium-firefox-driver/3.12.0/selenium-firefox-driver-3.12.0.pom
(4.9 kB at 410 kB/s)
[INFO] Downloading from central: https://repo.maven.apache.org/maven2/org/seleniumhq/selenium/selenium-ie-driver/3.12.0/selenium-ie-driver-3.12.0.pom
[INFO] Downloaded from central: https://repo.maven.apache.org/maven2/org/seleniumhq/selenium/selenium-ie-driver/3.12.0/selenium-ie-driver-3.12.0.pom
(4.9 kB at 409 kB/s)
[INFO] Downloading from central: https://repo.maven.apache.org/maven2/org/seleniumhq/selenium/selenium-opera-driver/3.12.0/selenium-opera-driver-3.12.0.pom
[INFO] Downloaded from central: https://repo.maven.apache.org/maven2/org/seleniumhq/selenium/selenium-opera-driver/3.12.0/selenium-opera-driver-3.12.0.pom
(4.9 kB at 378 kB/s)
[INFO] Downloading from central: https://repo.maven.apache.org/maven2/org/seleniumhq/selenium/selenium-safari-driver/3.12.0/selenium-safari-driver-3.12.0.pom
[INFO] Downloaded from central: https://repo.maven.apache.org/maven2/org/seleniumhq/selenium/selenium-safari-driver/3.12.0/selenium-safari-driver-3.12.0.pom
(4.9 kB at 378 kB/s)
[INFO] Downloading from central: https://repo.maven.apache.org/maven2/org/seleniumhq/selenium/selenium-support/3.12.0/selenium-support-3.12.0.pom
[INFO] Downloaded from central: https://repo.maven.apache.org/maven2/org/seleniumhq/selenium/selenium-support/3.12.0/selenium-support-3.12.0.pom
(4.9 kB at 408 kB/s)
[INFO] Downloading from central: https://repo.maven.apache.org/maven2/org/seleniumhq/selenium/selenium-java/3.12.0/selenium-java-3.12.0.jar
[INFO] Downloading from central: https://repo.maven.apache.org/maven2/org/seleniumhq/selenium/selenium-api/3.12.0/selenium-api-3.12.0.jar
[INFO] Downloading from central: https://repo.maven.apache.org/maven2/org/seleniumhq/selenium/selenium-chrome-driver/3.12.0/selenium-chrome-driver-3.12.0.jar
[INFO] Downloading from central: https://repo.maven.apache.org/maven2/org/seleniumhq/selenium/selenium-edge-driver/3.12.0/selenium-edge-driver-3.12.0.jar
[INFO] Downloading from central: https://repo.maven.apache.org/maven2/org/seleniumhq/selenium/selenium-firefox-driver/3.12.0/selenium-firefox-driver-3.12.0.jar
[INFO] Downloaded from central: https://repo.maven.apache.org/maven2/org/seleniumhq/selenium/selenium-api/3.12.0/selenium-api-3.12.0.jar
(115 kB at 3.6 MB/s)
[INFO] Downloading from central: https://repo.maven.apache.org/maven2/org/seleniumhq/selenium/selenium-ie-driver/3.12.0/selenium-ie-driver-3.12.0.jar
[INFO] Downloaded from central: https://repo.maven.apache.org/maven2/org/seleniumhq/selenium/selenium-ie-driver/3.12.0/selenium-ie-driver-3.12.0.jar
(15 kB at 300 kB/s)
[INFO] Downloading from central: https://repo.maven.apache.org/maven2/org/seleniumhq/selenium/selenium-opera-driver/3.12.0/selenium-opera-driver-3.12.0.jar
[INFO] Downloaded from central: https://repo.maven.apache.org/maven2/org/seleniumhq/selenium/selenium-opera-driver/3.12.0/selenium-opera-driver-3.12.0.jar
(8.3 kB at 120 kB/s)
[INFO] Downloading from central: https://repo.maven.apache.org/maven2/org/seleniumhq/selenium/selenium-remote-driver/3.12.0/selenium-remote-driver-3.12.0.jar
[INFO] Downloaded from central: https://repo.maven.apache.org/maven2/org/seleniumhq/selenium/selenium-edge-driver/3.12.0/selenium-edge-driver-3.12.0.jar
(5.6 kB at 66 kB/s)
[INFO] Downloading from central: https://repo.maven.apache.org/maven2/org/seleniumhq/selenium/selenium-safari-driver/3.12.0/selenium-safari-driver-3.12.0.jar
[INFO] Downloaded from central: https://repo.maven.apache.org/maven2/org/seleniumhq/selenium/selenium-chrome-driver/3.12.0/selenium-chrome-driver-3.12.0.jar
(11 kB at 125 kB/s)
[INFO] Downloading from central: https://repo.maven.apache.org/maven2/org/seleniumhq/selenium/selenium-support/3.12.0/selenium-support-3.12.0.jar
[INFO] Downloaded from central: https://repo.maven.apache.org/maven2/org/seleniumhq/selenium/selenium-java/3.12.0/selenium-java-3.12.0.jar
(293 B at 3.3 kB/s)
[INFO] Downloading from central: https://repo.maven.apache.org/maven2/net/bytebuddy/byte-buddy/1.8.3/byte-buddy-1.8.3.jar
[INFO] Downloaded from central: https://repo.maven.apache.org/maven2/org/seleniumhq/selenium/selenium-safari-driver/3.12.0/selenium-safari-driver-3.12.0.jar
(8.6 kB at 87 kB/s)
[INFO] Downloaded from central: https://repo.maven.apache.org/maven2/org/seleniumhq/selenium/selenium-remote-driver/3.12.0/selenium-remote-driver-3.12.0.jar
(381 kB at 3.4 MB/s)
[INFO] Downloaded from central: https://repo.maven.apache.org/maven2/org/seleniumhq/selenium/selenium-support/3.12.0/selenium-support-3.12.0.jar
(154 kB at 1.3 MB/s)
[INFO] Downloaded from central: https://repo.maven.apache.org/maven2/org/seleniumhq/selenium/selenium-firefox-driver/3.12.0/selenium-firefox-driver-3.12.0.jar
(802 kB at 5.1 MB/s)
[INFO] Downloaded from central: https://repo.maven.apache.org/maven2/net/bytebuddy/byte-buddy/1.8.3/byte-buddy-1.8.3.jar
(3.0 MB at 11 MB/s)
[INFO] 
[INFO] --- maven-clean-plugin:2.6.1:clean (default-clean) @ tobago-example-demo ---
[INFO] Deleting <https://builds.apache.org/job/Tobago%20Trunk/ws/tobago-example/tobago-example-demo/target>
[INFO] 
[INFO] --- animal-sniffer-maven-plugin:1.14:check (default-cli) @ tobago-example-demo ---
[INFO] Checking unresolved references to org.codehaus.mojo.signature:java18:1.0
[INFO] 
[INFO] --- maven-checkstyle-plugin:2.17:check (default-cli) @ tobago-example-demo ---
[INFO] Starting audit...
<https://builds.apache.org/job/Tobago%20Trunk/ws/tobago-example/tobago-example-demo/src/test/java/org/apache/myfaces/tobago/example/demo/qunit/SeleniumBase.java>:50:13:
error: Variable 'webDriver' must be private and have accessor methods.
<https://builds.apache.org/job/Tobago%20Trunk/ws/tobago-example/tobago-example-demo/src/test/java/org/apache/myfaces/tobago/example/demo/qunit/SeleniumBase.java>:63:19:
error: Variable 'serverPortWithContextPath' must be private and have accessor methods.
<https://builds.apache.org/job/Tobago%20Trunk/ws/tobago-example/tobago-example-demo/src/test/java/org/apache/myfaces/tobago/example/demo/qunit/SeleniumBase.java>:69:5:
error: switch without "default" clause.
<https://builds.apache.org/job/Tobago%20Trunk/ws/tobago-example/tobago-example-demo/src/test/java/org/apache/myfaces/tobago/example/demo/qunit/SeleniumBase.java>:90:
error: Line is longer than 120 characters (found 126).
Audit done.
[INFO] There are 4 errors reported by Checkstyle 6.11.2 with tobago/checkstyle.xml ruleset.
[ERROR] src/test/java/org/apache/myfaces/tobago/example/demo/qunit/SeleniumBase.java:[50,13]
(design) VisibilityModifier: Variable 'webDriver' must be private and have accessor methods.
[ERROR] src/test/java/org/apache/myfaces/tobago/example/demo/qunit/SeleniumBase.java:[63,19]
(design) VisibilityModifier: Variable 'serverPortWithContextPath' must be private and have
accessor methods.
[ERROR] src/test/java/org/apache/myfaces/tobago/example/demo/qunit/SeleniumBase.java:[69,5]
(coding) MissingSwitchDefault: switch without "default" clause.
[ERROR] src/test/java/org/apache/myfaces/tobago/example/demo/qunit/SeleniumBase.java:[90]
(sizes) LineLength: Line is longer than 120 characters (found 126).
[INFO] ------------------------------------------------------------------------
[INFO] Reactor Summary:
[INFO] 
[INFO] Apache Tobago ...................................... SUCCESS [ 12.311 s]
[INFO] Tobago Tool ........................................ SUCCESS [  3.294 s]
[INFO] Tobago Tool Annotation ............................. SUCCESS [  8.276 s]
[INFO] Tobago Tool Apt .................................... SUCCESS [01:04 min]
[INFO] Tobago Core ........................................ SUCCESS [ 19.796 s]
[INFO] Tobago Themes ...................................... SUCCESS [  3.551 s]
[INFO] Tobago Theme Standard .............................. SUCCESS [ 10.752 s]
[INFO] Tobago Theme Scarborough ........................... SUCCESS [  5.306 s]
[INFO] Tobago Theme Speyside .............................. SUCCESS [  5.038 s]
[INFO] Tobago Theme Roxborough ............................ SUCCESS [  4.943 s]
[INFO] Tobago Theme Charlotteville ........................ SUCCESS [  5.038 s]
[INFO] Tobago Examples .................................... SUCCESS [  3.844 s]
[INFO] Tobago Example Blank ............................... SUCCESS [  5.805 s]
[INFO] Tobago Example Demo ................................ FAILURE [  5.368 s]
[INFO] Tobago Example Assembly ............................ SKIPPED
[INFO] Tobago Assembly .................................... SKIPPED
[INFO] ------------------------------------------------------------------------
[INFO] BUILD FAILURE
[INFO] ------------------------------------------------------------------------
[INFO] Total time: 03:48 min
[INFO] Finished at: 2018-05-25T07:46:51Z
[INFO] Final Memory: 59M/741M
[INFO] ------------------------------------------------------------------------
Waiting for Jenkins to finish collecting data
[ERROR] Failed to execute goal org.apache.maven.plugins:maven-checkstyle-plugin:2.17:check
(default-cli) on project tobago-example-demo: You have 4 Checkstyle violations. -> [Help
1]
[ERROR] 
[ERROR] To see the full stack trace of the errors, re-run Maven with the -e switch.
[ERROR] Re-run Maven using the -X switch to enable full debug logging.
[ERROR] 
[ERROR] For more information about the errors and possible solutions, please read the following
articles:
[ERROR] [Help 1] http://cwiki.apache.org/confluence/display/MAVEN/MojoFailureException
[ERROR] 
[ERROR] After correcting the problems, you can resume the build with the command
[ERROR]   mvn <goals> -rf :tobago-example-demo
[JENKINS] Archiving <https://builds.apache.org/job/Tobago%20Trunk/ws/tobago-theme/pom.xml>
to org.apache.myfaces.tobago/tobago-theme/4.2.2-SNAPSHOT/tobago-theme-4.2.2-SNAPSHOT.pom
[JENKINS] Archiving <https://builds.apache.org/job/Tobago%20Trunk/ws/tobago-example/tobago-example-blank/pom.xml>
to org.apache.myfaces.tobago/tobago-example-blank/4.2.2-SNAPSHOT/tobago-example-blank-4.2.2-SNAPSHOT.pom
[JENKINS] Archiving <https://builds.apache.org/job/Tobago%20Trunk/ws/tobago-example/tobago-example-blank/target/tobago-example-blank.war>
to org.apache.myfaces.tobago/tobago-example-blank/4.2.2-SNAPSHOT/tobago-example-blank-4.2.2-SNAPSHOT.war
[Fast Archiver] Compressed 8.45 MB of artifacts by 52.9% relative to #1439
[JENKINS] Archiving <https://builds.apache.org/job/Tobago%20Trunk/ws/tobago-assembly/pom.xml>
to org.apache.myfaces.tobago/tobago-assembly/4.2.2-SNAPSHOT/tobago-assembly-4.2.2-SNAPSHOT.pom
[JENKINS] Archiving <https://builds.apache.org/job/Tobago%20Trunk/ws/pom.xml> to org.apache.myfaces.tobago/tobago/4.2.2-SNAPSHOT/tobago-4.2.2-SNAPSHOT.pom
[JENKINS] Archiving <https://builds.apache.org/job/Tobago%20Trunk/ws/target/tobago-4.2.2-SNAPSHOT-site.xml>
to org.apache.myfaces.tobago/tobago/4.2.2-SNAPSHOT/tobago-4.2.2-SNAPSHOT-site.xml
[Fast Archiver] Compressed 52.99 KB of artifacts by 60.4% relative to #1439
[JENKINS] Archiving <https://builds.apache.org/job/Tobago%20Trunk/ws/tobago-theme/tobago-theme-standard/pom.xml>
to org.apache.myfaces.tobago/tobago-theme-standard/4.2.2-SNAPSHOT/tobago-theme-standard-4.2.2-SNAPSHOT.pom
[JENKINS] Archiving <https://builds.apache.org/job/Tobago%20Trunk/ws/tobago-theme/tobago-theme-standard/target/tobago-theme-standard-4.2.2-SNAPSHOT.jar>
to org.apache.myfaces.tobago/tobago-theme-standard/4.2.2-SNAPSHOT/tobago-theme-standard-4.2.2-SNAPSHOT.jar
[Fast Archiver] Compressed 1.54 MB of artifacts by 50.8% relative to #1439
[JENKINS] Archiving <https://builds.apache.org/job/Tobago%20Trunk/ws/tobago-theme/tobago-theme-scarborough/pom.xml>
to org.apache.myfaces.tobago/tobago-theme-scarborough/4.2.2-SNAPSHOT/tobago-theme-scarborough-4.2.2-SNAPSHOT.pom
[JENKINS] Archiving <https://builds.apache.org/job/Tobago%20Trunk/ws/tobago-theme/tobago-theme-scarborough/target/tobago-theme-scarborough-4.2.2-SNAPSHOT.jar>
to org.apache.myfaces.tobago/tobago-theme-scarborough/4.2.2-SNAPSHOT/tobago-theme-scarborough-4.2.2-SNAPSHOT.jar
[Fast Archiver] Compressed 300.00 KB of artifacts by 42.7% relative to #1439
[JENKINS] Archiving <https://builds.apache.org/job/Tobago%20Trunk/ws/tobago-example/tobago-example-assembly/pom.xml>
to org.apache.myfaces.tobago/tobago-example-assembly/4.2.2-SNAPSHOT/tobago-example-assembly-4.2.2-SNAPSHOT.pom
[JENKINS] Archiving <https://builds.apache.org/job/Tobago%20Trunk/ws/tobago-theme/tobago-theme-speyside/pom.xml>
to org.apache.myfaces.tobago/tobago-theme-speyside/4.2.2-SNAPSHOT/tobago-theme-speyside-4.2.2-SNAPSHOT.pom
[JENKINS] Archiving <https://builds.apache.org/job/Tobago%20Trunk/ws/tobago-theme/tobago-theme-speyside/target/tobago-theme-speyside-4.2.2-SNAPSHOT.jar>
to org.apache.myfaces.tobago/tobago-theme-speyside/4.2.2-SNAPSHOT/tobago-theme-speyside-4.2.2-SNAPSHOT.jar
[Fast Archiver] Compressed 338.21 KB of artifacts by 47.3% relative to #1439
[JENKINS] Archiving <https://builds.apache.org/job/Tobago%20Trunk/ws/tobago-theme/tobago-theme-roxborough/pom.xml>
to org.apache.myfaces.tobago/tobago-theme-roxborough/4.2.2-SNAPSHOT/tobago-theme-roxborough-4.2.2-SNAPSHOT.pom
[JENKINS] Archiving <https://builds.apache.org/job/Tobago%20Trunk/ws/tobago-theme/tobago-theme-roxborough/target/tobago-theme-roxborough-4.2.2-SNAPSHOT.jar>
to org.apache.myfaces.tobago/tobago-theme-roxborough/4.2.2-SNAPSHOT/tobago-theme-roxborough-4.2.2-SNAPSHOT.jar
[Fast Archiver] Compressed 422.54 KB of artifacts by 37.9% relative to #1439
[JENKINS] Archiving <https://builds.apache.org/job/Tobago%20Trunk/ws/tobago-tool/tobago-tool-annotation/pom.xml>
to org.apache.myfaces.tobago/tobago-tool-annotation/4.2.2-SNAPSHOT/tobago-tool-annotation-4.2.2-SNAPSHOT.pom
[JENKINS] Archiving <https://builds.apache.org/job/Tobago%20Trunk/ws/tobago-tool/tobago-tool-annotation/target/tobago-tool-annotation-4.2.2-SNAPSHOT.jar>
to org.apache.myfaces.tobago/tobago-tool-annotation/4.2.2-SNAPSHOT/tobago-tool-annotation-4.2.2-SNAPSHOT.jar
[JENKINS] Archiving <https://builds.apache.org/job/Tobago%20Trunk/ws/tobago-example/pom.xml>
to org.apache.myfaces.tobago/tobago-example/4.2.2-SNAPSHOT/tobago-example-4.2.2-SNAPSHOT.pom
[JENKINS] Archiving <https://builds.apache.org/job/Tobago%20Trunk/ws/tobago-tool/pom.xml>
to org.apache.myfaces.tobago/tobago-tool/4.2.2-SNAPSHOT/tobago-tool-4.2.2-SNAPSHOT.pom
[JENKINS] Archiving <https://builds.apache.org/job/Tobago%20Trunk/ws/tobago-core/pom.xml>
to org.apache.myfaces.tobago/tobago-core/4.2.2-SNAPSHOT/tobago-core-4.2.2-SNAPSHOT.pom
[JENKINS] Archiving <https://builds.apache.org/job/Tobago%20Trunk/ws/tobago-core/target/tobago-core-4.2.2-SNAPSHOT.jar>
to org.apache.myfaces.tobago/tobago-core/4.2.2-SNAPSHOT/tobago-core-4.2.2-SNAPSHOT.jar
[JENKINS] Archiving <https://builds.apache.org/job/Tobago%20Trunk/ws/tobago-core/target/tobago-core-4.2.2-SNAPSHOT-tests.jar>
to org.apache.myfaces.tobago/tobago-core/4.2.2-SNAPSHOT/tobago-core-4.2.2-SNAPSHOT-tests.jar
[JENKINS] Archiving <https://builds.apache.org/job/Tobago%20Trunk/ws/tobago-core/target/tobago-core-4.2.2-SNAPSHOT-sources.jar>
to org.apache.myfaces.tobago/tobago-core/4.2.2-SNAPSHOT/tobago-core-4.2.2-SNAPSHOT-sources.jar
[JENKINS] Archiving <https://builds.apache.org/job/Tobago%20Trunk/ws/tobago-tool/tobago-tool-apt/pom.xml>
to org.apache.myfaces.tobago/tobago-tool-apt/4.2.2-SNAPSHOT/tobago-tool-apt-4.2.2-SNAPSHOT.pom
[JENKINS] Archiving <https://builds.apache.org/job/Tobago%20Trunk/ws/tobago-tool/tobago-tool-apt/target/tobago-tool-apt-4.2.2-SNAPSHOT.jar>
to org.apache.myfaces.tobago/tobago-tool-apt/4.2.2-SNAPSHOT/tobago-tool-apt-4.2.2-SNAPSHOT.jar
[JENKINS] Archiving <https://builds.apache.org/job/Tobago%20Trunk/ws/tobago-theme/tobago-theme-charlotteville/pom.xml>
to org.apache.myfaces.tobago/tobago-theme-charlotteville/4.2.2-SNAPSHOT/tobago-theme-charlotteville-4.2.2-SNAPSHOT.pom
[JENKINS] Archiving <https://builds.apache.org/job/Tobago%20Trunk/ws/tobago-theme/tobago-theme-charlotteville/target/tobago-theme-charlotteville-4.2.2-SNAPSHOT.jar>
to org.apache.myfaces.tobago/tobago-theme-charlotteville/4.2.2-SNAPSHOT/tobago-theme-charlotteville-4.2.2-SNAPSHOT.jar
[Fast Archiver] Compressed 298.89 KB of artifacts by 42.8% relative to #1439
[JENKINS] Archiving <https://builds.apache.org/job/Tobago%20Trunk/ws/tobago-example/tobago-example-demo/pom.xml>
to org.apache.myfaces.tobago/tobago-example-demo/4.2.2-SNAPSHOT/tobago-example-demo-4.2.2-SNAPSHOT.pom
Sending e-mails to: commits@myfaces.apache.org
channel stopped

Mime
View raw message