myfaces-commits mailing list archives

Site index · List index
Message view « Date » · « Thread »
Top « Date » · « Thread »
From Apache Jenkins Server <jenk...@builds.apache.org>
Subject Build failed in Jenkins: Tobago Trunk #1427
Date Wed, 16 May 2018 12:56:04 GMT
See <https://builds.apache.org/job/Tobago%20Trunk/1427/display/redirect?page=changes>

Changes:

[lofwyr] demo: document some limitations

------------------------------------------
[...truncated 232.86 KB...]
[INFO] --- animal-sniffer-maven-plugin:1.14:check (default-cli) @ tobago-theme-charlotteville
---
[INFO] Checking unresolved references to org.codehaus.mojo.signature:java18:1.0
[INFO] 
[INFO] --- maven-checkstyle-plugin:2.17:check (default-cli) @ tobago-theme-charlotteville
---
[INFO] Starting audit...
Audit done.
[INFO] 
[INFO] --- maven-enforcer-plugin:3.0.0-M1:enforce (enforce-maven-version) @ tobago-theme-charlotteville
---
[INFO] 
[INFO] --- maven-enforcer-plugin:3.0.0-M1:enforce (enforce) @ tobago-theme-charlotteville
---
[INFO] 
[INFO] --- maven-remote-resources-plugin:1.5:process (default) @ tobago-theme-charlotteville
---
[INFO] 
[INFO] --- maven-remote-resources-plugin:1.5:process (process-resource-bundles) @ tobago-theme-charlotteville
---
[INFO] 
[INFO] --- maven-resources-plugin:2.7:resources (default-resources) @ tobago-theme-charlotteville
---
[INFO] Using 'UTF-8' encoding to copy filtered resources.
[INFO] Copying 1 resource
[INFO] Copying 0 resource to META-INF/resources/tobago/charlotteville
[INFO] Copying 6 resources to META-INF/resources/tobago/charlotteville/tobago-bootstrap/4.2.2-SNAPSHOT
[INFO] Copying 3 resources
[INFO] Copying 3 resources
[INFO] 
[INFO] --- maven-compiler-plugin:3.6.2:compile (default-compile) @ tobago-theme-charlotteville
---
[INFO] No sources to compile
[INFO] 
[INFO] --- maven-resources-plugin:2.7:testResources (default-testResources) @ tobago-theme-charlotteville
---
[INFO] Using 'UTF-8' encoding to copy filtered resources.
[INFO] skip non existing resourceDirectory <https://builds.apache.org/job/Tobago%20Trunk/ws/tobago-theme/tobago-theme-charlotteville/src/test/resources>
[INFO] Copying 3 resources
[INFO] Copying 3 resources
[INFO] 
[INFO] --- maven-compiler-plugin:3.6.2:testCompile (default-testCompile) @ tobago-theme-charlotteville
---
[INFO] No sources to compile
[INFO] 
[INFO] --- maven-surefire-plugin:2.19.1:test (default-test) @ tobago-theme-charlotteville
---
[JENKINS] Recording test results
[INFO] 
[INFO] --- maven-jar-plugin:3.0.2:jar (default-jar) @ tobago-theme-charlotteville ---
[INFO] Building jar: <https://builds.apache.org/job/Tobago%20Trunk/ws/tobago-theme/tobago-theme-charlotteville/target/tobago-theme-charlotteville-4.2.2-SNAPSHOT.jar>
[INFO] 
[INFO] --- maven-site-plugin:3.6:attach-descriptor (attach-descriptor) @ tobago-theme-charlotteville
---
[INFO] Skipping because packaging 'jar' is not pom.
[INFO] 
[INFO] --- maven-install-plugin:2.5.2:install (default-install) @ tobago-theme-charlotteville
---
[INFO] Installing <https://builds.apache.org/job/Tobago%20Trunk/ws/tobago-theme/tobago-theme-charlotteville/target/tobago-theme-charlotteville-4.2.2-SNAPSHOT.jar>
to /home/jenkins/jenkins-slave/maven-repositories/0/org/apache/myfaces/tobago/tobago-theme-charlotteville/4.2.2-SNAPSHOT/tobago-theme-charlotteville-4.2.2-SNAPSHOT.jar
[INFO] Installing <https://builds.apache.org/job/Tobago%20Trunk/ws/tobago-theme/tobago-theme-charlotteville/pom.xml>
to /home/jenkins/jenkins-slave/maven-repositories/0/org/apache/myfaces/tobago/tobago-theme-charlotteville/4.2.2-SNAPSHOT/tobago-theme-charlotteville-4.2.2-SNAPSHOT.pom
[INFO] 
[INFO] ------------------------------------------------------------------------
[INFO] Building Tobago Examples 4.2.2-SNAPSHOT
[INFO] ------------------------------------------------------------------------
[INFO] Downloading from central: https://repo.maven.apache.org/maven2/org/apache/myfaces/core/myfaces-impl/2.0.24/myfaces-impl-2.0.24.pom
[INFO] Downloaded from central: https://repo.maven.apache.org/maven2/org/apache/myfaces/core/myfaces-impl/2.0.24/myfaces-impl-2.0.24.pom
(59 kB at 2.0 MB/s)
[INFO] Downloading from central: https://repo.maven.apache.org/maven2/org/apache/myfaces/core/myfaces-impl/2.0.24/myfaces-impl-2.0.24.jar
[INFO] Downloaded from central: https://repo.maven.apache.org/maven2/org/apache/myfaces/core/myfaces-impl/2.0.24/myfaces-impl-2.0.24.jar
(1.9 MB at 11 MB/s)
[INFO] 
[INFO] --- maven-clean-plugin:2.6.1:clean (default-clean) @ tobago-example ---
[INFO] 
[INFO] --- animal-sniffer-maven-plugin:1.14:check (default-cli) @ tobago-example ---
[INFO] Checking unresolved references to org.codehaus.mojo.signature:java18:1.0
[INFO] 
[INFO] --- maven-checkstyle-plugin:2.17:check (default-cli) @ tobago-example ---
[INFO] Starting audit...
Audit done.
[INFO] 
[INFO] --- maven-enforcer-plugin:3.0.0-M1:enforce (enforce-maven-version) @ tobago-example
---
[INFO] 
[INFO] --- maven-enforcer-plugin:3.0.0-M1:enforce (enforce) @ tobago-example ---
[INFO] 
[INFO] --- maven-remote-resources-plugin:1.5:process (default) @ tobago-example ---
[INFO] 
[INFO] --- maven-remote-resources-plugin:1.5:process (process-resource-bundles) @ tobago-example
---
[INFO] 
[INFO] --- maven-site-plugin:3.6:attach-descriptor (attach-descriptor) @ tobago-example ---
[INFO] No site descriptor found: nothing to attach.
[INFO] 
[INFO] --- maven-install-plugin:2.5.2:install (default-install) @ tobago-example ---
[INFO] Installing <https://builds.apache.org/job/Tobago%20Trunk/ws/tobago-example/pom.xml>
to /home/jenkins/jenkins-slave/maven-repositories/0/org/apache/myfaces/tobago/tobago-example/4.2.2-SNAPSHOT/tobago-example-4.2.2-SNAPSHOT.pom
[INFO] 
[INFO] ------------------------------------------------------------------------
[INFO] Building Tobago Example Blank 4.2.2-SNAPSHOT
[INFO] ------------------------------------------------------------------------
[INFO] Downloading from central: https://repo.maven.apache.org/maven2/org/apache/maven/plugins/maven-war-plugin/3.1.0/maven-war-plugin-3.1.0.pom
[INFO] Downloaded from central: https://repo.maven.apache.org/maven2/org/apache/maven/plugins/maven-war-plugin/3.1.0/maven-war-plugin-3.1.0.pom
(9.3 kB at 372 kB/s)
[INFO] Downloading from central: https://repo.maven.apache.org/maven2/org/apache/maven/plugins/maven-war-plugin/3.1.0/maven-war-plugin-3.1.0.jar
[INFO] Downloaded from central: https://repo.maven.apache.org/maven2/org/apache/maven/plugins/maven-war-plugin/3.1.0/maven-war-plugin-3.1.0.jar
(91 kB at 2.8 MB/s)
[INFO] 
[INFO] --- maven-clean-plugin:2.6.1:clean (default-clean) @ tobago-example-blank ---
[INFO] 
[INFO] --- animal-sniffer-maven-plugin:1.14:check (default-cli) @ tobago-example-blank ---
[INFO] Checking unresolved references to org.codehaus.mojo.signature:java18:1.0
[INFO] 
[INFO] --- maven-checkstyle-plugin:2.17:check (default-cli) @ tobago-example-blank ---
[INFO] Starting audit...
Audit done.
[INFO] 
[INFO] --- maven-enforcer-plugin:3.0.0-M1:enforce (enforce-maven-version) @ tobago-example-blank
---
[INFO] 
[INFO] --- maven-enforcer-plugin:3.0.0-M1:enforce (enforce) @ tobago-example-blank ---
[INFO] 
[INFO] --- maven-remote-resources-plugin:1.5:process (default) @ tobago-example-blank ---
[INFO] 
[INFO] --- maven-remote-resources-plugin:1.5:process (process-resource-bundles) @ tobago-example-blank
---
[INFO] 
[INFO] --- maven-resources-plugin:2.7:resources (default-resources) @ tobago-example-blank
---
[INFO] Using 'UTF-8' encoding to copy filtered resources.
[INFO] Copying 1 resource
[INFO] Copying 3 resources
[INFO] Copying 3 resources
[INFO] 
[INFO] --- maven-compiler-plugin:3.6.2:compile (default-compile) @ tobago-example-blank ---
[INFO] Compiling 1 source file to <https://builds.apache.org/job/Tobago%20Trunk/ws/tobago-example/tobago-example-blank/target/classes>
[INFO] 
[INFO] --- maven-resources-plugin:2.7:testResources (default-testResources) @ tobago-example-blank
---
[INFO] Using 'UTF-8' encoding to copy filtered resources.
[INFO] skip non existing resourceDirectory <https://builds.apache.org/job/Tobago%20Trunk/ws/tobago-example/tobago-example-blank/src/test/resources>
[INFO] Copying 3 resources
[INFO] Copying 3 resources
[INFO] 
[INFO] --- maven-compiler-plugin:3.6.2:testCompile (default-testCompile) @ tobago-example-blank
---
[INFO] No sources to compile
[INFO] 
[INFO] --- maven-surefire-plugin:2.19.1:test (default-test) @ tobago-example-blank ---
[JENKINS] Recording test results
[INFO] 
[INFO] --- maven-war-plugin:3.1.0:war (default-war) @ tobago-example-blank ---
[INFO] Downloading from central: https://repo.maven.apache.org/maven2/com/thoughtworks/xstream/xstream/1.4.9/xstream-1.4.9.pom
[INFO] Downloaded from central: https://repo.maven.apache.org/maven2/com/thoughtworks/xstream/xstream/1.4.9/xstream-1.4.9.pom
(14 kB at 729 kB/s)
[INFO] Downloading from central: https://repo.maven.apache.org/maven2/com/thoughtworks/xstream/xstream-parent/1.4.9/xstream-parent-1.4.9.pom
[INFO] Downloaded from central: https://repo.maven.apache.org/maven2/com/thoughtworks/xstream/xstream-parent/1.4.9/xstream-parent-1.4.9.pom
(34 kB at 2.0 MB/s)
[INFO] Downloading from central: https://repo.maven.apache.org/maven2/com/thoughtworks/xstream/xstream/1.4.9/xstream-1.4.9.jar
[INFO] Downloaded from central: https://repo.maven.apache.org/maven2/com/thoughtworks/xstream/xstream/1.4.9/xstream-1.4.9.jar
(549 kB at 12 MB/s)
[INFO] Packaging webapp
[INFO] Assembling webapp [tobago-example-blank] in [<https://builds.apache.org/job/Tobago%20Trunk/ws/tobago-example/tobago-example-blank/target/tobago-example-blank]>
[INFO] Processing war project
[INFO] Copying webapp resources [<https://builds.apache.org/job/Tobago%20Trunk/ws/tobago-example/tobago-example-blank/src/main/webapp]>
[INFO] Webapp assembled in [53 msecs]
[INFO] Building war: <https://builds.apache.org/job/Tobago%20Trunk/ws/tobago-example/tobago-example-blank/target/tobago-example-blank.war>
[INFO] 
[INFO] --- maven-site-plugin:3.6:attach-descriptor (attach-descriptor) @ tobago-example-blank
---
[INFO] Skipping because packaging 'war' is not pom.
[INFO] 
[INFO] --- maven-install-plugin:2.5.2:install (default-install) @ tobago-example-blank ---
[INFO] Installing <https://builds.apache.org/job/Tobago%20Trunk/ws/tobago-example/tobago-example-blank/target/tobago-example-blank.war>
to /home/jenkins/jenkins-slave/maven-repositories/0/org/apache/myfaces/tobago/tobago-example-blank/4.2.2-SNAPSHOT/tobago-example-blank-4.2.2-SNAPSHOT.war
[INFO] Installing <https://builds.apache.org/job/Tobago%20Trunk/ws/tobago-example/tobago-example-blank/pom.xml>
to /home/jenkins/jenkins-slave/maven-repositories/0/org/apache/myfaces/tobago/tobago-example-blank/4.2.2-SNAPSHOT/tobago-example-blank-4.2.2-SNAPSHOT.pom
[INFO] 
[INFO] ------------------------------------------------------------------------
[INFO] Building Tobago Example Data 4.2.2-SNAPSHOT
[INFO] ------------------------------------------------------------------------
[INFO] 
[INFO] --- maven-clean-plugin:2.6.1:clean (default-clean) @ tobago-example-data ---
[INFO] 
[INFO] --- animal-sniffer-maven-plugin:1.14:check (default-cli) @ tobago-example-data ---
[INFO] Checking unresolved references to org.codehaus.mojo.signature:java18:1.0
[INFO] 
[INFO] --- maven-checkstyle-plugin:2.17:check (default-cli) @ tobago-example-data ---
[INFO] Starting audit...
<https://builds.apache.org/job/Tobago%20Trunk/ws/tobago-example/tobago-example-data/src/main/java/org/apache/myfaces/tobago/example/data/SolarObject.java>:206:
error: Must include both @java.lang.Deprecated annotation and @deprecated Javadoc tag with
description.
<https://builds.apache.org/job/Tobago%20Trunk/ws/tobago-example/tobago-example-data/src/main/java/org/apache/myfaces/tobago/example/data/SolarObject.java>:249:
error: Must include both @java.lang.Deprecated annotation and @deprecated Javadoc tag with
description.
Audit done.
[INFO] There are 2 errors reported by Checkstyle 6.11.2 with tobago/checkstyle.xml ruleset.
[ERROR] src/main/java/org/apache/myfaces/tobago/example/data/SolarObject.java:[206] (annotation)
MissingDeprecated: Must include both @java.lang.Deprecated annotation and @deprecated Javadoc
tag with description.
[ERROR] src/main/java/org/apache/myfaces/tobago/example/data/SolarObject.java:[249] (annotation)
MissingDeprecated: Must include both @java.lang.Deprecated annotation and @deprecated Javadoc
tag with description.
[INFO] ------------------------------------------------------------------------
[INFO] Reactor Summary:
[INFO] 
[INFO] Apache Tobago ...................................... SUCCESS [  9.345 s]
[INFO] Tobago Tool ........................................ SUCCESS [  3.223 s]
[INFO] Tobago Tool Annotation ............................. SUCCESS [  6.883 s]
[INFO] Tobago Tool Apt .................................... SUCCESS [ 59.653 s]
[INFO] Tobago Core ........................................ SUCCESS [ 19.657 s]
[INFO] Tobago Themes ...................................... SUCCESS [  3.056 s]
[INFO] Tobago Theme Standard .............................. SUCCESS [ 10.451 s]
[INFO] Tobago Theme Scarborough ........................... SUCCESS [  4.824 s]
[INFO] Tobago Theme Speyside .............................. SUCCESS [  4.641 s]
[INFO] Tobago Theme Roxborough ............................ SUCCESS [  4.540 s]
[INFO] Tobago Theme Charlotteville ........................ SUCCESS [  4.556 s]
[INFO] Tobago Examples .................................... SUCCESS [  4.420 s]
[INFO] Tobago Example Blank ............................... SUCCESS [  5.583 s]
[INFO] Tobago Example Data ................................ FAILURE [  2.555 s]
[INFO] Tobago Example Demo ................................ SKIPPED
[INFO] Tobago Example Assembly ............................ SKIPPED
[INFO] Tobago Assembly .................................... SKIPPED
[INFO] ------------------------------------------------------------------------
[INFO] BUILD FAILURE
[INFO] ------------------------------------------------------------------------
[INFO] Total time: 03:27 min
[INFO] Finished at: 2018-05-16T12:55:40Z
[INFO] Final Memory: 57M/829M
[INFO] ------------------------------------------------------------------------
[ERROR] Failed to execute goal org.apache.maven.plugins:maven-checkstyle-plugin:2.17:check
(default-cli) on project tobago-example-data: You have 2 Checkstyle violations. -> [Help
1]
[ERROR] 
[ERROR] To see the full stack trace of the errors, re-run Maven with the -e switch.
[ERROR] Re-run Maven using the -X switch to enable full debug logging.
[ERROR] 
[ERROR] For more information about the errors and possible solutions, please read the following
articles:
[ERROR] [Help 1] http://cwiki.apache.org/confluence/display/MAVEN/MojoFailureException
[ERROR] 
[ERROR] After correcting the problems, you can resume the build with the command
[ERROR]   mvn <goals> -rf :tobago-example-data
[JENKINS] Archiving <https://builds.apache.org/job/Tobago%20Trunk/ws/tobago-theme/pom.xml>
to org.apache.myfaces.tobago/tobago-theme/4.2.2-SNAPSHOT/tobago-theme-4.2.2-SNAPSHOT.pom
[JENKINS] Archiving <https://builds.apache.org/job/Tobago%20Trunk/ws/tobago-example/tobago-example-blank/pom.xml>
to org.apache.myfaces.tobago/tobago-example-blank/4.2.2-SNAPSHOT/tobago-example-blank-4.2.2-SNAPSHOT.pom
[JENKINS] Archiving <https://builds.apache.org/job/Tobago%20Trunk/ws/tobago-example/tobago-example-blank/target/tobago-example-blank.war>
to org.apache.myfaces.tobago/tobago-example-blank/4.2.2-SNAPSHOT/tobago-example-blank-4.2.2-SNAPSHOT.war
[Fast Archiver] Compressed 8.45 MB of artifacts by 50.3% relative to #1423
[JENKINS] Archiving <https://builds.apache.org/job/Tobago%20Trunk/ws/tobago-assembly/pom.xml>
to org.apache.myfaces.tobago/tobago-assembly/4.2.2-SNAPSHOT/tobago-assembly-4.2.2-SNAPSHOT.pom
[JENKINS] Archiving <https://builds.apache.org/job/Tobago%20Trunk/ws/pom.xml> to org.apache.myfaces.tobago/tobago/4.2.2-SNAPSHOT/tobago-4.2.2-SNAPSHOT.pom
[JENKINS] Archiving <https://builds.apache.org/job/Tobago%20Trunk/ws/target/tobago-4.2.2-SNAPSHOT-site.xml>
to org.apache.myfaces.tobago/tobago/4.2.2-SNAPSHOT/tobago-4.2.2-SNAPSHOT-site.xml
[Fast Archiver] Compressed 52.35 KB of artifacts by 61.1% relative to #1426
[JENKINS] Archiving <https://builds.apache.org/job/Tobago%20Trunk/ws/tobago-theme/tobago-theme-standard/pom.xml>
to org.apache.myfaces.tobago/tobago-theme-standard/4.2.2-SNAPSHOT/tobago-theme-standard-4.2.2-SNAPSHOT.pom
[JENKINS] Archiving <https://builds.apache.org/job/Tobago%20Trunk/ws/tobago-theme/tobago-theme-standard/target/tobago-theme-standard-4.2.2-SNAPSHOT.jar>
to org.apache.myfaces.tobago/tobago-theme-standard/4.2.2-SNAPSHOT/tobago-theme-standard-4.2.2-SNAPSHOT.jar
[Fast Archiver] Compressed 1.54 MB of artifacts by 46.7% relative to #1423
[JENKINS] Archiving <https://builds.apache.org/job/Tobago%20Trunk/ws/tobago-theme/tobago-theme-scarborough/pom.xml>
to org.apache.myfaces.tobago/tobago-theme-scarborough/4.2.2-SNAPSHOT/tobago-theme-scarborough-4.2.2-SNAPSHOT.pom
[JENKINS] Archiving <https://builds.apache.org/job/Tobago%20Trunk/ws/tobago-theme/tobago-theme-scarborough/target/tobago-theme-scarborough-4.2.2-SNAPSHOT.jar>
to org.apache.myfaces.tobago/tobago-theme-scarborough/4.2.2-SNAPSHOT/tobago-theme-scarborough-4.2.2-SNAPSHOT.jar
[Fast Archiver] Compressed 300.00 KB of artifacts by 42.7% relative to #1423
[JENKINS] Archiving <https://builds.apache.org/job/Tobago%20Trunk/ws/tobago-example/tobago-example-assembly/pom.xml>
to org.apache.myfaces.tobago/tobago-example-assembly/4.2.2-SNAPSHOT/tobago-example-assembly-4.2.2-SNAPSHOT.pom
[JENKINS] Archiving <https://builds.apache.org/job/Tobago%20Trunk/ws/tobago-theme/tobago-theme-speyside/pom.xml>
to org.apache.myfaces.tobago/tobago-theme-speyside/4.2.2-SNAPSHOT/tobago-theme-speyside-4.2.2-SNAPSHOT.pom
[JENKINS] Archiving <https://builds.apache.org/job/Tobago%20Trunk/ws/tobago-theme/tobago-theme-speyside/target/tobago-theme-speyside-4.2.2-SNAPSHOT.jar>
to org.apache.myfaces.tobago/tobago-theme-speyside/4.2.2-SNAPSHOT/tobago-theme-speyside-4.2.2-SNAPSHOT.jar
[Fast Archiver] Compressed 338.21 KB of artifacts by 47.3% relative to #1423
[JENKINS] Archiving <https://builds.apache.org/job/Tobago%20Trunk/ws/tobago-theme/tobago-theme-roxborough/pom.xml>
to org.apache.myfaces.tobago/tobago-theme-roxborough/4.2.2-SNAPSHOT/tobago-theme-roxborough-4.2.2-SNAPSHOT.pom
[JENKINS] Archiving <https://builds.apache.org/job/Tobago%20Trunk/ws/tobago-theme/tobago-theme-roxborough/target/tobago-theme-roxborough-4.2.2-SNAPSHOT.jar>
to org.apache.myfaces.tobago/tobago-theme-roxborough/4.2.2-SNAPSHOT/tobago-theme-roxborough-4.2.2-SNAPSHOT.jar
[Fast Archiver] Compressed 422.54 KB of artifacts by 37.9% relative to #1423
[JENKINS] Archiving <https://builds.apache.org/job/Tobago%20Trunk/ws/tobago-tool/tobago-tool-annotation/pom.xml>
to org.apache.myfaces.tobago/tobago-tool-annotation/4.2.2-SNAPSHOT/tobago-tool-annotation-4.2.2-SNAPSHOT.pom
[JENKINS] Archiving <https://builds.apache.org/job/Tobago%20Trunk/ws/tobago-tool/tobago-tool-annotation/target/tobago-tool-annotation-4.2.2-SNAPSHOT.jar>
to org.apache.myfaces.tobago/tobago-tool-annotation/4.2.2-SNAPSHOT/tobago-tool-annotation-4.2.2-SNAPSHOT.jar
[JENKINS] Archiving <https://builds.apache.org/job/Tobago%20Trunk/ws/tobago-example/pom.xml>
to org.apache.myfaces.tobago/tobago-example/4.2.2-SNAPSHOT/tobago-example-4.2.2-SNAPSHOT.pom
[JENKINS] Archiving <https://builds.apache.org/job/Tobago%20Trunk/ws/tobago-example/tobago-example-data/pom.xml>
to org.apache.myfaces.tobago/tobago-example-data/4.2.2-SNAPSHOT/tobago-example-data-4.2.2-SNAPSHOT.pom
[JENKINS] Archiving <https://builds.apache.org/job/Tobago%20Trunk/ws/tobago-tool/pom.xml>
to org.apache.myfaces.tobago/tobago-tool/4.2.2-SNAPSHOT/tobago-tool-4.2.2-SNAPSHOT.pom
[JENKINS] Archiving <https://builds.apache.org/job/Tobago%20Trunk/ws/tobago-core/pom.xml>
to org.apache.myfaces.tobago/tobago-core/4.2.2-SNAPSHOT/tobago-core-4.2.2-SNAPSHOT.pom
[JENKINS] Archiving <https://builds.apache.org/job/Tobago%20Trunk/ws/tobago-core/target/tobago-core-4.2.2-SNAPSHOT.jar>
to org.apache.myfaces.tobago/tobago-core/4.2.2-SNAPSHOT/tobago-core-4.2.2-SNAPSHOT.jar
[JENKINS] Archiving <https://builds.apache.org/job/Tobago%20Trunk/ws/tobago-core/target/tobago-core-4.2.2-SNAPSHOT-tests.jar>
to org.apache.myfaces.tobago/tobago-core/4.2.2-SNAPSHOT/tobago-core-4.2.2-SNAPSHOT-tests.jar
[JENKINS] Archiving <https://builds.apache.org/job/Tobago%20Trunk/ws/tobago-core/target/tobago-core-4.2.2-SNAPSHOT-sources.jar>
to org.apache.myfaces.tobago/tobago-core/4.2.2-SNAPSHOT/tobago-core-4.2.2-SNAPSHOT-sources.jar
[JENKINS] Archiving <https://builds.apache.org/job/Tobago%20Trunk/ws/tobago-tool/tobago-tool-apt/pom.xml>
to org.apache.myfaces.tobago/tobago-tool-apt/4.2.2-SNAPSHOT/tobago-tool-apt-4.2.2-SNAPSHOT.pom
[JENKINS] Archiving <https://builds.apache.org/job/Tobago%20Trunk/ws/tobago-tool/tobago-tool-apt/target/tobago-tool-apt-4.2.2-SNAPSHOT.jar>
to org.apache.myfaces.tobago/tobago-tool-apt/4.2.2-SNAPSHOT/tobago-tool-apt-4.2.2-SNAPSHOT.jar
[JENKINS] Archiving <https://builds.apache.org/job/Tobago%20Trunk/ws/tobago-theme/tobago-theme-charlotteville/pom.xml>
to org.apache.myfaces.tobago/tobago-theme-charlotteville/4.2.2-SNAPSHOT/tobago-theme-charlotteville-4.2.2-SNAPSHOT.pom
[JENKINS] Archiving <https://builds.apache.org/job/Tobago%20Trunk/ws/tobago-theme/tobago-theme-charlotteville/target/tobago-theme-charlotteville-4.2.2-SNAPSHOT.jar>
to org.apache.myfaces.tobago/tobago-theme-charlotteville/4.2.2-SNAPSHOT/tobago-theme-charlotteville-4.2.2-SNAPSHOT.jar
[Fast Archiver] Compressed 298.89 KB of artifacts by 42.8% relative to #1423
[JENKINS] Archiving <https://builds.apache.org/job/Tobago%20Trunk/ws/tobago-example/tobago-example-demo/pom.xml>
to org.apache.myfaces.tobago/tobago-example-demo/4.2.2-SNAPSHOT/tobago-example-demo-4.2.2-SNAPSHOT.pom
Sending e-mails to: commits@myfaces.apache.org
Sending e-mails to: commits@myfaces.apache.org
Sending e-mails to: commits@myfaces.apache.org
Sending e-mails to: commits@myfaces.apache.org
Sending e-mails to: commits@myfaces.apache.org
Sending e-mails to: commits@myfaces.apache.org
Sending e-mails to: commits@myfaces.apache.org
Sending e-mails to: commits@myfaces.apache.org
Sending e-mails to: commits@myfaces.apache.org
Sending e-mails to: commits@myfaces.apache.org
Sending e-mails to: commits@myfaces.apache.org
Sending e-mails to: commits@myfaces.apache.org
channel stopped

Mime
View raw message