myfaces-commits mailing list archives

Site index · List index
Message view « Date » · « Thread »
Top « Date » · « Thread »
From Apache Jenkins Server <jenk...@builds.apache.org>
Subject Build failed in Jenkins: Tobago Trunk (deploy) #754
Date Wed, 30 May 2018 13:07:42 GMT
See <https://builds.apache.org/job/Tobago%20Trunk%20(deploy)/754/display/redirect?page=changes>

Changes:

[lofwyr] demo: clean up

------------------------------------------
[...truncated 1002.23 KB...]
[INFO] Downloaded from central: https://repo.maven.apache.org/maven2/org/seleniumhq/selenium/selenium-chrome-driver/3.12.0/selenium-chrome-driver-3.12.0.jar
(11 kB at 172 kB/s)
[INFO] Downloading from central: https://repo.maven.apache.org/maven2/org/seleniumhq/selenium/selenium-ie-driver/3.12.0/selenium-ie-driver-3.12.0.jar
[INFO] Downloaded from central: https://repo.maven.apache.org/maven2/org/seleniumhq/selenium/selenium-edge-driver/3.12.0/selenium-edge-driver-3.12.0.jar
(5.6 kB at 82 kB/s)
[INFO] Downloading from central: https://repo.maven.apache.org/maven2/org/seleniumhq/selenium/selenium-opera-driver/3.12.0/selenium-opera-driver-3.12.0.jar
[INFO] Downloaded from central: https://repo.maven.apache.org/maven2/org/apache/httpcomponents/httpcore/4.4.8/httpcore-4.4.8.jar
(325 kB at 4.7 MB/s)
[INFO] Downloading from central: https://repo.maven.apache.org/maven2/org/seleniumhq/selenium/selenium-remote-driver/3.12.0/selenium-remote-driver-3.12.0.jar
[INFO] Downloaded from central: https://repo.maven.apache.org/maven2/org/seleniumhq/selenium/selenium-ie-driver/3.12.0/selenium-ie-driver-3.12.0.jar
(15 kB at 195 kB/s)
[INFO] Downloading from central: https://repo.maven.apache.org/maven2/org/seleniumhq/selenium/selenium-safari-driver/3.12.0/selenium-safari-driver-3.12.0.jar
[INFO] Downloaded from central: https://repo.maven.apache.org/maven2/org/seleniumhq/selenium/selenium-opera-driver/3.12.0/selenium-opera-driver-3.12.0.jar
(8.3 kB at 103 kB/s)
[INFO] Downloading from central: https://repo.maven.apache.org/maven2/org/seleniumhq/selenium/selenium-support/3.12.0/selenium-support-3.12.0.jar
[INFO] Downloaded from central: https://repo.maven.apache.org/maven2/org/seleniumhq/selenium/selenium-safari-driver/3.12.0/selenium-safari-driver-3.12.0.jar
(8.6 kB at 96 kB/s)
[INFO] Downloading from central: https://repo.maven.apache.org/maven2/net/bytebuddy/byte-buddy/1.8.3/byte-buddy-1.8.3.jar
[INFO] Downloaded from central: https://repo.maven.apache.org/maven2/org/hibernate/hibernate-validator/4.3.2.Final/hibernate-validator-4.3.2.Final.jar
(485 kB at 5.3 MB/s)
[INFO] Downloading from central: https://repo.maven.apache.org/maven2/com/google/guava/guava/25.0-jre/guava-25.0-jre.jar
[INFO] Downloaded from central: https://repo.maven.apache.org/maven2/org/seleniumhq/selenium/selenium-support/3.12.0/selenium-support-3.12.0.jar
(154 kB at 1.6 MB/s)
[INFO] Downloading from central: https://repo.maven.apache.org/maven2/com/squareup/okhttp3/okhttp/3.9.1/okhttp-3.9.1.jar
[INFO] Downloaded from central: https://repo.maven.apache.org/maven2/org/seleniumhq/selenium/selenium-remote-driver/3.12.0/selenium-remote-driver-3.12.0.jar
(381 kB at 3.6 MB/s)
[INFO] Downloading from central: https://repo.maven.apache.org/maven2/com/squareup/okio/okio/1.13.0/okio-1.13.0.jar
[INFO] Downloaded from central: https://repo.maven.apache.org/maven2/com/squareup/okio/okio/1.13.0/okio-1.13.0.jar
(82 kB at 671 kB/s)
[INFO] Downloading from central: https://repo.maven.apache.org/maven2/org/apache/geronimo/specs/geronimo-jcdi_2.0_spec/1.0/geronimo-jcdi_2.0_spec-1.0.jar
[INFO] Downloaded from central: https://repo.maven.apache.org/maven2/org/seleniumhq/selenium/selenium-firefox-driver/3.12.0/selenium-firefox-driver-3.12.0.jar
(802 kB at 6.4 MB/s)
[INFO] Downloading from central: https://repo.maven.apache.org/maven2/org/apache/geronimo/specs/geronimo-validation_1.1_spec/1.0/geronimo-validation_1.1_spec-1.0.jar
[INFO] Downloaded from central: https://repo.maven.apache.org/maven2/com/squareup/okhttp3/okhttp/3.9.1/okhttp-3.9.1.jar
(406 kB at 2.9 MB/s)
[INFO] Downloading from central: https://repo.maven.apache.org/maven2/org/apache/openwebbeans/openwebbeans-jsf/2.0.4/openwebbeans-jsf-2.0.4.jar
[INFO] Downloaded from central: https://repo.maven.apache.org/maven2/org/apache/geronimo/specs/geronimo-validation_1.1_spec/1.0/geronimo-validation_1.1_spec-1.0.jar
(75 kB at 517 kB/s)
[INFO] Downloading from central: https://repo.maven.apache.org/maven2/org/apache/openwebbeans/openwebbeans-impl/2.0.4/openwebbeans-impl-2.0.4.jar
[INFO] Downloaded from central: https://repo.maven.apache.org/maven2/org/apache/geronimo/specs/geronimo-jcdi_2.0_spec/1.0/geronimo-jcdi_2.0_spec-1.0.jar
(104 kB at 704 kB/s)
[INFO] Downloading from central: https://repo.maven.apache.org/maven2/org/apache/xbean/xbean-asm6-shaded/4.6/xbean-asm6-shaded-4.6.jar
[INFO] Downloaded from central: https://repo.maven.apache.org/maven2/org/apache/openwebbeans/openwebbeans-jsf/2.0.4/openwebbeans-jsf-2.0.4.jar
(18 kB at 115 kB/s)
[INFO] Downloading from central: https://repo.maven.apache.org/maven2/org/apache/openwebbeans/openwebbeans-spi/2.0.4/openwebbeans-spi-2.0.4.jar
[INFO] Downloaded from central: https://repo.maven.apache.org/maven2/org/apache/openwebbeans/openwebbeans-spi/2.0.4/openwebbeans-spi-2.0.4.jar
(22 kB at 129 kB/s)
[INFO] Downloading from central: https://repo.maven.apache.org/maven2/org/apache/openwebbeans/openwebbeans-web/2.0.4/openwebbeans-web-2.0.4.jar
[INFO] Downloaded from central: https://repo.maven.apache.org/maven2/org/apache/xbean/xbean-asm6-shaded/4.6/xbean-asm6-shaded-4.6.jar
(236 kB at 1.3 MB/s)
[INFO] Downloading from central: https://repo.maven.apache.org/maven2/org/apache/xbean/xbean-finder-shaded/4.6/xbean-finder-shaded-4.6.jar
[INFO] Downloaded from central: https://repo.maven.apache.org/maven2/org/apache/openwebbeans/openwebbeans-web/2.0.4/openwebbeans-web-2.0.4.jar
(43 kB at 231 kB/s)
[INFO] Downloading from central: https://repo.maven.apache.org/maven2/org/apache/openwebbeans/openwebbeans-el22/2.0.4/openwebbeans-el22-2.0.4.jar
[INFO] Downloaded from central: https://repo.maven.apache.org/maven2/org/apache/xbean/xbean-finder-shaded/4.6/xbean-finder-shaded-4.6.jar
(162 kB at 768 kB/s)
[INFO] Downloading from central: https://repo.maven.apache.org/maven2/org/apache/openwebbeans/openwebbeans-resource/2.0.4/openwebbeans-resource-2.0.4.jar
[INFO] Downloaded from central: https://repo.maven.apache.org/maven2/org/apache/openwebbeans/openwebbeans-impl/2.0.4/openwebbeans-impl-2.0.4.jar
(741 kB at 3.4 MB/s)
[INFO] Downloaded from central: https://repo.maven.apache.org/maven2/org/apache/openwebbeans/openwebbeans-resource/2.0.4/openwebbeans-resource-2.0.4.jar
(15 kB at 69 kB/s)
[INFO] Downloaded from central: https://repo.maven.apache.org/maven2/org/apache/openwebbeans/openwebbeans-el22/2.0.4/openwebbeans-el22-2.0.4.jar
(16 kB at 57 kB/s)
[INFO] Downloaded from central: https://repo.maven.apache.org/maven2/com/google/guava/guava/25.0-jre/guava-25.0-jre.jar
(2.7 MB at 9.4 MB/s)
[INFO] Downloaded from central: https://repo.maven.apache.org/maven2/net/bytebuddy/byte-buddy/1.8.3/byte-buddy-1.8.3.jar
(3.0 MB at 10 MB/s)
[INFO] 
[INFO] --- maven-clean-plugin:2.6.1:clean (default-clean) @ tobago-example-demo ---
[INFO] 
[INFO] --- animal-sniffer-maven-plugin:1.14:check (default-cli) @ tobago-example-demo ---
[INFO] Checking unresolved references to org.codehaus.mojo.signature:java18:1.0
[INFO] 
[INFO] --- maven-enforcer-plugin:3.0.0-M1:enforce (enforce-maven-version) @ tobago-example-demo
---
[INFO] 
[INFO] --- maven-enforcer-plugin:3.0.0-M1:enforce (enforce) @ tobago-example-demo ---
[INFO] 
[INFO] --- buildnumber-maven-plugin:1.4:create (default) @ tobago-example-demo ---
[INFO] 
[INFO] --- maven-remote-resources-plugin:1.5:process (default) @ tobago-example-demo ---
[INFO] 
[INFO] --- maven-remote-resources-plugin:1.5:process (process-resource-bundles) @ tobago-example-demo
---
[INFO] 
[INFO] --- maven-resources-plugin:2.7:resources (default-resources) @ tobago-example-demo
---
[INFO] Using 'UTF-8' encoding to copy filtered resources.
[INFO] Copying 18 resources
[INFO] Copying 3 resources
[INFO] Copying 3 resources
[INFO] 
[INFO] --- maven-compiler-plugin:3.6.2:compile (default-compile) @ tobago-example-demo ---
[INFO] Compiling 152 source files to <https://builds.apache.org/job/Tobago%20Trunk%20(deploy)/ws/tobago-example/tobago-example-demo/target/classes>
[INFO] <https://builds.apache.org/job/Tobago%20Trunk%20(deploy)/ws/tobago-example/tobago-example-demo/src/main/java/org/apache/myfaces/tobago/example/demo/EventController.java>:
Some input files use or override a deprecated API.
[INFO] <https://builds.apache.org/job/Tobago%20Trunk%20(deploy)/ws/tobago-example/tobago-example-demo/src/main/java/org/apache/myfaces/tobago/example/demo/EventController.java>:
Recompile with -Xlint:deprecation for details.
[INFO] <https://builds.apache.org/job/Tobago%20Trunk%20(deploy)/ws/tobago-example/tobago-example-demo/src/main/java/org/apache/myfaces/tobago/example/demo/NavigationTree.java>:
Some input files use unchecked or unsafe operations.
[INFO] <https://builds.apache.org/job/Tobago%20Trunk%20(deploy)/ws/tobago-example/tobago-example-demo/src/main/java/org/apache/myfaces/tobago/example/demo/NavigationTree.java>:
Recompile with -Xlint:unchecked for details.
[INFO] -------------------------------------------------------------
[ERROR] COMPILATION ERROR : 
[INFO] -------------------------------------------------------------
[ERROR] <https://builds.apache.org/job/Tobago%20Trunk%20(deploy)/ws/tobago-example/tobago-example-demo/src/main/java/org/apache/myfaces/tobago/example/demo/LocaleList.java>:[22,32]
package org.apache.commons.lang3 does not exist
[ERROR] <https://builds.apache.org/job/Tobago%20Trunk%20(deploy)/ws/tobago-example/tobago-example-demo/src/main/java/org/apache/myfaces/tobago/example/demo/LocaleEntry.java>:[22,32]
package org.apache.commons.lang3 does not exist
[ERROR] <https://builds.apache.org/job/Tobago%20Trunk%20(deploy)/ws/tobago-example/tobago-example-demo/src/main/java/org/apache/myfaces/tobago/example/demo/SuggestQuotMarkController.java>:[22,32]
package org.apache.commons.lang3 does not exist
[ERROR] <https://builds.apache.org/job/Tobago%20Trunk%20(deploy)/ws/tobago-example/tobago-example-demo/src/main/java/org/apache/myfaces/tobago/example/demo/InputSuggestController.java>:[22,32]
package org.apache.commons.lang3 does not exist
[ERROR] <https://builds.apache.org/job/Tobago%20Trunk%20(deploy)/ws/tobago-example/tobago-example-demo/src/main/java/org/apache/myfaces/tobago/example/demo/SheetFilterController.java>:[22,32]
package org.apache.commons.lang3 does not exist
[ERROR] <https://builds.apache.org/job/Tobago%20Trunk%20(deploy)/ws/tobago-example/tobago-example-demo/src/main/java/org/apache/myfaces/tobago/example/demo/SuggestController.java>:[22,32]
package org.apache.commons.lang3 does not exist
[ERROR] <https://builds.apache.org/job/Tobago%20Trunk%20(deploy)/ws/tobago-example/tobago-example-demo/src/main/java/org/apache/myfaces/tobago/example/demo/LocaleList.java>:[55,11]
cannot find symbol
  symbol:   variable StringUtils
  location: class org.apache.myfaces.tobago.example.demo.LocaleList
[ERROR] <https://builds.apache.org/job/Tobago%20Trunk%20(deploy)/ws/tobago-example/tobago-example-demo/src/main/java/org/apache/myfaces/tobago/example/demo/LocaleList.java>:[56,14]
cannot find symbol
  symbol:   variable StringUtils
  location: class org.apache.myfaces.tobago.example.demo.LocaleList
[ERROR] <https://builds.apache.org/job/Tobago%20Trunk%20(deploy)/ws/tobago-example/tobago-example-demo/src/main/java/org/apache/myfaces/tobago/example/demo/LocaleList.java>:[69,11]
cannot find symbol
  symbol:   variable StringUtils
  location: class org.apache.myfaces.tobago.example.demo.LocaleList
[ERROR] <https://builds.apache.org/job/Tobago%20Trunk%20(deploy)/ws/tobago-example/tobago-example-demo/src/main/java/org/apache/myfaces/tobago/example/demo/LocaleEntry.java>:[41,12]
cannot find symbol
  symbol:   variable StringUtils
  location: class org.apache.myfaces.tobago.example.demo.LocaleEntry
[ERROR] <https://builds.apache.org/job/Tobago%20Trunk%20(deploy)/ws/tobago-example/tobago-example-demo/src/main/java/org/apache/myfaces/tobago/example/demo/SuggestQuotMarkController.java>:[62,45]
cannot find symbol
  symbol:   variable StringUtils
  location: class org.apache.myfaces.tobago.example.demo.SuggestQuotMarkController
[ERROR] <https://builds.apache.org/job/Tobago%20Trunk%20(deploy)/ws/tobago-example/tobago-example-demo/src/main/java/org/apache/myfaces/tobago/example/demo/InputSuggestController.java>:[128,19]
cannot find symbol
  symbol:   variable RandomUtils
  location: class org.apache.myfaces.tobago.example.demo.InputSuggestController
[ERROR] <https://builds.apache.org/job/Tobago%20Trunk%20(deploy)/ws/tobago-example/tobago-example-demo/src/main/java/org/apache/myfaces/tobago/example/demo/SheetFilterController.java>:[134,11]
cannot find symbol
  symbol:   variable StringUtils
  location: class org.apache.myfaces.tobago.example.demo.SheetFilterController
[ERROR] <https://builds.apache.org/job/Tobago%20Trunk%20(deploy)/ws/tobago-example/tobago-example-demo/src/main/java/org/apache/myfaces/tobago/example/demo/SheetFilterController.java>:[135,14]
cannot find symbol
  symbol:   variable StringUtils
  location: class org.apache.myfaces.tobago.example.demo.SheetFilterController
[ERROR] <https://builds.apache.org/job/Tobago%20Trunk%20(deploy)/ws/tobago-example/tobago-example-demo/src/main/java/org/apache/myfaces/tobago/example/demo/SheetFilterController.java>:[137,14]
cannot find symbol
  symbol:   variable StringUtils
  location: class org.apache.myfaces.tobago.example.demo.SheetFilterController
[ERROR] <https://builds.apache.org/job/Tobago%20Trunk%20(deploy)/ws/tobago-example/tobago-example-demo/src/main/java/org/apache/myfaces/tobago/example/demo/SheetFilterController.java>:[232,11]
cannot find symbol
  symbol:   variable StringUtils
  location: class org.apache.myfaces.tobago.example.demo.SheetFilterController
[ERROR] <https://builds.apache.org/job/Tobago%20Trunk%20(deploy)/ws/tobago-example/tobago-example-demo/src/main/java/org/apache/myfaces/tobago/example/demo/SuggestController.java>:[65,46]
cannot find symbol
  symbol:   variable StringUtils
  location: class org.apache.myfaces.tobago.example.demo.SuggestController
[ERROR] <https://builds.apache.org/job/Tobago%20Trunk%20(deploy)/ws/tobago-example/tobago-example-demo/src/main/java/org/apache/myfaces/tobago/example/demo/SuggestController.java>:[84,11]
cannot find symbol
  symbol:   variable StringUtils
  location: class org.apache.myfaces.tobago.example.demo.SuggestController
[INFO] 18 errors 
[INFO] -------------------------------------------------------------
[INFO] ------------------------------------------------------------------------
[INFO] Reactor Summary:
[INFO] 
[INFO] Apache Tobago ...................................... SUCCESS [ 37.194 s]
[INFO] Tobago Tool ........................................ SUCCESS [ 12.198 s]
[INFO] Tobago Tool Annotation ............................. SUCCESS [ 32.987 s]
[INFO] Tobago Tool Apt .................................... SUCCESS [01:29 min]
[INFO] Tobago Core ........................................ SUCCESS [01:32 min]
[INFO] Tobago Themes ...................................... SUCCESS [ 12.282 s]
[INFO] Tobago Theme Standard .............................. SUCCESS [ 35.171 s]
[INFO] Tobago Theme Scarborough ........................... SUCCESS [ 21.107 s]
[INFO] Tobago Theme Speyside .............................. SUCCESS [ 21.063 s]
[INFO] Tobago Theme Roxborough ............................ SUCCESS [ 25.525 s]
[INFO] Tobago Theme Charlotteville ........................ SUCCESS [ 22.436 s]
[INFO] Tobago Examples .................................... SUCCESS [ 12.508 s]
[INFO] Tobago Example Blank ............................... SUCCESS [ 52.153 s]
[INFO] Tobago Example Demo ................................ FAILURE [  8.770 s]
[INFO] Tobago Example Assembly ............................ SKIPPED
[INFO] Tobago Assembly .................................... SKIPPED
[INFO] ------------------------------------------------------------------------
[INFO] BUILD FAILURE
[INFO] ------------------------------------------------------------------------
[INFO] Total time: 09:29 min
[INFO] Finished at: 2018-05-30T13:07:07Z
[INFO] Final Memory: 70M/831M
[INFO] ------------------------------------------------------------------------
Waiting for Jenkins to finish collecting data
[ERROR] Failed to execute goal org.apache.maven.plugins:maven-compiler-plugin:3.6.2:compile
(default-compile) on project tobago-example-demo: Compilation failure: Compilation failure:
[ERROR] <https://builds.apache.org/job/Tobago%20Trunk%20(deploy)/ws/tobago-example/tobago-example-demo/src/main/java/org/apache/myfaces/tobago/example/demo/LocaleList.java>:[22,32]
package org.apache.commons.lang3 does not exist
[ERROR] <https://builds.apache.org/job/Tobago%20Trunk%20(deploy)/ws/tobago-example/tobago-example-demo/src/main/java/org/apache/myfaces/tobago/example/demo/LocaleEntry.java>:[22,32]
package org.apache.commons.lang3 does not exist
[ERROR] <https://builds.apache.org/job/Tobago%20Trunk%20(deploy)/ws/tobago-example/tobago-example-demo/src/main/java/org/apache/myfaces/tobago/example/demo/SuggestQuotMarkController.java>:[22,32]
package org.apache.commons.lang3 does not exist
[ERROR] <https://builds.apache.org/job/Tobago%20Trunk%20(deploy)/ws/tobago-example/tobago-example-demo/src/main/java/org/apache/myfaces/tobago/example/demo/InputSuggestController.java>:[22,32]
package org.apache.commons.lang3 does not exist
[ERROR] <https://builds.apache.org/job/Tobago%20Trunk%20(deploy)/ws/tobago-example/tobago-example-demo/src/main/java/org/apache/myfaces/tobago/example/demo/SheetFilterController.java>:[22,32]
package org.apache.commons.lang3 does not exist
[ERROR] <https://builds.apache.org/job/Tobago%20Trunk%20(deploy)/ws/tobago-example/tobago-example-demo/src/main/java/org/apache/myfaces/tobago/example/demo/SuggestController.java>:[22,32]
package org.apache.commons.lang3 does not exist
[ERROR] <https://builds.apache.org/job/Tobago%20Trunk%20(deploy)/ws/tobago-example/tobago-example-demo/src/main/java/org/apache/myfaces/tobago/example/demo/LocaleList.java>:[55,11]
cannot find symbol
[ERROR] symbol:   variable StringUtils
[ERROR] location: class org.apache.myfaces.tobago.example.demo.LocaleList
[ERROR] <https://builds.apache.org/job/Tobago%20Trunk%20(deploy)/ws/tobago-example/tobago-example-demo/src/main/java/org/apache/myfaces/tobago/example/demo/LocaleList.java>:[56,14]
cannot find symbol
[ERROR] symbol:   variable StringUtils
[ERROR] location: class org.apache.myfaces.tobago.example.demo.LocaleList
[ERROR] <https://builds.apache.org/job/Tobago%20Trunk%20(deploy)/ws/tobago-example/tobago-example-demo/src/main/java/org/apache/myfaces/tobago/example/demo/LocaleList.java>:[69,11]
cannot find symbol
[ERROR] symbol:   variable StringUtils
[ERROR] location: class org.apache.myfaces.tobago.example.demo.LocaleList
[ERROR] <https://builds.apache.org/job/Tobago%20Trunk%20(deploy)/ws/tobago-example/tobago-example-demo/src/main/java/org/apache/myfaces/tobago/example/demo/LocaleEntry.java>:[41,12]
cannot find symbol
[ERROR] symbol:   variable StringUtils
[ERROR] location: class org.apache.myfaces.tobago.example.demo.LocaleEntry
[ERROR] <https://builds.apache.org/job/Tobago%20Trunk%20(deploy)/ws/tobago-example/tobago-example-demo/src/main/java/org/apache/myfaces/tobago/example/demo/SuggestQuotMarkController.java>:[62,45]
cannot find symbol
[ERROR] symbol:   variable StringUtils
[ERROR] location: class org.apache.myfaces.tobago.example.demo.SuggestQuotMarkController
[ERROR] <https://builds.apache.org/job/Tobago%20Trunk%20(deploy)/ws/tobago-example/tobago-example-demo/src/main/java/org/apache/myfaces/tobago/example/demo/InputSuggestController.java>:[128,19]
cannot find symbol
[ERROR] symbol:   variable RandomUtils
[ERROR] location: class org.apache.myfaces.tobago.example.demo.InputSuggestController
[ERROR] <https://builds.apache.org/job/Tobago%20Trunk%20(deploy)/ws/tobago-example/tobago-example-demo/src/main/java/org/apache/myfaces/tobago/example/demo/SheetFilterController.java>:[134,11]
cannot find symbol
[ERROR] symbol:   variable StringUtils
[ERROR] location: class org.apache.myfaces.tobago.example.demo.SheetFilterController
[ERROR] <https://builds.apache.org/job/Tobago%20Trunk%20(deploy)/ws/tobago-example/tobago-example-demo/src/main/java/org/apache/myfaces/tobago/example/demo/SheetFilterController.java>:[135,14]
cannot find symbol
[ERROR] symbol:   variable StringUtils
[ERROR] location: class org.apache.myfaces.tobago.example.demo.SheetFilterController
[ERROR] <https://builds.apache.org/job/Tobago%20Trunk%20(deploy)/ws/tobago-example/tobago-example-demo/src/main/java/org/apache/myfaces/tobago/example/demo/SheetFilterController.java>:[137,14]
cannot find symbol
[ERROR] symbol:   variable StringUtils
[ERROR] location: class org.apache.myfaces.tobago.example.demo.SheetFilterController
[ERROR] <https://builds.apache.org/job/Tobago%20Trunk%20(deploy)/ws/tobago-example/tobago-example-demo/src/main/java/org/apache/myfaces/tobago/example/demo/SheetFilterController.java>:[232,11]
cannot find symbol
[ERROR] symbol:   variable StringUtils
[ERROR] location: class org.apache.myfaces.tobago.example.demo.SheetFilterController
[ERROR] <https://builds.apache.org/job/Tobago%20Trunk%20(deploy)/ws/tobago-example/tobago-example-demo/src/main/java/org/apache/myfaces/tobago/example/demo/SuggestController.java>:[65,46]
cannot find symbol
[ERROR] symbol:   variable StringUtils
[ERROR] location: class org.apache.myfaces.tobago.example.demo.SuggestController
[ERROR] <https://builds.apache.org/job/Tobago%20Trunk%20(deploy)/ws/tobago-example/tobago-example-demo/src/main/java/org/apache/myfaces/tobago/example/demo/SuggestController.java>:[84,11]
cannot find symbol
[ERROR] symbol:   variable StringUtils
[ERROR] location: class org.apache.myfaces.tobago.example.demo.SuggestController
[ERROR] -> [Help 1]
[ERROR] 
[ERROR] To see the full stack trace of the errors, re-run Maven with the -e switch.
[ERROR] Re-run Maven using the -X switch to enable full debug logging.
[ERROR] 
[ERROR] For more information about the errors and possible solutions, please read the following
articles:
[ERROR] [Help 1] http://cwiki.apache.org/confluence/display/MAVEN/MojoFailureException
[ERROR] 
[ERROR] After correcting the problems, you can resume the build with the command
[ERROR]   mvn <goals> -rf :tobago-example-demo
[JENKINS] Archiving <https://builds.apache.org/job/Tobago%20Trunk%20(deploy)/ws/tobago-theme/pom.xml>
to org.apache.myfaces.tobago/tobago-theme/4.2.2-SNAPSHOT/tobago-theme-4.2.2-SNAPSHOT.pom
[JENKINS] Archiving <https://builds.apache.org/job/Tobago%20Trunk%20(deploy)/ws/tobago-example/tobago-example-blank/pom.xml>
to org.apache.myfaces.tobago/tobago-example-blank/4.2.2-SNAPSHOT/tobago-example-blank-4.2.2-SNAPSHOT.pom
[JENKINS] Archiving <https://builds.apache.org/job/Tobago%20Trunk%20(deploy)/ws/tobago-example/tobago-example-blank/target/tobago-example-blank.war>
to org.apache.myfaces.tobago/tobago-example-blank/4.2.2-20180530.130610-20/tobago-example-blank-4.2.2-20180530.130610-20.war
[JENKINS] Archiving <https://builds.apache.org/job/Tobago%20Trunk%20(deploy)/ws/tobago-example/tobago-example-blank/target/tobago-example-blank-javadoc.jar>
to org.apache.myfaces.tobago/tobago-example-blank/4.2.2-20180530.130610-20/tobago-example-blank-4.2.2-20180530.130610-20-javadoc.jar
[JENKINS] Archiving <https://builds.apache.org/job/Tobago%20Trunk%20(deploy)/ws/tobago-example/tobago-example-blank/target/tobago-example-blank-sources.jar>
to org.apache.myfaces.tobago/tobago-example-blank/4.2.2-20180530.130610-20/tobago-example-blank-4.2.2-20180530.130610-20-sources.jar
[Fast Archiver] Compressed 8.49 MB of artifacts by 50.1% relative to #753
[JENKINS] Archiving <https://builds.apache.org/job/Tobago%20Trunk%20(deploy)/ws/tobago-assembly/pom.xml>
to org.apache.myfaces.tobago/tobago-assembly/4.2.2-SNAPSHOT/tobago-assembly-4.2.2-SNAPSHOT.pom
[JENKINS] Archiving <https://builds.apache.org/job/Tobago%20Trunk%20(deploy)/ws/pom.xml>
to org.apache.myfaces.tobago/tobago/4.2.2-SNAPSHOT/tobago-4.2.2-SNAPSHOT.pom
[JENKINS] Archiving <https://builds.apache.org/job/Tobago%20Trunk%20(deploy)/ws/target/tobago-4.2.2-SNAPSHOT-site.xml>
to org.apache.myfaces.tobago/tobago/4.2.2-20180530.125803-21/tobago-4.2.2-20180530.125803-21-site.xml
[JENKINS] Archiving <https://builds.apache.org/job/Tobago%20Trunk%20(deploy)/ws/target/tobago-4.2.2-SNAPSHOT-source-release.zip>
to org.apache.myfaces.tobago/tobago/4.2.2-20180530.125803-21/tobago-4.2.2-20180530.125803-21-source-release.zip
[Fast Archiver] Compressed 11.10 MB of artifacts by 58.0% relative to #753
[JENKINS] Archiving <https://builds.apache.org/job/Tobago%20Trunk%20(deploy)/ws/tobago-theme/tobago-theme-standard/pom.xml>
to org.apache.myfaces.tobago/tobago-theme-standard/4.2.2-SNAPSHOT/tobago-theme-standard-4.2.2-SNAPSHOT.pom
[JENKINS] Archiving <https://builds.apache.org/job/Tobago%20Trunk%20(deploy)/ws/tobago-theme/tobago-theme-standard/target/tobago-theme-standard-4.2.2-SNAPSHOT.jar>
to org.apache.myfaces.tobago/tobago-theme-standard/4.2.2-20180530.130311-20/tobago-theme-standard-4.2.2-20180530.130311-20.jar
[JENKINS] Archiving <https://builds.apache.org/job/Tobago%20Trunk%20(deploy)/ws/tobago-theme/tobago-theme-standard/target/tobago-theme-standard-4.2.2-SNAPSHOT-sources.jar>
to org.apache.myfaces.tobago/tobago-theme-standard/4.2.2-20180530.130311-20/tobago-theme-standard-4.2.2-20180530.130311-20-sources.jar
[Fast Archiver] Compressed 3.02 MB of artifacts by 56.8% relative to #753
[JENKINS] Archiving <https://builds.apache.org/job/Tobago%20Trunk%20(deploy)/ws/tobago-theme/tobago-theme-scarborough/pom.xml>
to org.apache.myfaces.tobago/tobago-theme-scarborough/4.2.2-SNAPSHOT/tobago-theme-scarborough-4.2.2-SNAPSHOT.pom
[JENKINS] Archiving <https://builds.apache.org/job/Tobago%20Trunk%20(deploy)/ws/tobago-theme/tobago-theme-scarborough/target/tobago-theme-scarborough-4.2.2-SNAPSHOT.jar>
to org.apache.myfaces.tobago/tobago-theme-scarborough/4.2.2-20180530.130337-20/tobago-theme-scarborough-4.2.2-20180530.130337-20.jar
[JENKINS] Archiving <https://builds.apache.org/job/Tobago%20Trunk%20(deploy)/ws/tobago-theme/tobago-theme-scarborough/target/tobago-theme-scarborough-4.2.2-SNAPSHOT-sources.jar>
to org.apache.myfaces.tobago/tobago-theme-scarborough/4.2.2-20180530.130337-20/tobago-theme-scarborough-4.2.2-20180530.130337-20-sources.jar
[Fast Archiver] Compressed 597.98 KB of artifacts by 42.8% relative to #753
[JENKINS] Archiving <https://builds.apache.org/job/Tobago%20Trunk%20(deploy)/ws/tobago-example/tobago-example-assembly/pom.xml>
to org.apache.myfaces.tobago/tobago-example-assembly/4.2.2-SNAPSHOT/tobago-example-assembly-4.2.2-SNAPSHOT.pom
[JENKINS] Archiving <https://builds.apache.org/job/Tobago%20Trunk%20(deploy)/ws/tobago-theme/tobago-theme-speyside/pom.xml>
to org.apache.myfaces.tobago/tobago-theme-speyside/4.2.2-SNAPSHOT/tobago-theme-speyside-4.2.2-SNAPSHOT.pom
[JENKINS] Archiving <https://builds.apache.org/job/Tobago%20Trunk%20(deploy)/ws/tobago-theme/tobago-theme-speyside/target/tobago-theme-speyside-4.2.2-SNAPSHOT.jar>
to org.apache.myfaces.tobago/tobago-theme-speyside/4.2.2-20180530.130402-20/tobago-theme-speyside-4.2.2-20180530.130402-20.jar
[JENKINS] Archiving <https://builds.apache.org/job/Tobago%20Trunk%20(deploy)/ws/tobago-theme/tobago-theme-speyside/target/tobago-theme-speyside-4.2.2-SNAPSHOT-sources.jar>
to org.apache.myfaces.tobago/tobago-theme-speyside/4.2.2-20180530.130402-20/tobago-theme-speyside-4.2.2-20180530.130402-20-sources.jar
[Fast Archiver] Compressed 674.40 KB of artifacts by 47.4% relative to #753
[JENKINS] Archiving <https://builds.apache.org/job/Tobago%20Trunk%20(deploy)/ws/tobago-theme/tobago-theme-roxborough/pom.xml>
to org.apache.myfaces.tobago/tobago-theme-roxborough/4.2.2-SNAPSHOT/tobago-theme-roxborough-4.2.2-SNAPSHOT.pom
[JENKINS] Archiving <https://builds.apache.org/job/Tobago%20Trunk%20(deploy)/ws/tobago-theme/tobago-theme-roxborough/target/tobago-theme-roxborough-4.2.2-SNAPSHOT.jar>
to org.apache.myfaces.tobago/tobago-theme-roxborough/4.2.2-20180530.130432-20/tobago-theme-roxborough-4.2.2-20180530.130432-20.jar
[JENKINS] Archiving <https://builds.apache.org/job/Tobago%20Trunk%20(deploy)/ws/tobago-theme/tobago-theme-roxborough/target/tobago-theme-roxborough-4.2.2-SNAPSHOT-sources.jar>
to org.apache.myfaces.tobago/tobago-theme-roxborough/4.2.2-20180530.130432-20/tobago-theme-roxborough-4.2.2-20180530.130432-20-sources.jar
[Fast Archiver] Compressed 843.05 KB of artifacts by 30.4% relative to #753
[JENKINS] Archiving <https://builds.apache.org/job/Tobago%20Trunk%20(deploy)/ws/tobago-tool/tobago-tool-annotation/pom.xml>
to org.apache.myfaces.tobago/tobago-tool-annotation/4.2.2-SNAPSHOT/tobago-tool-annotation-4.2.2-SNAPSHOT.pom
[JENKINS] Archiving <https://builds.apache.org/job/Tobago%20Trunk%20(deploy)/ws/tobago-tool/tobago-tool-annotation/target/tobago-tool-annotation-4.2.2-SNAPSHOT.jar>
to org.apache.myfaces.tobago/tobago-tool-annotation/4.2.2-20180530.125859-21/tobago-tool-annotation-4.2.2-20180530.125859-21.jar
[JENKINS] Archiving <https://builds.apache.org/job/Tobago%20Trunk%20(deploy)/ws/tobago-tool/tobago-tool-annotation/target/tobago-tool-annotation-4.2.2-SNAPSHOT-javadoc.jar>
to org.apache.myfaces.tobago/tobago-tool-annotation/4.2.2-20180530.125859-21/tobago-tool-annotation-4.2.2-20180530.125859-21-javadoc.jar
[JENKINS] Archiving <https://builds.apache.org/job/Tobago%20Trunk%20(deploy)/ws/tobago-tool/tobago-tool-annotation/target/tobago-tool-annotation-4.2.2-SNAPSHOT-sources.jar>
to org.apache.myfaces.tobago/tobago-tool-annotation/4.2.2-20180530.125859-21/tobago-tool-annotation-4.2.2-20180530.125859-21-sources.jar
[JENKINS] Archiving <https://builds.apache.org/job/Tobago%20Trunk%20(deploy)/ws/tobago-example/pom.xml>
to org.apache.myfaces.tobago/tobago-example/4.2.2-SNAPSHOT/tobago-example-4.2.2-SNAPSHOT.pom
[JENKINS] Archiving <https://builds.apache.org/job/Tobago%20Trunk%20(deploy)/ws/tobago-tool/pom.xml>
to org.apache.myfaces.tobago/tobago-tool/4.2.2-SNAPSHOT/tobago-tool-4.2.2-SNAPSHOT.pom
[JENKINS] Archiving <https://builds.apache.org/job/Tobago%20Trunk%20(deploy)/ws/tobago-core/pom.xml>
to org.apache.myfaces.tobago/tobago-core/4.2.2-SNAPSHOT/tobago-core-4.2.2-SNAPSHOT.pom
[JENKINS] Archiving <https://builds.apache.org/job/Tobago%20Trunk%20(deploy)/ws/tobago-core/target/tobago-core-4.2.2-SNAPSHOT.jar>
to org.apache.myfaces.tobago/tobago-core/4.2.2-20180530.130157-21/tobago-core-4.2.2-20180530.130157-21.jar
[JENKINS] Archiving <https://builds.apache.org/job/Tobago%20Trunk%20(deploy)/ws/tobago-core/target/tobago-core-4.2.2-SNAPSHOT-javadoc.jar>
to org.apache.myfaces.tobago/tobago-core/4.2.2-20180530.130157-21/tobago-core-4.2.2-20180530.130157-21-javadoc.jar
[JENKINS] Archiving <https://builds.apache.org/job/Tobago%20Trunk%20(deploy)/ws/tobago-core/target/tobago-core-4.2.2-SNAPSHOT-tests.jar>
to org.apache.myfaces.tobago/tobago-core/4.2.2-20180530.130157-21/tobago-core-4.2.2-20180530.130157-21-tests.jar
[JENKINS] Archiving <https://builds.apache.org/job/Tobago%20Trunk%20(deploy)/ws/tobago-core/target/tobago-core-4.2.2-SNAPSHOT-sources.jar>
to org.apache.myfaces.tobago/tobago-core/4.2.2-20180530.130157-21/tobago-core-4.2.2-20180530.130157-21-sources.jar
[JENKINS] Archiving <https://builds.apache.org/job/Tobago%20Trunk%20(deploy)/ws/tobago-core/target/tobago-core-4.2.2-SNAPSHOT-tlddoc.jar>
to org.apache.myfaces.tobago/tobago-core/4.2.2-20180530.130157-21/tobago-core-4.2.2-20180530.130157-21-tlddoc.jar
[JENKINS] Archiving <https://builds.apache.org/job/Tobago%20Trunk%20(deploy)/ws/tobago-tool/tobago-tool-apt/pom.xml>
to org.apache.myfaces.tobago/tobago-tool-apt/4.2.2-SNAPSHOT/tobago-tool-apt-4.2.2-SNAPSHOT.pom
[JENKINS] Archiving <https://builds.apache.org/job/Tobago%20Trunk%20(deploy)/ws/tobago-tool/tobago-tool-apt/target/tobago-tool-apt-4.2.2-SNAPSHOT.jar>
to org.apache.myfaces.tobago/tobago-tool-apt/4.2.2-20180530.130032-21/tobago-tool-apt-4.2.2-20180530.130032-21.jar
[JENKINS] Archiving <https://builds.apache.org/job/Tobago%20Trunk%20(deploy)/ws/tobago-tool/tobago-tool-apt/target/tobago-tool-apt-4.2.2-SNAPSHOT-javadoc.jar>
to org.apache.myfaces.tobago/tobago-tool-apt/4.2.2-20180530.130032-21/tobago-tool-apt-4.2.2-20180530.130032-21-javadoc.jar
[JENKINS] Archiving <https://builds.apache.org/job/Tobago%20Trunk%20(deploy)/ws/tobago-tool/tobago-tool-apt/target/tobago-tool-apt-4.2.2-SNAPSHOT-sources.jar>
to org.apache.myfaces.tobago/tobago-tool-apt/4.2.2-20180530.130032-21/tobago-tool-apt-4.2.2-20180530.130032-21-sources.jar
[JENKINS] Archiving <https://builds.apache.org/job/Tobago%20Trunk%20(deploy)/ws/tobago-theme/tobago-theme-charlotteville/pom.xml>
to org.apache.myfaces.tobago/tobago-theme-charlotteville/4.2.2-SNAPSHOT/tobago-theme-charlotteville-4.2.2-SNAPSHOT.pom
[JENKINS] Archiving <https://builds.apache.org/job/Tobago%20Trunk%20(deploy)/ws/tobago-theme/tobago-theme-charlotteville/target/tobago-theme-charlotteville-4.2.2-SNAPSHOT.jar>
to org.apache.myfaces.tobago/tobago-theme-charlotteville/4.2.2-20180530.130458-20/tobago-theme-charlotteville-4.2.2-20180530.130458-20.jar
[JENKINS] Archiving <https://builds.apache.org/job/Tobago%20Trunk%20(deploy)/ws/tobago-theme/tobago-theme-charlotteville/target/tobago-theme-charlotteville-4.2.2-SNAPSHOT-sources.jar>
to org.apache.myfaces.tobago/tobago-theme-charlotteville/4.2.2-20180530.130458-20/tobago-theme-charlotteville-4.2.2-20180530.130458-20-sources.jar
[Fast Archiver] Compressed 595.76 KB of artifacts by 43.0% relative to #753
[JENKINS] Archiving <https://builds.apache.org/job/Tobago%20Trunk%20(deploy)/ws/tobago-example/tobago-example-demo/pom.xml>
to org.apache.myfaces.tobago/tobago-example-demo/4.2.2-SNAPSHOT/tobago-example-demo-4.2.2-SNAPSHOT.pom
Sending e-mails to: commits@myfaces.apache.org
channel stopped

Mime
View raw message