myfaces-commits mailing list archives

Site index · List index
Message view « Date » · « Thread »
Top « Date » · « Thread »
From Apache Jenkins Server <jenk...@builds.apache.org>
Subject Build failed in Jenkins: Tobago Trunk #1439
Date Thu, 24 May 2018 17:21:59 GMT
See <https://builds.apache.org/job/Tobago%20Trunk/1439/display/redirect?page=changes>

Changes:

[hnoeth] QUnitTests reimplemented

------------------------------------------
[...truncated 250.49 KB...]
[INFO] Downloaded from central: https://repo.maven.apache.org/maven2/org/apache/deltaspike/modules/deltaspike-proxy-module-api/1.8.1/deltaspike-proxy-module-api-1.8.1.pom
(2.2 kB at 148 kB/s)
[INFO] Downloading from central: https://repo.maven.apache.org/maven2/org/apache/deltaspike/modules/proxy-module-project/1.8.1/proxy-module-project-1.8.1.pom
[INFO] Downloaded from central: https://repo.maven.apache.org/maven2/org/apache/deltaspike/modules/proxy-module-project/1.8.1/proxy-module-project-1.8.1.pom
(1.6 kB at 113 kB/s)
[INFO] Downloading from central: https://repo.maven.apache.org/maven2/org/apache/deltaspike/modules/deltaspike-proxy-module-impl-asm5/1.8.1/deltaspike-proxy-module-impl-asm5-1.8.1.pom
[INFO] Downloaded from central: https://repo.maven.apache.org/maven2/org/apache/deltaspike/modules/deltaspike-proxy-module-impl-asm5/1.8.1/deltaspike-proxy-module-impl-asm5-1.8.1.pom
(5.0 kB at 336 kB/s)
[INFO] Downloading from central: https://repo.maven.apache.org/maven2/org/hibernate/hibernate-validator/4.3.2.Final/hibernate-validator-4.3.2.Final.pom
[INFO] Downloaded from central: https://repo.maven.apache.org/maven2/org/hibernate/hibernate-validator/4.3.2.Final/hibernate-validator-4.3.2.Final.pom
(12 kB at 885 kB/s)
[INFO] Downloading from central: https://repo.maven.apache.org/maven2/org/hibernate/hibernate-validator-parent/4.3.2.Final/hibernate-validator-parent-4.3.2.Final.pom
[INFO] Downloaded from central: https://repo.maven.apache.org/maven2/org/hibernate/hibernate-validator-parent/4.3.2.Final/hibernate-validator-parent-4.3.2.Final.pom
(21 kB at 1.3 MB/s)
[INFO] Downloading from central: https://repo.maven.apache.org/maven2/org/apache/httpcomponents/httpcore/4.4.8/httpcore-4.4.8.pom
[INFO] Downloaded from central: https://repo.maven.apache.org/maven2/org/apache/httpcomponents/httpcore/4.4.8/httpcore-4.4.8.pom
(5.1 kB at 391 kB/s)
[INFO] Downloading from central: https://repo.maven.apache.org/maven2/org/apache/httpcomponents/httpcomponents-core/4.4.8/httpcomponents-core-4.4.8.pom
[INFO] Downloaded from central: https://repo.maven.apache.org/maven2/org/apache/httpcomponents/httpcomponents-core/4.4.8/httpcomponents-core-4.4.8.pom
(13 kB at 963 kB/s)
[INFO] Downloading from central: https://repo.maven.apache.org/maven2/org/seleniumhq/selenium/selenium-java/3.12.0/selenium-java-3.12.0.pom
[INFO] Downloaded from central: https://repo.maven.apache.org/maven2/org/seleniumhq/selenium/selenium-java/3.12.0/selenium-java-3.12.0.pom
(6.3 kB at 420 kB/s)
[INFO] Downloading from central: https://repo.maven.apache.org/maven2/org/seleniumhq/selenium/selenium-api/3.12.0/selenium-api-3.12.0.pom
[INFO] Downloaded from central: https://repo.maven.apache.org/maven2/org/seleniumhq/selenium/selenium-api/3.12.0/selenium-api-3.12.0.pom
(2.6 kB at 203 kB/s)
[INFO] Downloading from central: https://repo.maven.apache.org/maven2/org/seleniumhq/selenium/selenium-chrome-driver/3.12.0/selenium-chrome-driver-3.12.0.pom
[INFO] Downloaded from central: https://repo.maven.apache.org/maven2/org/seleniumhq/selenium/selenium-chrome-driver/3.12.0/selenium-chrome-driver-3.12.0.pom
(4.9 kB at 378 kB/s)
[INFO] Downloading from central: https://repo.maven.apache.org/maven2/org/seleniumhq/selenium/selenium-remote-driver/3.12.0/selenium-remote-driver-3.12.0.pom
[INFO] Downloaded from central: https://repo.maven.apache.org/maven2/org/seleniumhq/selenium/selenium-remote-driver/3.12.0/selenium-remote-driver-3.12.0.pom
(4.7 kB at 362 kB/s)
[INFO] Downloading from central: https://repo.maven.apache.org/maven2/net/bytebuddy/byte-buddy/1.8.3/byte-buddy-1.8.3.pom
[INFO] Downloaded from central: https://repo.maven.apache.org/maven2/net/bytebuddy/byte-buddy/1.8.3/byte-buddy-1.8.3.pom
(12 kB at 837 kB/s)
[INFO] Downloading from central: https://repo.maven.apache.org/maven2/net/bytebuddy/byte-buddy-parent/1.8.3/byte-buddy-parent-1.8.3.pom
[INFO] Downloaded from central: https://repo.maven.apache.org/maven2/net/bytebuddy/byte-buddy-parent/1.8.3/byte-buddy-parent-1.8.3.pom
(26 kB at 1.7 MB/s)
[INFO] Downloading from central: https://repo.maven.apache.org/maven2/com/google/guava/guava/23.0/guava-23.0.pom
[INFO] Downloaded from central: https://repo.maven.apache.org/maven2/com/google/guava/guava/23.0/guava-23.0.pom
(5.6 kB at 399 kB/s)
[INFO] Downloading from central: https://repo.maven.apache.org/maven2/com/google/guava/guava-parent/23.0/guava-parent-23.0.pom
[INFO] Downloaded from central: https://repo.maven.apache.org/maven2/com/google/guava/guava-parent/23.0/guava-parent-23.0.pom
(9.3 kB at 667 kB/s)
[INFO] Downloading from central: https://repo.maven.apache.org/maven2/com/google/errorprone/error_prone_annotations/2.0.18/error_prone_annotations-2.0.18.pom
[INFO] Downloaded from central: https://repo.maven.apache.org/maven2/com/google/errorprone/error_prone_annotations/2.0.18/error_prone_annotations-2.0.18.pom
(1.6 kB at 136 kB/s)
[INFO] Downloading from central: https://repo.maven.apache.org/maven2/com/google/errorprone/error_prone_parent/2.0.18/error_prone_parent-2.0.18.pom
[INFO] Downloaded from central: https://repo.maven.apache.org/maven2/com/google/errorprone/error_prone_parent/2.0.18/error_prone_parent-2.0.18.pom
(5.0 kB at 419 kB/s)
[INFO] Downloading from central: https://repo.maven.apache.org/maven2/com/google/j2objc/j2objc-annotations/1.1/j2objc-annotations-1.1.pom
[INFO] Downloaded from central: https://repo.maven.apache.org/maven2/com/google/j2objc/j2objc-annotations/1.1/j2objc-annotations-1.1.pom
(2.8 kB at 230 kB/s)
[INFO] Downloading from central: https://repo.maven.apache.org/maven2/org/codehaus/mojo/animal-sniffer-annotations/1.14/animal-sniffer-annotations-1.14.pom
[INFO] Downloaded from central: https://repo.maven.apache.org/maven2/org/codehaus/mojo/animal-sniffer-annotations/1.14/animal-sniffer-annotations-1.14.pom
(2.5 kB at 231 kB/s)
[INFO] Downloading from central: https://repo.maven.apache.org/maven2/com/squareup/okhttp3/okhttp/3.9.1/okhttp-3.9.1.pom
[INFO] Downloaded from central: https://repo.maven.apache.org/maven2/com/squareup/okhttp3/okhttp/3.9.1/okhttp-3.9.1.pom
(1.7 kB at 130 kB/s)
[INFO] Downloading from central: https://repo.maven.apache.org/maven2/com/squareup/okhttp3/parent/3.9.1/parent-3.9.1.pom
[INFO] Downloaded from central: https://repo.maven.apache.org/maven2/com/squareup/okhttp3/parent/3.9.1/parent-3.9.1.pom
(18 kB at 1.3 MB/s)
[INFO] Downloading from central: https://repo.maven.apache.org/maven2/org/seleniumhq/selenium/selenium-edge-driver/3.12.0/selenium-edge-driver-3.12.0.pom
[INFO] Downloaded from central: https://repo.maven.apache.org/maven2/org/seleniumhq/selenium/selenium-edge-driver/3.12.0/selenium-edge-driver-3.12.0.pom
(4.9 kB at 378 kB/s)
[INFO] Downloading from central: https://repo.maven.apache.org/maven2/org/seleniumhq/selenium/selenium-firefox-driver/3.12.0/selenium-firefox-driver-3.12.0.pom
[INFO] Downloaded from central: https://repo.maven.apache.org/maven2/org/seleniumhq/selenium/selenium-firefox-driver/3.12.0/selenium-firefox-driver-3.12.0.pom
(4.9 kB at 378 kB/s)
[INFO] Downloading from central: https://repo.maven.apache.org/maven2/org/seleniumhq/selenium/selenium-ie-driver/3.12.0/selenium-ie-driver-3.12.0.pom
[INFO] Downloaded from central: https://repo.maven.apache.org/maven2/org/seleniumhq/selenium/selenium-ie-driver/3.12.0/selenium-ie-driver-3.12.0.pom
(4.9 kB at 350 kB/s)
[INFO] Downloading from central: https://repo.maven.apache.org/maven2/org/seleniumhq/selenium/selenium-opera-driver/3.12.0/selenium-opera-driver-3.12.0.pom
[INFO] Downloaded from central: https://repo.maven.apache.org/maven2/org/seleniumhq/selenium/selenium-opera-driver/3.12.0/selenium-opera-driver-3.12.0.pom
(4.9 kB at 378 kB/s)
[INFO] Downloading from central: https://repo.maven.apache.org/maven2/org/seleniumhq/selenium/selenium-safari-driver/3.12.0/selenium-safari-driver-3.12.0.pom
[INFO] Downloaded from central: https://repo.maven.apache.org/maven2/org/seleniumhq/selenium/selenium-safari-driver/3.12.0/selenium-safari-driver-3.12.0.pom
(4.9 kB at 378 kB/s)
[INFO] Downloading from central: https://repo.maven.apache.org/maven2/org/seleniumhq/selenium/selenium-support/3.12.0/selenium-support-3.12.0.pom
[INFO] Downloaded from central: https://repo.maven.apache.org/maven2/org/seleniumhq/selenium/selenium-support/3.12.0/selenium-support-3.12.0.pom
(4.9 kB at 408 kB/s)
[INFO] Downloading from central: https://repo.maven.apache.org/maven2/org/apache/geronimo/specs/geronimo-jcdi_2.0_spec/1.0/geronimo-jcdi_2.0_spec-1.0.pom
[INFO] Downloaded from central: https://repo.maven.apache.org/maven2/org/apache/geronimo/specs/geronimo-jcdi_2.0_spec/1.0/geronimo-jcdi_2.0_spec-1.0.pom
(5.3 kB at 380 kB/s)
[INFO] Downloading from central: https://repo.maven.apache.org/maven2/org/apache/geronimo/genesis/genesis-java8-flava/2.3/genesis-java8-flava-2.3.pom
[INFO] Downloaded from central: https://repo.maven.apache.org/maven2/org/apache/geronimo/genesis/genesis-java8-flava/2.3/genesis-java8-flava-2.3.pom
(5.5 kB at 366 kB/s)
[INFO] Downloading from central: https://repo.maven.apache.org/maven2/org/apache/geronimo/genesis/genesis-default-flava/2.3/genesis-default-flava-2.3.pom
[INFO] Downloaded from central: https://repo.maven.apache.org/maven2/org/apache/geronimo/genesis/genesis-default-flava/2.3/genesis-default-flava-2.3.pom
(15 kB at 1.1 MB/s)
[INFO] Downloading from central: https://repo.maven.apache.org/maven2/org/apache/geronimo/genesis/genesis/2.3/genesis-2.3.pom
[INFO] Downloaded from central: https://repo.maven.apache.org/maven2/org/apache/geronimo/genesis/genesis/2.3/genesis-2.3.pom
(16 kB at 1.1 MB/s)
[INFO] Downloading from central: https://repo.maven.apache.org/maven2/org/apache/geronimo/specs/geronimo-interceptor_1.2_spec/1.0/geronimo-interceptor_1.2_spec-1.0.pom
[INFO] Downloaded from central: https://repo.maven.apache.org/maven2/org/apache/geronimo/specs/geronimo-interceptor_1.2_spec/1.0/geronimo-interceptor_1.2_spec-1.0.pom
(0 B at 0 B/s)
[INFO] Downloading from central: https://repo.maven.apache.org/maven2/org/apache/openwebbeans/openwebbeans-jsf/2.0.4/openwebbeans-jsf-2.0.4.pom
[INFO] Downloaded from central: https://repo.maven.apache.org/maven2/org/apache/openwebbeans/openwebbeans-jsf/2.0.4/openwebbeans-jsf-2.0.4.pom
(3.7 kB at 154 kB/s)
[INFO] Downloading from central: https://repo.maven.apache.org/maven2/org/apache/openwebbeans/openwebbeans/2.0.4/openwebbeans-2.0.4.pom
[INFO] Downloaded from central: https://repo.maven.apache.org/maven2/org/apache/openwebbeans/openwebbeans/2.0.4/openwebbeans-2.0.4.pom
(33 kB at 1.8 MB/s)
[INFO] Downloading from central: https://repo.maven.apache.org/maven2/org/apache/openwebbeans/openwebbeans-impl/2.0.4/openwebbeans-impl-2.0.4.pom
[INFO] Downloaded from central: https://repo.maven.apache.org/maven2/org/apache/openwebbeans/openwebbeans-impl/2.0.4/openwebbeans-impl-2.0.4.pom
(7.0 kB at 497 kB/s)
[INFO] Downloading from central: https://repo.maven.apache.org/maven2/org/apache/xbean/xbean-finder-shaded/4.6/xbean-finder-shaded-4.6.pom
[INFO] Downloaded from central: https://repo.maven.apache.org/maven2/org/apache/xbean/xbean-finder-shaded/4.6/xbean-finder-shaded-4.6.pom
(4.9 kB at 352 kB/s)
[INFO] Downloading from central: https://repo.maven.apache.org/maven2/org/apache/xbean/xbean/4.6/xbean-4.6.pom
[INFO] Downloaded from central: https://repo.maven.apache.org/maven2/org/apache/xbean/xbean/4.6/xbean-4.6.pom
(18 kB at 1.2 MB/s)
[INFO] Downloading from central: https://repo.maven.apache.org/maven2/org/apache/xbean/xbean-asm6-shaded/4.6/xbean-asm6-shaded-4.6.pom
[INFO] Downloaded from central: https://repo.maven.apache.org/maven2/org/apache/xbean/xbean-asm6-shaded/4.6/xbean-asm6-shaded-4.6.pom
(4.1 kB at 317 kB/s)
[INFO] Downloading from central: https://repo.maven.apache.org/maven2/org/apache/openwebbeans/openwebbeans-spi/2.0.4/openwebbeans-spi-2.0.4.pom
[INFO] Downloaded from central: https://repo.maven.apache.org/maven2/org/apache/openwebbeans/openwebbeans-spi/2.0.4/openwebbeans-spi-2.0.4.pom
(2.9 kB at 221 kB/s)
[INFO] Downloading from central: https://repo.maven.apache.org/maven2/org/apache/openwebbeans/openwebbeans-web/2.0.4/openwebbeans-web-2.0.4.pom
[INFO] Downloaded from central: https://repo.maven.apache.org/maven2/org/apache/openwebbeans/openwebbeans-web/2.0.4/openwebbeans-web-2.0.4.pom
(6.6 kB at 506 kB/s)
[INFO] Downloading from central: https://repo.maven.apache.org/maven2/org/apache/openwebbeans/openwebbeans-el22/2.0.4/openwebbeans-el22-2.0.4.pom
[INFO] Downloaded from central: https://repo.maven.apache.org/maven2/org/apache/openwebbeans/openwebbeans-el22/2.0.4/openwebbeans-el22-2.0.4.pom
(3.6 kB at 241 kB/s)
[INFO] Downloading from central: https://repo.maven.apache.org/maven2/org/apache/openwebbeans/openwebbeans-resource/2.0.4/openwebbeans-resource-2.0.4.pom
[INFO] Downloaded from central: https://repo.maven.apache.org/maven2/org/apache/openwebbeans/openwebbeans-resource/2.0.4/openwebbeans-resource-2.0.4.pom
(2.5 kB at 166 kB/s)
[INFO] Downloading from Nexus: http://repository.apache.org/snapshots/org/apache/myfaces/tobago/tobago-example-data/4.2.2-SNAPSHOT/tobago-example-data-4.2.2-20180516.140222-7.jar
[INFO] Downloaded from Nexus: http://repository.apache.org/snapshots/org/apache/myfaces/tobago/tobago-example-data/4.2.2-SNAPSHOT/tobago-example-data-4.2.2-20180516.140222-7.jar
(77 kB at 182 kB/s)
[INFO] Downloading from central: https://repo.maven.apache.org/maven2/org/apache/deltaspike/modules/deltaspike-jsf-module-impl/1.8.1/deltaspike-jsf-module-impl-1.8.1.jar
[INFO] Downloading from central: https://repo.maven.apache.org/maven2/org/apache/deltaspike/core/deltaspike-core-api/1.8.1/deltaspike-core-api-1.8.1.jar
[INFO] Downloading from central: https://repo.maven.apache.org/maven2/org/apache/deltaspike/core/deltaspike-core-impl/1.8.1/deltaspike-core-impl-1.8.1.jar
[INFO] Downloading from central: https://repo.maven.apache.org/maven2/org/apache/deltaspike/modules/deltaspike-security-module-api/1.8.1/deltaspike-security-module-api-1.8.1.jar
[INFO] Downloading from central: https://repo.maven.apache.org/maven2/org/apache/deltaspike/modules/deltaspike-security-module-impl/1.8.1/deltaspike-security-module-impl-1.8.1.jar
[INFO] Downloaded from central: https://repo.maven.apache.org/maven2/org/apache/deltaspike/modules/deltaspike-security-module-api/1.8.1/deltaspike-security-module-api-1.8.1.jar
(23 kB at 1.2 MB/s)
[INFO] Downloading from central: https://repo.maven.apache.org/maven2/org/apache/deltaspike/modules/deltaspike-jsf-module-api/1.8.1/deltaspike-jsf-module-api-1.8.1.jar
[INFO] Downloaded from central: https://repo.maven.apache.org/maven2/org/apache/deltaspike/modules/deltaspike-security-module-impl/1.8.1/deltaspike-security-module-impl-1.8.1.jar
(41 kB at 1.7 MB/s)
[INFO] Downloading from central: https://repo.maven.apache.org/maven2/org/apache/deltaspike/modules/deltaspike-proxy-module-api/1.8.1/deltaspike-proxy-module-api-1.8.1.jar
[INFO] Downloaded from central: https://repo.maven.apache.org/maven2/org/apache/deltaspike/modules/deltaspike-jsf-module-impl/1.8.1/deltaspike-jsf-module-impl-1.8.1.jar
(200 kB at 6.1 MB/s)
[INFO] Downloading from central: https://repo.maven.apache.org/maven2/org/apache/deltaspike/modules/deltaspike-proxy-module-impl-asm5/1.8.1/deltaspike-proxy-module-impl-asm5-1.8.1.jar
[INFO] Downloaded from central: https://repo.maven.apache.org/maven2/org/apache/deltaspike/core/deltaspike-core-impl/1.8.1/deltaspike-core-impl-1.8.1.jar
(184 kB at 5.6 MB/s)
[INFO] Downloading from central: https://repo.maven.apache.org/maven2/org/hibernate/hibernate-validator/4.3.2.Final/hibernate-validator-4.3.2.Final.jar
[INFO] Downloaded from central: https://repo.maven.apache.org/maven2/org/apache/deltaspike/core/deltaspike-core-api/1.8.1/deltaspike-core-api-1.8.1.jar
(261 kB at 7.1 MB/s)
[INFO] Downloading from central: https://repo.maven.apache.org/maven2/org/apache/httpcomponents/httpcore/4.4.8/httpcore-4.4.8.jar
[INFO] Downloaded from central: https://repo.maven.apache.org/maven2/org/apache/deltaspike/modules/deltaspike-jsf-module-api/1.8.1/deltaspike-jsf-module-api-1.8.1.jar
(47 kB at 1.2 MB/s)
[INFO] Downloading from central: https://repo.maven.apache.org/maven2/org/seleniumhq/selenium/selenium-java/3.12.0/selenium-java-3.12.0.jar
[INFO] Downloaded from central: https://repo.maven.apache.org/maven2/org/apache/deltaspike/modules/deltaspike-proxy-module-api/1.8.1/deltaspike-proxy-module-api-1.8.1.jar
(30 kB at 746 kB/s)
[INFO] Downloading from central: https://repo.maven.apache.org/maven2/org/seleniumhq/selenium/selenium-api/3.12.0/selenium-api-3.12.0.jar
[INFO] Downloaded from central: https://repo.maven.apache.org/maven2/org/seleniumhq/selenium/selenium-java/3.12.0/selenium-java-3.12.0.jar
(293 B at 6.0 kB/s)
[INFO] Downloading from central: https://repo.maven.apache.org/maven2/org/seleniumhq/selenium/selenium-chrome-driver/3.12.0/selenium-chrome-driver-3.12.0.jar
[INFO] Downloaded from central: https://repo.maven.apache.org/maven2/org/apache/deltaspike/modules/deltaspike-proxy-module-impl-asm5/1.8.1/deltaspike-proxy-module-impl-asm5-1.8.1.jar
(150 kB at 2.8 MB/s)
[INFO] Downloading from central: https://repo.maven.apache.org/maven2/org/seleniumhq/selenium/selenium-edge-driver/3.12.0/selenium-edge-driver-3.12.0.jar
[INFO] Downloaded from central: https://repo.maven.apache.org/maven2/org/seleniumhq/selenium/selenium-chrome-driver/3.12.0/selenium-chrome-driver-3.12.0.jar
(11 kB at 180 kB/s)
[INFO] Downloading from central: https://repo.maven.apache.org/maven2/org/seleniumhq/selenium/selenium-firefox-driver/3.12.0/selenium-firefox-driver-3.12.0.jar
[INFO] Downloaded from central: https://repo.maven.apache.org/maven2/org/seleniumhq/selenium/selenium-api/3.12.0/selenium-api-3.12.0.jar
(115 kB at 1.8 MB/s)
[INFO] Downloading from central: https://repo.maven.apache.org/maven2/org/seleniumhq/selenium/selenium-ie-driver/3.12.0/selenium-ie-driver-3.12.0.jar
[INFO] Downloaded from central: https://repo.maven.apache.org/maven2/org/apache/httpcomponents/httpcore/4.4.8/httpcore-4.4.8.jar
(325 kB at 5.0 MB/s)
[INFO] Downloading from central: https://repo.maven.apache.org/maven2/org/seleniumhq/selenium/selenium-opera-driver/3.12.0/selenium-opera-driver-3.12.0.jar
[INFO] Downloaded from central: https://repo.maven.apache.org/maven2/org/seleniumhq/selenium/selenium-edge-driver/3.12.0/selenium-edge-driver-3.12.0.jar
(5.6 kB at 86 kB/s)
[INFO] Downloading from central: https://repo.maven.apache.org/maven2/org/seleniumhq/selenium/selenium-remote-driver/3.12.0/selenium-remote-driver-3.12.0.jar
[INFO] Downloaded from central: https://repo.maven.apache.org/maven2/org/seleniumhq/selenium/selenium-ie-driver/3.12.0/selenium-ie-driver-3.12.0.jar
(15 kB at 197 kB/s)
[INFO] Downloading from central: https://repo.maven.apache.org/maven2/org/seleniumhq/selenium/selenium-safari-driver/3.12.0/selenium-safari-driver-3.12.0.jar
[INFO] Downloaded from central: https://repo.maven.apache.org/maven2/org/hibernate/hibernate-validator/4.3.2.Final/hibernate-validator-4.3.2.Final.jar
(485 kB at 5.9 MB/s)
[INFO] Downloading from central: https://repo.maven.apache.org/maven2/org/seleniumhq/selenium/selenium-support/3.12.0/selenium-support-3.12.0.jar
[INFO] Downloaded from central: https://repo.maven.apache.org/maven2/org/seleniumhq/selenium/selenium-opera-driver/3.12.0/selenium-opera-driver-3.12.0.jar
(8.3 kB at 100 kB/s)
[INFO] Downloading from central: https://repo.maven.apache.org/maven2/net/bytebuddy/byte-buddy/1.8.3/byte-buddy-1.8.3.jar
[INFO] Downloaded from central: https://repo.maven.apache.org/maven2/org/seleniumhq/selenium/selenium-safari-driver/3.12.0/selenium-safari-driver-3.12.0.jar
(8.6 kB at 96 kB/s)
[INFO] Downloading from central: https://repo.maven.apache.org/maven2/com/google/guava/guava/23.0/guava-23.0.jar
[INFO] Downloaded from central: https://repo.maven.apache.org/maven2/org/seleniumhq/selenium/selenium-remote-driver/3.12.0/selenium-remote-driver-3.12.0.jar
(381 kB at 3.9 MB/s)
[INFO] Downloading from central: https://repo.maven.apache.org/maven2/com/google/errorprone/error_prone_annotations/2.0.18/error_prone_annotations-2.0.18.jar
[INFO] Downloaded from central: https://repo.maven.apache.org/maven2/com/google/errorprone/error_prone_annotations/2.0.18/error_prone_annotations-2.0.18.jar
(12 kB at 109 kB/s)
[INFO] Downloading from central: https://repo.maven.apache.org/maven2/com/google/j2objc/j2objc-annotations/1.1/j2objc-annotations-1.1.jar
[INFO] Downloaded from central: https://repo.maven.apache.org/maven2/org/seleniumhq/selenium/selenium-support/3.12.0/selenium-support-3.12.0.jar
(154 kB at 1.3 MB/s)
[INFO] Downloading from central: https://repo.maven.apache.org/maven2/org/codehaus/mojo/animal-sniffer-annotations/1.14/animal-sniffer-annotations-1.14.jar
[INFO] Downloaded from central: https://repo.maven.apache.org/maven2/com/google/j2objc/j2objc-annotations/1.1/j2objc-annotations-1.1.jar
(8.8 kB at 72 kB/s)
[INFO] Downloading from central: https://repo.maven.apache.org/maven2/com/squareup/okhttp3/okhttp/3.9.1/okhttp-3.9.1.jar
[INFO] Downloaded from central: https://repo.maven.apache.org/maven2/org/codehaus/mojo/animal-sniffer-annotations/1.14/animal-sniffer-annotations-1.14.jar
(3.5 kB at 28 kB/s)
[INFO] Downloading from central: https://repo.maven.apache.org/maven2/org/apache/geronimo/specs/geronimo-jcdi_2.0_spec/1.0/geronimo-jcdi_2.0_spec-1.0.jar
[INFO] Downloaded from central: https://repo.maven.apache.org/maven2/org/seleniumhq/selenium/selenium-firefox-driver/3.12.0/selenium-firefox-driver-3.12.0.jar
(802 kB at 6.0 MB/s)
[INFO] Downloading from central: https://repo.maven.apache.org/maven2/org/apache/geronimo/specs/geronimo-interceptor_1.2_spec/1.0/geronimo-interceptor_1.2_spec-1.0.jar
[INFO] Downloaded from central: https://repo.maven.apache.org/maven2/org/apache/geronimo/specs/geronimo-interceptor_1.2_spec/1.0/geronimo-interceptor_1.2_spec-1.0.jar
(0 B at 0 B/s)
[INFO] Downloading from central: https://repo.maven.apache.org/maven2/org/apache/openwebbeans/openwebbeans-jsf/2.0.4/openwebbeans-jsf-2.0.4.jar
[INFO] Downloaded from central: https://repo.maven.apache.org/maven2/org/apache/geronimo/specs/geronimo-jcdi_2.0_spec/1.0/geronimo-jcdi_2.0_spec-1.0.jar
(104 kB at 704 kB/s)
[INFO] Downloading from central: https://repo.maven.apache.org/maven2/org/apache/openwebbeans/openwebbeans-impl/2.0.4/openwebbeans-impl-2.0.4.jar
[INFO] Downloaded from central: https://repo.maven.apache.org/maven2/org/apache/openwebbeans/openwebbeans-jsf/2.0.4/openwebbeans-jsf-2.0.4.jar
(18 kB at 115 kB/s)
[INFO] Downloading from central: https://repo.maven.apache.org/maven2/org/apache/xbean/xbean-asm6-shaded/4.6/xbean-asm6-shaded-4.6.jar
[INFO] Downloaded from central: https://repo.maven.apache.org/maven2/com/squareup/okhttp3/okhttp/3.9.1/okhttp-3.9.1.jar
(406 kB at 2.6 MB/s)
[INFO] Downloading from central: https://repo.maven.apache.org/maven2/org/apache/openwebbeans/openwebbeans-spi/2.0.4/openwebbeans-spi-2.0.4.jar
[INFO] Downloaded from central: https://repo.maven.apache.org/maven2/org/apache/openwebbeans/openwebbeans-spi/2.0.4/openwebbeans-spi-2.0.4.jar
(22 kB at 128 kB/s)
[INFO] Downloading from central: https://repo.maven.apache.org/maven2/org/apache/openwebbeans/openwebbeans-web/2.0.4/openwebbeans-web-2.0.4.jar
[INFO] Downloaded from central: https://repo.maven.apache.org/maven2/org/apache/xbean/xbean-asm6-shaded/4.6/xbean-asm6-shaded-4.6.jar
(236 kB at 1.3 MB/s)
[INFO] Downloading from central: https://repo.maven.apache.org/maven2/org/apache/xbean/xbean-finder-shaded/4.6/xbean-finder-shaded-4.6.jar
[INFO] Downloaded from central: https://repo.maven.apache.org/maven2/org/apache/openwebbeans/openwebbeans-web/2.0.4/openwebbeans-web-2.0.4.jar
(43 kB at 231 kB/s)
[INFO] Downloading from central: https://repo.maven.apache.org/maven2/org/apache/openwebbeans/openwebbeans-el22/2.0.4/openwebbeans-el22-2.0.4.jar
[INFO] Downloaded from central: https://repo.maven.apache.org/maven2/org/apache/openwebbeans/openwebbeans-el22/2.0.4/openwebbeans-el22-2.0.4.jar
(16 kB at 79 kB/s)
[INFO] Downloading from central: https://repo.maven.apache.org/maven2/org/apache/openwebbeans/openwebbeans-resource/2.0.4/openwebbeans-resource-2.0.4.jar
[INFO] Downloaded from central: https://repo.maven.apache.org/maven2/org/apache/xbean/xbean-finder-shaded/4.6/xbean-finder-shaded-4.6.jar
(162 kB at 790 kB/s)
[INFO] Downloaded from central: https://repo.maven.apache.org/maven2/org/apache/openwebbeans/openwebbeans-impl/2.0.4/openwebbeans-impl-2.0.4.jar
(741 kB at 3.4 MB/s)
[INFO] Downloaded from central: https://repo.maven.apache.org/maven2/org/apache/openwebbeans/openwebbeans-resource/2.0.4/openwebbeans-resource-2.0.4.jar
(15 kB at 70 kB/s)
[INFO] Downloaded from central: https://repo.maven.apache.org/maven2/com/google/guava/guava/23.0/guava-23.0.jar
(2.6 MB at 11 MB/s)
[INFO] Downloaded from central: https://repo.maven.apache.org/maven2/net/bytebuddy/byte-buddy/1.8.3/byte-buddy-1.8.3.jar
(3.0 MB at 12 MB/s)
[INFO] 
[INFO] --- maven-clean-plugin:2.6.1:clean (default-clean) @ tobago-example-demo ---
[INFO] Deleting <https://builds.apache.org/job/Tobago%20Trunk/ws/tobago-example/tobago-example-demo/target>
[INFO] 
[INFO] --- animal-sniffer-maven-plugin:1.14:check (default-cli) @ tobago-example-demo ---
[INFO] Checking unresolved references to org.codehaus.mojo.signature:java18:1.0
[INFO] 
[INFO] --- maven-checkstyle-plugin:2.17:check (default-cli) @ tobago-example-demo ---
[INFO] Starting audit...
<https://builds.apache.org/job/Tobago%20Trunk/ws/tobago-example/tobago-example-demo/src/test/java/org/apache/myfaces/tobago/example/demo/qunit/SeleniumBase.java>:50:13:
error: Variable 'webDriver' must be private and have accessor methods.
<https://builds.apache.org/job/Tobago%20Trunk/ws/tobago-example/tobago-example-demo/src/test/java/org/apache/myfaces/tobago/example/demo/qunit/SeleniumBase.java>:63:19:
error: Variable 'serverPortWithContextPath' must be private and have accessor methods.
<https://builds.apache.org/job/Tobago%20Trunk/ws/tobago-example/tobago-example-demo/src/test/java/org/apache/myfaces/tobago/example/demo/qunit/SeleniumBase.java>:69:5:
error: switch without "default" clause.
<https://builds.apache.org/job/Tobago%20Trunk/ws/tobago-example/tobago-example-demo/src/test/java/org/apache/myfaces/tobago/example/demo/qunit/SeleniumBase.java>:90:
error: Line is longer than 120 characters (found 126).
Audit done.
[INFO] There are 4 errors reported by Checkstyle 6.11.2 with tobago/checkstyle.xml ruleset.
[ERROR] src/test/java/org/apache/myfaces/tobago/example/demo/qunit/SeleniumBase.java:[50,13]
(design) VisibilityModifier: Variable 'webDriver' must be private and have accessor methods.
[ERROR] src/test/java/org/apache/myfaces/tobago/example/demo/qunit/SeleniumBase.java:[63,19]
(design) VisibilityModifier: Variable 'serverPortWithContextPath' must be private and have
accessor methods.
[ERROR] src/test/java/org/apache/myfaces/tobago/example/demo/qunit/SeleniumBase.java:[69,5]
(coding) MissingSwitchDefault: switch without "default" clause.
[ERROR] src/test/java/org/apache/myfaces/tobago/example/demo/qunit/SeleniumBase.java:[90]
(sizes) LineLength: Line is longer than 120 characters (found 126).
[INFO] ------------------------------------------------------------------------
[INFO] Reactor Summary:
[INFO] 
[INFO] Apache Tobago ...................................... SUCCESS [ 10.698 s]
[INFO] Tobago Tool ........................................ SUCCESS [  3.563 s]
[INFO] Tobago Tool Annotation ............................. SUCCESS [  7.406 s]
[INFO] Tobago Tool Apt .................................... SUCCESS [01:05 min]
[INFO] Tobago Core ........................................ SUCCESS [ 22.613 s]
[INFO] Tobago Themes ...................................... SUCCESS [  3.506 s]
[INFO] Tobago Theme Standard .............................. SUCCESS [ 10.709 s]
[INFO] Tobago Theme Scarborough ........................... SUCCESS [  4.709 s]
[INFO] Tobago Theme Speyside .............................. SUCCESS [  4.852 s]
[INFO] Tobago Theme Roxborough ............................ SUCCESS [  4.610 s]
[INFO] Tobago Theme Charlotteville ........................ SUCCESS [  5.051 s]
[INFO] Tobago Examples .................................... SUCCESS [  4.105 s]
[INFO] Tobago Example Blank ............................... SUCCESS [  6.262 s]
[INFO] Tobago Example Demo ................................ FAILURE [  6.592 s]
[INFO] Tobago Example Assembly ............................ SKIPPED
[INFO] Tobago Assembly .................................... SKIPPED
[INFO] ------------------------------------------------------------------------
[INFO] BUILD FAILURE
[INFO] ------------------------------------------------------------------------
[INFO] Total time: 03:44 min
[INFO] Finished at: 2018-05-24T17:21:35Z
[INFO] Final Memory: 75M/836M
[INFO] ------------------------------------------------------------------------
Waiting for Jenkins to finish collecting data
[ERROR] Failed to execute goal org.apache.maven.plugins:maven-checkstyle-plugin:2.17:check
(default-cli) on project tobago-example-demo: You have 4 Checkstyle violations. -> [Help
1]
[ERROR] 
[ERROR] To see the full stack trace of the errors, re-run Maven with the -e switch.
[ERROR] Re-run Maven using the -X switch to enable full debug logging.
[ERROR] 
[ERROR] For more information about the errors and possible solutions, please read the following
articles:
[ERROR] [Help 1] http://cwiki.apache.org/confluence/display/MAVEN/MojoFailureException
[ERROR] 
[ERROR] After correcting the problems, you can resume the build with the command
[ERROR]   mvn <goals> -rf :tobago-example-demo
[JENKINS] Archiving <https://builds.apache.org/job/Tobago%20Trunk/ws/tobago-theme/pom.xml>
to org.apache.myfaces.tobago/tobago-theme/4.2.2-SNAPSHOT/tobago-theme-4.2.2-SNAPSHOT.pom
[JENKINS] Archiving <https://builds.apache.org/job/Tobago%20Trunk/ws/tobago-example/tobago-example-blank/pom.xml>
to org.apache.myfaces.tobago/tobago-example-blank/4.2.2-SNAPSHOT/tobago-example-blank-4.2.2-SNAPSHOT.pom
[JENKINS] Archiving <https://builds.apache.org/job/Tobago%20Trunk/ws/tobago-example/tobago-example-blank/target/tobago-example-blank.war>
to org.apache.myfaces.tobago/tobago-example-blank/4.2.2-SNAPSHOT/tobago-example-blank-4.2.2-SNAPSHOT.war
[Fast Archiver] Compressed 8.45 MB of artifacts by 49.9% relative to #1438
[JENKINS] Archiving <https://builds.apache.org/job/Tobago%20Trunk/ws/tobago-assembly/pom.xml>
to org.apache.myfaces.tobago/tobago-assembly/4.2.2-SNAPSHOT/tobago-assembly-4.2.2-SNAPSHOT.pom
[JENKINS] Archiving <https://builds.apache.org/job/Tobago%20Trunk/ws/pom.xml> to org.apache.myfaces.tobago/tobago/4.2.2-SNAPSHOT/tobago-4.2.2-SNAPSHOT.pom
[JENKINS] Archiving <https://builds.apache.org/job/Tobago%20Trunk/ws/target/tobago-4.2.2-SNAPSHOT-site.xml>
to org.apache.myfaces.tobago/tobago/4.2.2-SNAPSHOT/tobago-4.2.2-SNAPSHOT-site.xml
[JENKINS] Archiving <https://builds.apache.org/job/Tobago%20Trunk/ws/tobago-theme/tobago-theme-standard/pom.xml>
to org.apache.myfaces.tobago/tobago-theme-standard/4.2.2-SNAPSHOT/tobago-theme-standard-4.2.2-SNAPSHOT.pom
[JENKINS] Archiving <https://builds.apache.org/job/Tobago%20Trunk/ws/tobago-theme/tobago-theme-standard/target/tobago-theme-standard-4.2.2-SNAPSHOT.jar>
to org.apache.myfaces.tobago/tobago-theme-standard/4.2.2-SNAPSHOT/tobago-theme-standard-4.2.2-SNAPSHOT.jar
[Fast Archiver] Compressed 1.54 MB of artifacts by 44.7% relative to #1438
[JENKINS] Archiving <https://builds.apache.org/job/Tobago%20Trunk/ws/tobago-theme/tobago-theme-scarborough/pom.xml>
to org.apache.myfaces.tobago/tobago-theme-scarborough/4.2.2-SNAPSHOT/tobago-theme-scarborough-4.2.2-SNAPSHOT.pom
[JENKINS] Archiving <https://builds.apache.org/job/Tobago%20Trunk/ws/tobago-theme/tobago-theme-scarborough/target/tobago-theme-scarborough-4.2.2-SNAPSHOT.jar>
to org.apache.myfaces.tobago/tobago-theme-scarborough/4.2.2-SNAPSHOT/tobago-theme-scarborough-4.2.2-SNAPSHOT.jar
[Fast Archiver] Compressed 300.00 KB of artifacts by 42.7% relative to #1438
[JENKINS] Archiving <https://builds.apache.org/job/Tobago%20Trunk/ws/tobago-example/tobago-example-assembly/pom.xml>
to org.apache.myfaces.tobago/tobago-example-assembly/4.2.2-SNAPSHOT/tobago-example-assembly-4.2.2-SNAPSHOT.pom
[JENKINS] Archiving <https://builds.apache.org/job/Tobago%20Trunk/ws/tobago-theme/tobago-theme-speyside/pom.xml>
to org.apache.myfaces.tobago/tobago-theme-speyside/4.2.2-SNAPSHOT/tobago-theme-speyside-4.2.2-SNAPSHOT.pom
[JENKINS] Archiving <https://builds.apache.org/job/Tobago%20Trunk/ws/tobago-theme/tobago-theme-speyside/target/tobago-theme-speyside-4.2.2-SNAPSHOT.jar>
to org.apache.myfaces.tobago/tobago-theme-speyside/4.2.2-SNAPSHOT/tobago-theme-speyside-4.2.2-SNAPSHOT.jar
[Fast Archiver] Compressed 338.21 KB of artifacts by 47.3% relative to #1438
[JENKINS] Archiving <https://builds.apache.org/job/Tobago%20Trunk/ws/tobago-theme/tobago-theme-roxborough/pom.xml>
to org.apache.myfaces.tobago/tobago-theme-roxborough/4.2.2-SNAPSHOT/tobago-theme-roxborough-4.2.2-SNAPSHOT.pom
[JENKINS] Archiving <https://builds.apache.org/job/Tobago%20Trunk/ws/tobago-theme/tobago-theme-roxborough/target/tobago-theme-roxborough-4.2.2-SNAPSHOT.jar>
to org.apache.myfaces.tobago/tobago-theme-roxborough/4.2.2-SNAPSHOT/tobago-theme-roxborough-4.2.2-SNAPSHOT.jar
[Fast Archiver] Compressed 422.54 KB of artifacts by 30.3% relative to #1438
[JENKINS] Archiving <https://builds.apache.org/job/Tobago%20Trunk/ws/tobago-tool/tobago-tool-annotation/pom.xml>
to org.apache.myfaces.tobago/tobago-tool-annotation/4.2.2-SNAPSHOT/tobago-tool-annotation-4.2.2-SNAPSHOT.pom
[JENKINS] Archiving <https://builds.apache.org/job/Tobago%20Trunk/ws/tobago-tool/tobago-tool-annotation/target/tobago-tool-annotation-4.2.2-SNAPSHOT.jar>
to org.apache.myfaces.tobago/tobago-tool-annotation/4.2.2-SNAPSHOT/tobago-tool-annotation-4.2.2-SNAPSHOT.jar
[JENKINS] Archiving <https://builds.apache.org/job/Tobago%20Trunk/ws/tobago-example/pom.xml>
to org.apache.myfaces.tobago/tobago-example/4.2.2-SNAPSHOT/tobago-example-4.2.2-SNAPSHOT.pom
[JENKINS] Archiving <https://builds.apache.org/job/Tobago%20Trunk/ws/tobago-tool/pom.xml>
to org.apache.myfaces.tobago/tobago-tool/4.2.2-SNAPSHOT/tobago-tool-4.2.2-SNAPSHOT.pom
[JENKINS] Archiving <https://builds.apache.org/job/Tobago%20Trunk/ws/tobago-core/pom.xml>
to org.apache.myfaces.tobago/tobago-core/4.2.2-SNAPSHOT/tobago-core-4.2.2-SNAPSHOT.pom
[JENKINS] Archiving <https://builds.apache.org/job/Tobago%20Trunk/ws/tobago-core/target/tobago-core-4.2.2-SNAPSHOT.jar>
to org.apache.myfaces.tobago/tobago-core/4.2.2-SNAPSHOT/tobago-core-4.2.2-SNAPSHOT.jar
[JENKINS] Archiving <https://builds.apache.org/job/Tobago%20Trunk/ws/tobago-core/target/tobago-core-4.2.2-SNAPSHOT-tests.jar>
to org.apache.myfaces.tobago/tobago-core/4.2.2-SNAPSHOT/tobago-core-4.2.2-SNAPSHOT-tests.jar
[JENKINS] Archiving <https://builds.apache.org/job/Tobago%20Trunk/ws/tobago-core/target/tobago-core-4.2.2-SNAPSHOT-sources.jar>
to org.apache.myfaces.tobago/tobago-core/4.2.2-SNAPSHOT/tobago-core-4.2.2-SNAPSHOT-sources.jar
[JENKINS] Archiving <https://builds.apache.org/job/Tobago%20Trunk/ws/tobago-tool/tobago-tool-apt/pom.xml>
to org.apache.myfaces.tobago/tobago-tool-apt/4.2.2-SNAPSHOT/tobago-tool-apt-4.2.2-SNAPSHOT.pom
[JENKINS] Archiving <https://builds.apache.org/job/Tobago%20Trunk/ws/tobago-tool/tobago-tool-apt/target/tobago-tool-apt-4.2.2-SNAPSHOT.jar>
to org.apache.myfaces.tobago/tobago-tool-apt/4.2.2-SNAPSHOT/tobago-tool-apt-4.2.2-SNAPSHOT.jar
[JENKINS] Archiving <https://builds.apache.org/job/Tobago%20Trunk/ws/tobago-theme/tobago-theme-charlotteville/pom.xml>
to org.apache.myfaces.tobago/tobago-theme-charlotteville/4.2.2-SNAPSHOT/tobago-theme-charlotteville-4.2.2-SNAPSHOT.pom
[JENKINS] Archiving <https://builds.apache.org/job/Tobago%20Trunk/ws/tobago-theme/tobago-theme-charlotteville/target/tobago-theme-charlotteville-4.2.2-SNAPSHOT.jar>
to org.apache.myfaces.tobago/tobago-theme-charlotteville/4.2.2-SNAPSHOT/tobago-theme-charlotteville-4.2.2-SNAPSHOT.jar
[Fast Archiver] Compressed 298.89 KB of artifacts by 42.8% relative to #1438
[JENKINS] Archiving <https://builds.apache.org/job/Tobago%20Trunk/ws/tobago-example/tobago-example-demo/pom.xml>
to org.apache.myfaces.tobago/tobago-example-demo/4.2.2-SNAPSHOT/tobago-example-demo-4.2.2-SNAPSHOT.pom
Sending e-mails to: commits@myfaces.apache.org
channel stopped

Mime
View raw message