myfaces-commits mailing list archives

Site index · List index
Message view « Date » · « Thread »
Top « Date » · « Thread »
From Apache Jenkins Server <jenk...@builds.apache.org>
Subject Build failed in Jenkins: Tobago Trunk #1467
Date Fri, 22 Jun 2018 14:23:02 GMT
See <https://builds.apache.org/job/Tobago%20Trunk/1467/display/redirect?page=changes>

Changes:

[hnoeth] move from 4.2.2-SNAPSHOT to 4.3.0-SNAPSHOT

------------------------------------------
[...truncated 205.75 KB...]
[INFO] skip non existing resourceDirectory <https://builds.apache.org/job/Tobago%20Trunk/ws/tobago-theme/tobago-theme-charlotteville/src/test/resources>
[INFO] Copying 3 resources
[INFO] Copying 3 resources
[INFO] 
[INFO] --- maven-compiler-plugin:3.6.2:testCompile (default-testCompile) @ tobago-theme-charlotteville
---
[INFO] No sources to compile
[INFO] 
[INFO] --- maven-surefire-plugin:2.19.1:test (default-test) @ tobago-theme-charlotteville
---
[JENKINS] Recording test results
[INFO] 
[INFO] --- maven-jar-plugin:3.0.2:jar (default-jar) @ tobago-theme-charlotteville ---
[INFO] Building jar: <https://builds.apache.org/job/Tobago%20Trunk/ws/tobago-theme/tobago-theme-charlotteville/target/tobago-theme-charlotteville-4.3.0-SNAPSHOT.jar>
[INFO] 
[INFO] --- maven-site-plugin:3.6:attach-descriptor (attach-descriptor) @ tobago-theme-charlotteville
---
[INFO] Skipping because packaging 'jar' is not pom.
[INFO] 
[INFO] --- maven-install-plugin:2.5.2:install (default-install) @ tobago-theme-charlotteville
---
[INFO] Installing <https://builds.apache.org/job/Tobago%20Trunk/ws/tobago-theme/tobago-theme-charlotteville/target/tobago-theme-charlotteville-4.3.0-SNAPSHOT.jar>
to /home/jenkins/jenkins-slave/maven-repositories/1/org/apache/myfaces/tobago/tobago-theme-charlotteville/4.3.0-SNAPSHOT/tobago-theme-charlotteville-4.3.0-SNAPSHOT.jar
[INFO] Installing <https://builds.apache.org/job/Tobago%20Trunk/ws/tobago-theme/tobago-theme-charlotteville/pom.xml>
to /home/jenkins/jenkins-slave/maven-repositories/1/org/apache/myfaces/tobago/tobago-theme-charlotteville/4.3.0-SNAPSHOT/tobago-theme-charlotteville-4.3.0-SNAPSHOT.pom
[INFO] 
[INFO] ------------------------------------------------------------------------
[INFO] Building Tobago Examples 4.3.0-SNAPSHOT
[INFO] ------------------------------------------------------------------------
[INFO] 
[INFO] --- maven-clean-plugin:2.6.1:clean (default-clean) @ tobago-example ---
[INFO] 
[INFO] --- animal-sniffer-maven-plugin:1.14:check (default-cli) @ tobago-example ---
[INFO] Checking unresolved references to org.codehaus.mojo.signature:java18:1.0
[INFO] 
[INFO] --- maven-checkstyle-plugin:2.17:check (default-cli) @ tobago-example ---
[INFO] Starting audit...
Audit done.
[INFO] 
[INFO] --- maven-enforcer-plugin:3.0.0-M1:enforce (enforce-maven-version) @ tobago-example
---
[INFO] 
[INFO] --- maven-enforcer-plugin:3.0.0-M1:enforce (enforce) @ tobago-example ---
[INFO] 
[INFO] --- maven-remote-resources-plugin:1.5:process (default) @ tobago-example ---
[INFO] 
[INFO] --- maven-remote-resources-plugin:1.5:process (process-resource-bundles) @ tobago-example
---
[INFO] 
[INFO] --- maven-site-plugin:3.6:attach-descriptor (attach-descriptor) @ tobago-example ---
[INFO] No site descriptor found: nothing to attach.
[INFO] 
[INFO] --- maven-install-plugin:2.5.2:install (default-install) @ tobago-example ---
[INFO] Installing <https://builds.apache.org/job/Tobago%20Trunk/ws/tobago-example/pom.xml>
to /home/jenkins/jenkins-slave/maven-repositories/1/org/apache/myfaces/tobago/tobago-example/4.3.0-SNAPSHOT/tobago-example-4.3.0-SNAPSHOT.pom
[INFO] 
[INFO] ------------------------------------------------------------------------
[INFO] Building Tobago Example Blank 4.3.0-SNAPSHOT
[INFO] ------------------------------------------------------------------------
[INFO] 
[INFO] --- maven-clean-plugin:2.6.1:clean (default-clean) @ tobago-example-blank ---
[INFO] 
[INFO] --- animal-sniffer-maven-plugin:1.14:check (default-cli) @ tobago-example-blank ---
[INFO] Checking unresolved references to org.codehaus.mojo.signature:java18:1.0
[INFO] 
[INFO] --- maven-checkstyle-plugin:2.17:check (default-cli) @ tobago-example-blank ---
[INFO] Starting audit...
Audit done.
[INFO] 
[INFO] --- maven-enforcer-plugin:3.0.0-M1:enforce (enforce-maven-version) @ tobago-example-blank
---
[INFO] 
[INFO] --- maven-enforcer-plugin:3.0.0-M1:enforce (enforce) @ tobago-example-blank ---
[INFO] 
[INFO] --- maven-remote-resources-plugin:1.5:process (default) @ tobago-example-blank ---
[INFO] 
[INFO] --- maven-remote-resources-plugin:1.5:process (process-resource-bundles) @ tobago-example-blank
---
[INFO] 
[INFO] --- maven-resources-plugin:2.7:resources (default-resources) @ tobago-example-blank
---
[INFO] Using 'UTF-8' encoding to copy filtered resources.
[INFO] Copying 1 resource
[INFO] Copying 3 resources
[INFO] Copying 3 resources
[INFO] 
[INFO] --- maven-compiler-plugin:3.6.2:compile (default-compile) @ tobago-example-blank ---
[INFO] Compiling 1 source file to <https://builds.apache.org/job/Tobago%20Trunk/ws/tobago-example/tobago-example-blank/target/classes>
[INFO] 
[INFO] --- maven-resources-plugin:2.7:testResources (default-testResources) @ tobago-example-blank
---
[INFO] Using 'UTF-8' encoding to copy filtered resources.
[INFO] skip non existing resourceDirectory <https://builds.apache.org/job/Tobago%20Trunk/ws/tobago-example/tobago-example-blank/src/test/resources>
[INFO] Copying 3 resources
[INFO] Copying 3 resources
[INFO] 
[INFO] --- maven-compiler-plugin:3.6.2:testCompile (default-testCompile) @ tobago-example-blank
---
[INFO] No sources to compile
[INFO] 
[INFO] --- maven-surefire-plugin:2.19.1:test (default-test) @ tobago-example-blank ---
[JENKINS] Recording test results
[INFO] 
[INFO] --- maven-war-plugin:3.1.0:war (default-war) @ tobago-example-blank ---
[INFO] Packaging webapp
[INFO] Assembling webapp [tobago-example-blank] in [<https://builds.apache.org/job/Tobago%20Trunk/ws/tobago-example/tobago-example-blank/target/tobago-example-blank]>
[INFO] Processing war project
[INFO] Copying webapp resources [<https://builds.apache.org/job/Tobago%20Trunk/ws/tobago-example/tobago-example-blank/src/main/webapp]>
[INFO] Webapp assembled in [56 msecs]
[INFO] Building war: <https://builds.apache.org/job/Tobago%20Trunk/ws/tobago-example/tobago-example-blank/target/tobago-example-blank.war>
[INFO] 
[INFO] --- maven-site-plugin:3.6:attach-descriptor (attach-descriptor) @ tobago-example-blank
---
[INFO] Skipping because packaging 'war' is not pom.
[INFO] 
[INFO] --- maven-install-plugin:2.5.2:install (default-install) @ tobago-example-blank ---
[INFO] Installing <https://builds.apache.org/job/Tobago%20Trunk/ws/tobago-example/tobago-example-blank/target/tobago-example-blank.war>
to /home/jenkins/jenkins-slave/maven-repositories/1/org/apache/myfaces/tobago/tobago-example-blank/4.3.0-SNAPSHOT/tobago-example-blank-4.3.0-SNAPSHOT.war
[INFO] Installing <https://builds.apache.org/job/Tobago%20Trunk/ws/tobago-example/tobago-example-blank/pom.xml>
to /home/jenkins/jenkins-slave/maven-repositories/1/org/apache/myfaces/tobago/tobago-example-blank/4.3.0-SNAPSHOT/tobago-example-blank-4.3.0-SNAPSHOT.pom
[INFO] 
[INFO] ------------------------------------------------------------------------
[INFO] Building Tobago Example Demo 4.3.0-SNAPSHOT
[INFO] ------------------------------------------------------------------------
[INFO] Downloading from central: https://repo.maven.apache.org/maven2/org/seleniumhq/selenium/selenium-java/3.12.0/selenium-java-3.12.0.pom
[INFO] Downloaded from central: https://repo.maven.apache.org/maven2/org/seleniumhq/selenium/selenium-java/3.12.0/selenium-java-3.12.0.pom
(6.3 kB at 394 kB/s)
[INFO] Downloading from central: https://repo.maven.apache.org/maven2/org/seleniumhq/selenium/selenium-api/3.12.0/selenium-api-3.12.0.pom
[INFO] Downloaded from central: https://repo.maven.apache.org/maven2/org/seleniumhq/selenium/selenium-api/3.12.0/selenium-api-3.12.0.pom
(2.6 kB at 203 kB/s)
[INFO] Downloading from central: https://repo.maven.apache.org/maven2/org/seleniumhq/selenium/selenium-chrome-driver/3.12.0/selenium-chrome-driver-3.12.0.pom
[INFO] Downloaded from central: https://repo.maven.apache.org/maven2/org/seleniumhq/selenium/selenium-chrome-driver/3.12.0/selenium-chrome-driver-3.12.0.pom
(4.9 kB at 378 kB/s)
[INFO] Downloading from central: https://repo.maven.apache.org/maven2/org/seleniumhq/selenium/selenium-remote-driver/3.12.0/selenium-remote-driver-3.12.0.pom
[INFO] Downloaded from central: https://repo.maven.apache.org/maven2/org/seleniumhq/selenium/selenium-remote-driver/3.12.0/selenium-remote-driver-3.12.0.pom
(4.7 kB at 362 kB/s)
[INFO] Downloading from central: https://repo.maven.apache.org/maven2/com/google/guava/guava/25.1-jre/guava-25.1-jre.pom
[INFO] Downloaded from central: https://repo.maven.apache.org/maven2/com/google/guava/guava/25.1-jre/guava-25.1-jre.pom
(7.8 kB at 555 kB/s)
[INFO] Downloading from central: https://repo.maven.apache.org/maven2/com/google/guava/guava-parent/25.1-jre/guava-parent-25.1-jre.pom
[INFO] Downloaded from central: https://repo.maven.apache.org/maven2/com/google/guava/guava-parent/25.1-jre/guava-parent-25.1-jre.pom
(10 kB at 742 kB/s)
[INFO] Downloading from central: https://repo.maven.apache.org/maven2/org/checkerframework/checker-qual/2.0.0/checker-qual-2.0.0.pom
[INFO] Downloaded from central: https://repo.maven.apache.org/maven2/org/checkerframework/checker-qual/2.0.0/checker-qual-2.0.0.pom
(4.2 kB at 300 kB/s)
[INFO] Downloading from central: https://repo.maven.apache.org/maven2/com/squareup/okhttp3/okhttp/3.9.1/okhttp-3.9.1.pom
[INFO] Downloaded from central: https://repo.maven.apache.org/maven2/com/squareup/okhttp3/okhttp/3.9.1/okhttp-3.9.1.pom
(1.7 kB at 121 kB/s)
[INFO] Downloading from central: https://repo.maven.apache.org/maven2/com/squareup/okhttp3/parent/3.9.1/parent-3.9.1.pom
[INFO] Downloaded from central: https://repo.maven.apache.org/maven2/com/squareup/okhttp3/parent/3.9.1/parent-3.9.1.pom
(18 kB at 1.3 MB/s)
[INFO] Downloading from central: https://repo.maven.apache.org/maven2/org/seleniumhq/selenium/selenium-edge-driver/3.12.0/selenium-edge-driver-3.12.0.pom
[INFO] Downloaded from central: https://repo.maven.apache.org/maven2/org/seleniumhq/selenium/selenium-edge-driver/3.12.0/selenium-edge-driver-3.12.0.pom
(4.9 kB at 378 kB/s)
[INFO] Downloading from central: https://repo.maven.apache.org/maven2/org/seleniumhq/selenium/selenium-firefox-driver/3.12.0/selenium-firefox-driver-3.12.0.pom
[INFO] Downloaded from central: https://repo.maven.apache.org/maven2/org/seleniumhq/selenium/selenium-firefox-driver/3.12.0/selenium-firefox-driver-3.12.0.pom
(4.9 kB at 378 kB/s)
[INFO] Downloading from central: https://repo.maven.apache.org/maven2/org/seleniumhq/selenium/selenium-ie-driver/3.12.0/selenium-ie-driver-3.12.0.pom
[INFO] Downloaded from central: https://repo.maven.apache.org/maven2/org/seleniumhq/selenium/selenium-ie-driver/3.12.0/selenium-ie-driver-3.12.0.pom
(4.9 kB at 409 kB/s)
[INFO] Downloading from central: https://repo.maven.apache.org/maven2/org/seleniumhq/selenium/selenium-opera-driver/3.12.0/selenium-opera-driver-3.12.0.pom
[INFO] Downloaded from central: https://repo.maven.apache.org/maven2/org/seleniumhq/selenium/selenium-opera-driver/3.12.0/selenium-opera-driver-3.12.0.pom
(4.9 kB at 378 kB/s)
[INFO] Downloading from central: https://repo.maven.apache.org/maven2/org/seleniumhq/selenium/selenium-safari-driver/3.12.0/selenium-safari-driver-3.12.0.pom
[INFO] Downloaded from central: https://repo.maven.apache.org/maven2/org/seleniumhq/selenium/selenium-safari-driver/3.12.0/selenium-safari-driver-3.12.0.pom
(4.9 kB at 327 kB/s)
[INFO] Downloading from central: https://repo.maven.apache.org/maven2/org/seleniumhq/selenium/selenium-support/3.12.0/selenium-support-3.12.0.pom
[INFO] Downloaded from central: https://repo.maven.apache.org/maven2/org/seleniumhq/selenium/selenium-support/3.12.0/selenium-support-3.12.0.pom
(4.9 kB at 377 kB/s)
[INFO] Downloading from central: https://repo.maven.apache.org/maven2/org/seleniumhq/selenium/selenium-java/3.12.0/selenium-java-3.12.0.jar
[INFO] Downloading from central: https://repo.maven.apache.org/maven2/org/seleniumhq/selenium/selenium-api/3.12.0/selenium-api-3.12.0.jar
[INFO] Downloading from central: https://repo.maven.apache.org/maven2/org/seleniumhq/selenium/selenium-chrome-driver/3.12.0/selenium-chrome-driver-3.12.0.jar
[INFO] Downloading from central: https://repo.maven.apache.org/maven2/org/seleniumhq/selenium/selenium-edge-driver/3.12.0/selenium-edge-driver-3.12.0.jar
[INFO] Downloading from central: https://repo.maven.apache.org/maven2/org/seleniumhq/selenium/selenium-firefox-driver/3.12.0/selenium-firefox-driver-3.12.0.jar
[INFO] Downloaded from central: https://repo.maven.apache.org/maven2/org/seleniumhq/selenium/selenium-chrome-driver/3.12.0/selenium-chrome-driver-3.12.0.jar
(11 kB at 646 kB/s)
[INFO] Downloading from central: https://repo.maven.apache.org/maven2/org/seleniumhq/selenium/selenium-ie-driver/3.12.0/selenium-ie-driver-3.12.0.jar
[INFO] Downloaded from central: https://repo.maven.apache.org/maven2/org/seleniumhq/selenium/selenium-ie-driver/3.12.0/selenium-ie-driver-3.12.0.jar
(15 kB at 500 kB/s)
[INFO] Downloading from central: https://repo.maven.apache.org/maven2/org/seleniumhq/selenium/selenium-opera-driver/3.12.0/selenium-opera-driver-3.12.0.jar
[INFO] Downloaded from central: https://repo.maven.apache.org/maven2/org/seleniumhq/selenium/selenium-opera-driver/3.12.0/selenium-opera-driver-3.12.0.jar
(8.3 kB at 192 kB/s)
[INFO] Downloading from central: https://repo.maven.apache.org/maven2/org/seleniumhq/selenium/selenium-remote-driver/3.12.0/selenium-remote-driver-3.12.0.jar
[INFO] Downloaded from central: https://repo.maven.apache.org/maven2/org/seleniumhq/selenium/selenium-remote-driver/3.12.0/selenium-remote-driver-3.12.0.jar
(381 kB at 3.5 MB/s)
[INFO] Downloading from central: https://repo.maven.apache.org/maven2/org/seleniumhq/selenium/selenium-safari-driver/3.12.0/selenium-safari-driver-3.12.0.jar
[INFO] Downloaded from central: https://repo.maven.apache.org/maven2/org/seleniumhq/selenium/selenium-java/3.12.0/selenium-java-3.12.0.jar
(293 B at 2.5 kB/s)
[INFO] Downloading from central: https://repo.maven.apache.org/maven2/org/seleniumhq/selenium/selenium-support/3.12.0/selenium-support-3.12.0.jar
[INFO] Downloaded from central: https://repo.maven.apache.org/maven2/org/seleniumhq/selenium/selenium-edge-driver/3.12.0/selenium-edge-driver-3.12.0.jar
(5.6 kB at 47 kB/s)
[INFO] Downloading from central: https://repo.maven.apache.org/maven2/com/google/guava/guava/25.1-jre/guava-25.1-jre.jar
[INFO] Downloaded from central: https://repo.maven.apache.org/maven2/org/seleniumhq/selenium/selenium-safari-driver/3.12.0/selenium-safari-driver-3.12.0.jar
(8.6 kB at 70 kB/s)
[INFO] Downloading from central: https://repo.maven.apache.org/maven2/org/checkerframework/checker-qual/2.0.0/checker-qual-2.0.0.jar
[INFO] Downloaded from central: https://repo.maven.apache.org/maven2/org/seleniumhq/selenium/selenium-support/3.12.0/selenium-support-3.12.0.jar
(154 kB at 1.1 MB/s)
[INFO] Downloading from central: https://repo.maven.apache.org/maven2/com/squareup/okhttp3/okhttp/3.9.1/okhttp-3.9.1.jar
[INFO] Downloaded from central: https://repo.maven.apache.org/maven2/org/seleniumhq/selenium/selenium-api/3.12.0/selenium-api-3.12.0.jar
(115 kB at 821 kB/s)
[INFO] Downloaded from central: https://repo.maven.apache.org/maven2/com/squareup/okhttp3/okhttp/3.9.1/okhttp-3.9.1.jar
(406 kB at 2.4 MB/s)
[INFO] Downloaded from central: https://repo.maven.apache.org/maven2/org/checkerframework/checker-qual/2.0.0/checker-qual-2.0.0.jar
(343 kB at 1.8 MB/s)
[INFO] Downloaded from central: https://repo.maven.apache.org/maven2/org/seleniumhq/selenium/selenium-firefox-driver/3.12.0/selenium-firefox-driver-3.12.0.jar
(802 kB at 3.8 MB/s)
[INFO] Downloaded from central: https://repo.maven.apache.org/maven2/com/google/guava/guava/25.1-jre/guava-25.1-jre.jar
(2.7 MB at 8.7 MB/s)
[INFO] 
[INFO] --- maven-clean-plugin:2.6.1:clean (default-clean) @ tobago-example-demo ---
[INFO] 
[INFO] --- animal-sniffer-maven-plugin:1.14:check (default-cli) @ tobago-example-demo ---
[INFO] Checking unresolved references to org.codehaus.mojo.signature:java18:1.0
[INFO] 
[INFO] --- maven-checkstyle-plugin:2.17:check (default-cli) @ tobago-example-demo ---
[INFO] Starting audit...
<https://builds.apache.org/job/Tobago%20Trunk/ws/tobago-example/tobago-example-demo/src/main/java/org/apache/myfaces/tobago/example/demo/ApiController.java>:71:17:
error: Name 'getVersion4_3_0' must match pattern '^[a-z][a-zA-Z0-9]*$'.
Audit done.
[INFO] There is 1 error reported by Checkstyle 6.11.2 with tobago/checkstyle.xml ruleset.
[ERROR] src/main/java/org/apache/myfaces/tobago/example/demo/ApiController.java:[71,17] (naming)
MethodName: Name 'getVersion4_3_0' must match pattern '^[a-z][a-zA-Z0-9]*$'.
[INFO] ------------------------------------------------------------------------
[INFO] Reactor Summary:
[INFO] 
[INFO] Apache Tobago ...................................... SUCCESS [ 10.341 s]
[INFO] Tobago Tool ........................................ SUCCESS [  3.823 s]
[INFO] Tobago Tool Annotation ............................. SUCCESS [  8.501 s]
[INFO] Tobago Tool Apt .................................... SUCCESS [01:13 min]
[INFO] Tobago Core ........................................ SUCCESS [ 19.396 s]
[INFO] Tobago Themes ...................................... SUCCESS [  3.252 s]
[INFO] Tobago Theme Standard .............................. SUCCESS [ 10.778 s]
[INFO] Tobago Theme Scarborough ........................... SUCCESS [  5.226 s]
[INFO] Tobago Theme Speyside .............................. SUCCESS [  5.501 s]
[INFO] Tobago Theme Roxborough ............................ SUCCESS [  5.327 s]
[INFO] Tobago Theme Charlotteville ........................ SUCCESS [  5.533 s]
[INFO] Tobago Examples .................................... SUCCESS [  5.561 s]
[INFO] Tobago Example Blank ............................... SUCCESS [  8.129 s]
[INFO] Tobago Example Demo ................................ FAILURE [  4.765 s]
[INFO] Tobago Example Assembly ............................ SKIPPED
[INFO] Tobago Assembly .................................... SKIPPED
[INFO] ------------------------------------------------------------------------
[INFO] BUILD FAILURE
[INFO] ------------------------------------------------------------------------
[INFO] Total time: 04:13 min
[INFO] Finished at: 2018-06-22T14:22:28Z
[INFO] Final Memory: 73M/716M
[INFO] ------------------------------------------------------------------------
Waiting for Jenkins to finish collecting data
[ERROR] Failed to execute goal org.apache.maven.plugins:maven-checkstyle-plugin:2.17:check
(default-cli) on project tobago-example-demo: You have 1 Checkstyle violation. -> [Help
1]
[ERROR] 
[ERROR] To see the full stack trace of the errors, re-run Maven with the -e switch.
[ERROR] Re-run Maven using the -X switch to enable full debug logging.
[ERROR] 
[ERROR] For more information about the errors and possible solutions, please read the following
articles:
[ERROR] [Help 1] http://cwiki.apache.org/confluence/display/MAVEN/MojoFailureException
[ERROR] 
[ERROR] After correcting the problems, you can resume the build with the command
[ERROR]   mvn <goals> -rf :tobago-example-demo
[JENKINS] Archiving <https://builds.apache.org/job/Tobago%20Trunk/ws/tobago-theme/pom.xml>
to org.apache.myfaces.tobago/tobago-theme/4.3.0-SNAPSHOT/tobago-theme-4.3.0-SNAPSHOT.pom
[JENKINS] Archiving <https://builds.apache.org/job/Tobago%20Trunk/ws/tobago-example/tobago-example-blank/pom.xml>
to org.apache.myfaces.tobago/tobago-example-blank/4.3.0-SNAPSHOT/tobago-example-blank-4.3.0-SNAPSHOT.pom
[JENKINS] Archiving <https://builds.apache.org/job/Tobago%20Trunk/ws/tobago-example/tobago-example-blank/target/tobago-example-blank.war>
to org.apache.myfaces.tobago/tobago-example-blank/4.3.0-SNAPSHOT/tobago-example-blank-4.3.0-SNAPSHOT.war
[Fast Archiver] Compressed 8.49 MB of artifacts by 50.4% relative to #1466
[JENKINS] Archiving <https://builds.apache.org/job/Tobago%20Trunk/ws/tobago-assembly/pom.xml>
to org.apache.myfaces.tobago/tobago-assembly/4.3.0-SNAPSHOT/tobago-assembly-4.3.0-SNAPSHOT.pom
[JENKINS] Archiving <https://builds.apache.org/job/Tobago%20Trunk/ws/pom.xml> to org.apache.myfaces.tobago/tobago/4.3.0-SNAPSHOT/tobago-4.3.0-SNAPSHOT.pom
[JENKINS] Archiving <https://builds.apache.org/job/Tobago%20Trunk/ws/target/tobago-4.3.0-SNAPSHOT-site.xml>
to org.apache.myfaces.tobago/tobago/4.3.0-SNAPSHOT/tobago-4.3.0-SNAPSHOT-site.xml
[Fast Archiver] Compressed 52.99 KB of artifacts by 60.4% relative to #1466
[JENKINS] Archiving <https://builds.apache.org/job/Tobago%20Trunk/ws/tobago-theme/tobago-theme-standard/pom.xml>
to org.apache.myfaces.tobago/tobago-theme-standard/4.3.0-SNAPSHOT/tobago-theme-standard-4.3.0-SNAPSHOT.pom
[JENKINS] Archiving <https://builds.apache.org/job/Tobago%20Trunk/ws/tobago-theme/tobago-theme-standard/target/tobago-theme-standard-4.3.0-SNAPSHOT.jar>
to org.apache.myfaces.tobago/tobago-theme-standard/4.3.0-SNAPSHOT/tobago-theme-standard-4.3.0-SNAPSHOT.jar
[Fast Archiver] Compressed 1.55 MB of artifacts by 48.4% relative to #1466
[JENKINS] Archiving <https://builds.apache.org/job/Tobago%20Trunk/ws/tobago-theme/tobago-theme-scarborough/pom.xml>
to org.apache.myfaces.tobago/tobago-theme-scarborough/4.3.0-SNAPSHOT/tobago-theme-scarborough-4.3.0-SNAPSHOT.pom
[JENKINS] Archiving <https://builds.apache.org/job/Tobago%20Trunk/ws/tobago-theme/tobago-theme-scarborough/target/tobago-theme-scarborough-4.3.0-SNAPSHOT.jar>
to org.apache.myfaces.tobago/tobago-theme-scarborough/4.3.0-SNAPSHOT/tobago-theme-scarborough-4.3.0-SNAPSHOT.jar
[Fast Archiver] Compressed 308.12 KB of artifacts by 41.5% relative to #1466
[JENKINS] Archiving <https://builds.apache.org/job/Tobago%20Trunk/ws/tobago-example/tobago-example-assembly/pom.xml>
to org.apache.myfaces.tobago/tobago-example-assembly/4.3.0-SNAPSHOT/tobago-example-assembly-4.3.0-SNAPSHOT.pom
[JENKINS] Archiving <https://builds.apache.org/job/Tobago%20Trunk/ws/tobago-theme/tobago-theme-speyside/pom.xml>
to org.apache.myfaces.tobago/tobago-theme-speyside/4.3.0-SNAPSHOT/tobago-theme-speyside-4.3.0-SNAPSHOT.pom
[JENKINS] Archiving <https://builds.apache.org/job/Tobago%20Trunk/ws/tobago-theme/tobago-theme-speyside/target/tobago-theme-speyside-4.3.0-SNAPSHOT.jar>
to org.apache.myfaces.tobago/tobago-theme-speyside/4.3.0-SNAPSHOT/tobago-theme-speyside-4.3.0-SNAPSHOT.jar
[Fast Archiver] Compressed 346.59 KB of artifacts by 46.2% relative to #1466
[JENKINS] Archiving <https://builds.apache.org/job/Tobago%20Trunk/ws/tobago-theme/tobago-theme-roxborough/pom.xml>
to org.apache.myfaces.tobago/tobago-theme-roxborough/4.3.0-SNAPSHOT/tobago-theme-roxborough-4.3.0-SNAPSHOT.pom
[JENKINS] Archiving <https://builds.apache.org/job/Tobago%20Trunk/ws/tobago-theme/tobago-theme-roxborough/target/tobago-theme-roxborough-4.3.0-SNAPSHOT.jar>
to org.apache.myfaces.tobago/tobago-theme-roxborough/4.3.0-SNAPSHOT/tobago-theme-roxborough-4.3.0-SNAPSHOT.jar
[Fast Archiver] Compressed 430.76 KB of artifacts by 37.1% relative to #1466
[JENKINS] Archiving <https://builds.apache.org/job/Tobago%20Trunk/ws/tobago-tool/tobago-tool-annotation/pom.xml>
to org.apache.myfaces.tobago/tobago-tool-annotation/4.3.0-SNAPSHOT/tobago-tool-annotation-4.3.0-SNAPSHOT.pom
[JENKINS] Archiving <https://builds.apache.org/job/Tobago%20Trunk/ws/tobago-tool/tobago-tool-annotation/target/tobago-tool-annotation-4.3.0-SNAPSHOT.jar>
to org.apache.myfaces.tobago/tobago-tool-annotation/4.3.0-SNAPSHOT/tobago-tool-annotation-4.3.0-SNAPSHOT.jar
[JENKINS] Archiving <https://builds.apache.org/job/Tobago%20Trunk/ws/tobago-example/pom.xml>
to org.apache.myfaces.tobago/tobago-example/4.3.0-SNAPSHOT/tobago-example-4.3.0-SNAPSHOT.pom
[JENKINS] Archiving <https://builds.apache.org/job/Tobago%20Trunk/ws/tobago-tool/pom.xml>
to org.apache.myfaces.tobago/tobago-tool/4.3.0-SNAPSHOT/tobago-tool-4.3.0-SNAPSHOT.pom
[JENKINS] Archiving <https://builds.apache.org/job/Tobago%20Trunk/ws/tobago-core/pom.xml>
to org.apache.myfaces.tobago/tobago-core/4.3.0-SNAPSHOT/tobago-core-4.3.0-SNAPSHOT.pom
[JENKINS] Archiving <https://builds.apache.org/job/Tobago%20Trunk/ws/tobago-core/target/tobago-core-4.3.0-SNAPSHOT.jar>
to org.apache.myfaces.tobago/tobago-core/4.3.0-SNAPSHOT/tobago-core-4.3.0-SNAPSHOT.jar
[JENKINS] Archiving <https://builds.apache.org/job/Tobago%20Trunk/ws/tobago-core/target/tobago-core-4.3.0-SNAPSHOT-tests.jar>
to org.apache.myfaces.tobago/tobago-core/4.3.0-SNAPSHOT/tobago-core-4.3.0-SNAPSHOT-tests.jar
[JENKINS] Archiving <https://builds.apache.org/job/Tobago%20Trunk/ws/tobago-core/target/tobago-core-4.3.0-SNAPSHOT-sources.jar>
to org.apache.myfaces.tobago/tobago-core/4.3.0-SNAPSHOT/tobago-core-4.3.0-SNAPSHOT-sources.jar
[JENKINS] Archiving <https://builds.apache.org/job/Tobago%20Trunk/ws/tobago-tool/tobago-tool-apt/pom.xml>
to org.apache.myfaces.tobago/tobago-tool-apt/4.3.0-SNAPSHOT/tobago-tool-apt-4.3.0-SNAPSHOT.pom
[JENKINS] Archiving <https://builds.apache.org/job/Tobago%20Trunk/ws/tobago-tool/tobago-tool-apt/target/tobago-tool-apt-4.3.0-SNAPSHOT.jar>
to org.apache.myfaces.tobago/tobago-tool-apt/4.3.0-SNAPSHOT/tobago-tool-apt-4.3.0-SNAPSHOT.jar
[JENKINS] Archiving <https://builds.apache.org/job/Tobago%20Trunk/ws/tobago-theme/tobago-theme-charlotteville/pom.xml>
to org.apache.myfaces.tobago/tobago-theme-charlotteville/4.3.0-SNAPSHOT/tobago-theme-charlotteville-4.3.0-SNAPSHOT.pom
[JENKINS] Archiving <https://builds.apache.org/job/Tobago%20Trunk/ws/tobago-theme/tobago-theme-charlotteville/target/tobago-theme-charlotteville-4.3.0-SNAPSHOT.jar>
to org.apache.myfaces.tobago/tobago-theme-charlotteville/4.3.0-SNAPSHOT/tobago-theme-charlotteville-4.3.0-SNAPSHOT.jar
[Fast Archiver] Compressed 307.17 KB of artifacts by 41.7% relative to #1466
[JENKINS] Archiving <https://builds.apache.org/job/Tobago%20Trunk/ws/tobago-example/tobago-example-demo/pom.xml>
to org.apache.myfaces.tobago/tobago-example-demo/4.3.0-SNAPSHOT/tobago-example-demo-4.3.0-SNAPSHOT.pom
Sending e-mails to: commits@myfaces.apache.org
channel stopped

Mime
View raw message