myfaces-commits mailing list archives

Site index · List index
Message view « Date » · « Thread »
Top « Date » · « Thread »
From Apache Jenkins Server <jenk...@builds.apache.org>
Subject Build failed in Jenkins: Tobago 2.0.x #1510
Date Sat, 22 Sep 2018 08:09:13 GMT
See <https://builds.apache.org/job/Tobago%202.0.x/1510/display/redirect?page=changes>

Changes:

[lofwyr] update because spring-core-4.3.9.RELEASE.jar: CVE-2018-1275,

------------------------------------------
[...truncated 1.53 MB...]
[INFO] --- maven-enforcer-plugin:1.4.1:enforce (enforce) @ tobago-example-blank ---
[INFO] 
[INFO] --- maven-remote-resources-plugin:1.2.1:process (default) @ tobago-example-blank ---
[INFO] 
[INFO] --- maven-remote-resources-plugin:1.2.1:process (process-resource-bundles) @ tobago-example-blank
---
[INFO] 
[INFO] --- maven-resources-plugin:2.5:resources (default-resources) @ tobago-example-blank
---
[debug] execute contextualize
[INFO] Using 'UTF-8' encoding to copy filtered resources.
[INFO] Copying 1 resource
[INFO] Copying 3 resources
[INFO] Copying 3 resources
[INFO] 
[INFO] --- maven-compiler-plugin:3.3:compile (default-compile) @ tobago-example-blank ---
[INFO] No sources to compile
[INFO] 
[INFO] --- maven-resources-plugin:2.5:testResources (default-testResources) @ tobago-example-blank
---
[debug] execute contextualize
[INFO] Using 'UTF-8' encoding to copy filtered resources.
[INFO] skip non existing resourceDirectory <https://builds.apache.org/job/Tobago%202.0.x/ws/tobago-example/tobago-example-blank/src/test/resources>
[INFO] Copying 3 resources
[INFO] Copying 3 resources
[INFO] 
[INFO] --- maven-compiler-plugin:3.3:testCompile (default-testCompile) @ tobago-example-blank
---
[INFO] No sources to compile
[INFO] 
[INFO] --- maven-surefire-plugin:2.9:test (default-test) @ tobago-example-blank ---
[INFO] Surefire report directory: <https://builds.apache.org/job/Tobago%202.0.x/ws/tobago-example/tobago-example-blank/target/surefire-reports>

-------------------------------------------------------
 T E S T S
-------------------------------------------------------

Results :

Tests run: 0, Failures: 0, Errors: 0, Skipped: 0

[JENKINS] Recording test results
[INFO] 
[INFO] --- maven-war-plugin:2.1.1:war (default-war) @ tobago-example-blank ---
[INFO] Packaging webapp
[INFO] Assembling webapp [tobago-example-blank] in [<https://builds.apache.org/job/Tobago%202.0.x/ws/tobago-example/tobago-example-blank/target/tobago-example-blank]>
[INFO] Processing war project
[INFO] Copying webapp resources [<https://builds.apache.org/job/Tobago%202.0.x/ws/tobago-example/tobago-example-blank/src/main/webapp]>
[INFO] Webapp assembled in [35 msecs]
[INFO] Building war: <https://builds.apache.org/job/Tobago%202.0.x/ws/tobago-example/tobago-example-blank/target/tobago-example-blank.war>
[INFO] WEB-INF/web.xml already added, skipping
[INFO] 
[INFO] --- maven-site-plugin:3.3:attach-descriptor (attach-descriptor) @ tobago-example-blank
---
[INFO] 
[INFO] --- maven-install-plugin:2.3.1:install (default-install) @ tobago-example-blank ---
[INFO] Installing <https://builds.apache.org/job/Tobago%202.0.x/ws/tobago-example/tobago-example-blank/target/tobago-example-blank.war>
to /home/jenkins/jenkins-slave/maven-repositories/0/org/apache/myfaces/tobago/tobago-example-blank/2.2.0-SNAPSHOT/tobago-example-blank-2.2.0-SNAPSHOT.war
[INFO] Installing <https://builds.apache.org/job/Tobago%202.0.x/ws/tobago-example/tobago-example-blank/pom.xml>
to /home/jenkins/jenkins-slave/maven-repositories/0/org/apache/myfaces/tobago/tobago-example-blank/2.2.0-SNAPSHOT/tobago-example-blank-2.2.0-SNAPSHOT.pom
[INFO]                                                                         
[INFO] ------------------------------------------------------------------------
[INFO] Building Tobago Example Data 2.2.0-SNAPSHOT
[INFO] ------------------------------------------------------------------------
[INFO] 
[INFO] --- maven-clean-plugin:2.4.1:clean (default-clean) @ tobago-example-data ---
[INFO] Deleting <https://builds.apache.org/job/Tobago%202.0.x/ws/tobago-example/tobago-example-data/target>
[INFO] 
[INFO] --- animal-sniffer-maven-plugin:1.14:check (default-cli) @ tobago-example-data ---
[INFO] Checking unresolved references to org.codehaus.mojo.signature:java15:1.0
[INFO] 
[INFO] --- maven-checkstyle-plugin:2.9:check (default-cli) @ tobago-example-data ---
[INFO] Starting audit...
Audit done.

[INFO] 
[INFO] --- maven-enforcer-plugin:1.4.1:enforce (enforce-maven-version) @ tobago-example-data
---
[INFO] 
[INFO] --- maven-enforcer-plugin:1.4.1:enforce (enforce) @ tobago-example-data ---
[INFO] 
[INFO] --- maven-remote-resources-plugin:1.2.1:process (default) @ tobago-example-data ---
[INFO] 
[INFO] --- maven-remote-resources-plugin:1.2.1:process (process-resource-bundles) @ tobago-example-data
---
[INFO] 
[INFO] --- maven-resources-plugin:2.5:resources (default-resources) @ tobago-example-data
---
[debug] execute contextualize
[INFO] Using 'UTF-8' encoding to copy filtered resources.
[INFO] Copying 10 resources
[INFO] Copying 3 resources
[INFO] Copying 3 resources
[INFO] 
[INFO] --- maven-compiler-plugin:3.3:compile (default-compile) @ tobago-example-data ---
[INFO] Compiling 14 source files to <https://builds.apache.org/job/Tobago%202.0.x/ws/tobago-example/tobago-example-data/target/classes>
[WARNING] bootstrap class path not set in conjunction with -source 1.5
[WARNING] source value 1.5 is obsolete and will be removed in a future release
[WARNING] target value 1.5 is obsolete and will be removed in a future release
[WARNING] To suppress warnings about obsolete options, use -Xlint:-options.
[INFO] 
[INFO] --- maven-resources-plugin:2.5:testResources (default-testResources) @ tobago-example-data
---
[debug] execute contextualize
[INFO] Using 'UTF-8' encoding to copy filtered resources.
[INFO] skip non existing resourceDirectory <https://builds.apache.org/job/Tobago%202.0.x/ws/tobago-example/tobago-example-data/src/test/resources>
[INFO] Copying 3 resources
[INFO] Copying 3 resources
[INFO] 
[INFO] --- maven-compiler-plugin:3.3:testCompile (default-testCompile) @ tobago-example-data
---
[INFO] No sources to compile
[INFO] 
[INFO] --- maven-surefire-plugin:2.9:test (default-test) @ tobago-example-data ---
[INFO] Surefire report directory: <https://builds.apache.org/job/Tobago%202.0.x/ws/tobago-example/tobago-example-data/target/surefire-reports>

-------------------------------------------------------
 T E S T S
-------------------------------------------------------

Results :

Tests run: 0, Failures: 0, Errors: 0, Skipped: 0

[JENKINS] Recording test results
[INFO] 
[INFO] --- maven-jar-plugin:2.3.2:jar (default-jar) @ tobago-example-data ---
[INFO] Building jar: <https://builds.apache.org/job/Tobago%202.0.x/ws/tobago-example/tobago-example-data/target/tobago-example-data-2.2.0-SNAPSHOT.jar>
[INFO] 
[INFO] --- maven-site-plugin:3.3:attach-descriptor (attach-descriptor) @ tobago-example-data
---
[INFO] 
[INFO] --- maven-install-plugin:2.3.1:install (default-install) @ tobago-example-data ---
[INFO] Installing <https://builds.apache.org/job/Tobago%202.0.x/ws/tobago-example/tobago-example-data/target/tobago-example-data-2.2.0-SNAPSHOT.jar>
to /home/jenkins/jenkins-slave/maven-repositories/0/org/apache/myfaces/tobago/tobago-example-data/2.2.0-SNAPSHOT/tobago-example-data-2.2.0-SNAPSHOT.jar
[INFO] Installing <https://builds.apache.org/job/Tobago%202.0.x/ws/tobago-example/tobago-example-data/pom.xml>
to /home/jenkins/jenkins-slave/maven-repositories/0/org/apache/myfaces/tobago/tobago-example-data/2.2.0-SNAPSHOT/tobago-example-data-2.2.0-SNAPSHOT.pom
[INFO]                                                                         
[INFO] ------------------------------------------------------------------------
[INFO] Building Tobago Example Demo 2.2.0-SNAPSHOT
[INFO] ------------------------------------------------------------------------
[INFO] 
[INFO] --- maven-clean-plugin:2.4.1:clean (default-clean) @ tobago-example-demo ---
[INFO] Deleting <https://builds.apache.org/job/Tobago%202.0.x/ws/tobago-example/tobago-example-demo/target>
[INFO] 
[INFO] --- animal-sniffer-maven-plugin:1.14:check (default-cli) @ tobago-example-demo ---
[INFO] Checking unresolved references to org.codehaus.mojo.signature:java15:1.0
[INFO] 
[INFO] --- maven-checkstyle-plugin:2.9:check (default-cli) @ tobago-example-demo ---
[INFO] Starting audit...
<https://builds.apache.org/job/Tobago%202.0.x/ws/tobago-example/tobago-example-demo/src/main/java/org/apache/myfaces/tobago/example/demo/MultiWindow.java>:1:
Line does not match expected header line of '/*'.
Audit done.

[INFO] There are 1 checkstyle errors.
[INFO] ------------------------------------------------------------------------
[INFO] Reactor Summary:
[INFO] 
[INFO] Apache Tobago ...................................... SUCCESS [  6.496 s]
[INFO] Tobago Tool ........................................ SUCCESS [  1.550 s]
[INFO] Tobago Tool Annotation ............................. SUCCESS [  4.722 s]
[INFO] Tobago Tool Apt .................................... SUCCESS [  4.991 s]
[INFO] Tobago Maven2 Theme Plugin ......................... SUCCESS [  3.457 s]
[INFO] Tobago Core ........................................ SUCCESS [ 30.505 s]
[INFO] Tobago Themes ...................................... SUCCESS [  1.419 s]
[INFO] Tobago Theme Standard .............................. SUCCESS [ 11.128 s]
[INFO] Tobago Theme Scarborough ........................... SUCCESS [  5.204 s]
[INFO] Tobago Theme Speyside .............................. SUCCESS [  7.484 s]
[INFO] Tobago Theme Richmond .............................. SUCCESS [  2.675 s]
[INFO] Tobago Theme Charlotteville ........................ SUCCESS [  2.581 s]
[INFO] Tobago Theme Example ............................... SUCCESS [  4.822 s]
[INFO] Tobago Extensions .................................. SUCCESS [  1.228 s]
[INFO] Tobago Deprecation ................................. SUCCESS [  2.867 s]
[INFO] Tobago Fileupload .................................. SUCCESS [  2.204 s]
[INFO] Tobago Sandbox ..................................... SUCCESS [  5.956 s]
[INFO] Tobago Security .................................... SUCCESS [  2.362 s]
[INFO] Tobago Examples .................................... SUCCESS [  2.024 s]
[INFO] Tobago Example Addressbook ......................... SUCCESS [  9.154 s]
[INFO] Tobago Example Addressbook (Java EE 6) ............. SUCCESS [  8.100 s]
[INFO] Tobago Example Blank ............................... SUCCESS [  3.098 s]
[INFO] Tobago Example Data ................................ SUCCESS [  2.610 s]
[INFO] Tobago Example Demo ................................ FAILURE [  1.827 s]
[INFO] Tobago Example for Portlets ........................ SKIPPED
[INFO] Tobago Example Sandbox ............................. SKIPPED
[INFO] Tobago Example Security ............................ SKIPPED
[INFO] Tobago Example Test ................................ SKIPPED
[INFO] Tobago Example Assembly ............................ SKIPPED
[INFO] Tobago Assembly .................................... SKIPPED
[INFO] ------------------------------------------------------------------------
[INFO] BUILD FAILURE
[INFO] ------------------------------------------------------------------------
[INFO] Total time: 03:05 min
[INFO] Finished at: 2018-09-22T08:08:49+00:00
[INFO] Final Memory: 146M/3987M
[INFO] ------------------------------------------------------------------------
[WARNING] The requested profile "all-modules" could not be activated because it does not exist.
Waiting for Jenkins to finish collecting data
[ERROR] Failed to execute goal org.apache.maven.plugins:maven-checkstyle-plugin:2.9:check
(default-cli) on project tobago-example-demo: You have 1 Checkstyle violation. -> [Help
1]
[ERROR] 
[ERROR] To see the full stack trace of the errors, re-run Maven with the -e switch.
[ERROR] Re-run Maven using the -X switch to enable full debug logging.
[ERROR] 
[ERROR] For more information about the errors and possible solutions, please read the following
articles:
[ERROR] [Help 1] http://cwiki.apache.org/confluence/display/MAVEN/MojoFailureException
[ERROR] 
[ERROR] After correcting the problems, you can resume the build with the command
[ERROR]   mvn <goals> -rf :tobago-example-demo
[JENKINS] Archiving <https://builds.apache.org/job/Tobago%202.0.x/ws/tobago-theme/pom.xml>
to org.apache.myfaces.tobago/tobago-theme/2.2.0-SNAPSHOT/tobago-theme-2.2.0-SNAPSHOT.pom
[JENKINS] Archiving <https://builds.apache.org/job/Tobago%202.0.x/ws/pom.xml> to org.apache.myfaces.tobago/tobago/2.2.0-SNAPSHOT/tobago-2.2.0-SNAPSHOT.pom
[Fast Archiver] Compressed 52.11 KB of artifacts by 61.4% relative to #1509
[JENKINS] Archiving <https://builds.apache.org/job/Tobago%202.0.x/ws/tobago-extension/tobago-fileupload/pom.xml>
to org.apache.myfaces.tobago/tobago-fileupload/2.2.0-SNAPSHOT/tobago-fileupload-2.2.0-SNAPSHOT.pom
[JENKINS] Archiving <https://builds.apache.org/job/Tobago%202.0.x/ws/tobago-extension/tobago-fileupload/target/tobago-fileupload-2.2.0-SNAPSHOT.jar>
to org.apache.myfaces.tobago/tobago-fileupload/2.2.0-SNAPSHOT/tobago-fileupload-2.2.0-SNAPSHOT.jar
[JENKINS] Archiving <https://builds.apache.org/job/Tobago%202.0.x/ws/tobago-theme/tobago-theme-richmond/pom.xml>
to org.apache.myfaces.tobago/tobago-theme-richmond/2.2.0-SNAPSHOT/tobago-theme-richmond-2.2.0-SNAPSHOT.pom
[JENKINS] Archiving <https://builds.apache.org/job/Tobago%202.0.x/ws/tobago-theme/tobago-theme-richmond/target/tobago-theme-richmond-2.2.0-SNAPSHOT.jar>
to org.apache.myfaces.tobago/tobago-theme-richmond/2.2.0-SNAPSHOT/tobago-theme-richmond-2.2.0-SNAPSHOT.jar
[JENKINS] Archiving <https://builds.apache.org/job/Tobago%202.0.x/ws/tobago-extension/tobago-deprecation/pom.xml>
to org.apache.myfaces.tobago/tobago-deprecation/2.2.0-SNAPSHOT/tobago-deprecation-2.2.0-SNAPSHOT.pom
[JENKINS] Archiving <https://builds.apache.org/job/Tobago%202.0.x/ws/tobago-extension/tobago-deprecation/target/tobago-deprecation-2.2.0-SNAPSHOT.jar>
to org.apache.myfaces.tobago/tobago-deprecation/2.2.0-SNAPSHOT/tobago-deprecation-2.2.0-SNAPSHOT.jar
[JENKINS] Archiving <https://builds.apache.org/job/Tobago%202.0.x/ws/tobago-example/tobago-example-portlet/pom.xml>
to org.apache.myfaces.tobago/tobago-example-portlet/2.2.0-SNAPSHOT/tobago-example-portlet-2.2.0-SNAPSHOT.pom
[JENKINS] Archiving <https://builds.apache.org/job/Tobago%202.0.x/ws/tobago-example/tobago-example-sandbox/pom.xml>
to org.apache.myfaces.tobago/tobago-example-sandbox/2.2.0-SNAPSHOT/tobago-example-sandbox-2.2.0-SNAPSHOT.pom
[JENKINS] Archiving <https://builds.apache.org/job/Tobago%202.0.x/ws/tobago-example/pom.xml>
to org.apache.myfaces.tobago/tobago-example/2.2.0-SNAPSHOT/tobago-example-2.2.0-SNAPSHOT.pom
[JENKINS] Archiving <https://builds.apache.org/job/Tobago%202.0.x/ws/tobago-example/tobago-example-addressbook/pom.xml>
to org.apache.myfaces.tobago/tobago-example-addressbook/2.2.0-SNAPSHOT/tobago-example-addressbook-2.2.0-SNAPSHOT.pom
[JENKINS] Archiving <https://builds.apache.org/job/Tobago%202.0.x/ws/tobago-example/tobago-example-addressbook/target/tobago-example-addressbook.war>
to org.apache.myfaces.tobago/tobago-example-addressbook/2.2.0-SNAPSHOT/tobago-example-addressbook-2.2.0-SNAPSHOT.war
[Fast Archiver] Compressed 19.27 MB of artifacts by 59.8% relative to #1509
[JENKINS] Archiving <https://builds.apache.org/job/Tobago%202.0.x/ws/tobago-example/tobago-example-addressbook-cdi/pom.xml>
to org.apache.myfaces.tobago/tobago-example-addressbook-cdi/2.2.0-SNAPSHOT/tobago-example-addressbook-cdi-2.2.0-SNAPSHOT.pom
[JENKINS] Archiving <https://builds.apache.org/job/Tobago%202.0.x/ws/tobago-example/tobago-example-addressbook-cdi/target/tobago-example-addressbook-cdi.war>
to org.apache.myfaces.tobago/tobago-example-addressbook-cdi/2.2.0-SNAPSHOT/tobago-example-addressbook-cdi-2.2.0-SNAPSHOT.war
[Fast Archiver] Compressed 14.55 MB of artifacts by 79.5% relative to #1509
[JENKINS] Archiving <https://builds.apache.org/job/Tobago%202.0.x/ws/tobago-tool/tobago-tool-apt/pom.xml>
to org.apache.myfaces.tobago/tobago-tool-apt/2.2.0-SNAPSHOT/tobago-tool-apt-2.2.0-SNAPSHOT.pom
[JENKINS] Archiving <https://builds.apache.org/job/Tobago%202.0.x/ws/tobago-tool/tobago-tool-apt/target/tobago-tool-apt-2.2.0-SNAPSHOT.jar>
to org.apache.myfaces.tobago/tobago-tool-apt/2.2.0-SNAPSHOT/tobago-tool-apt-2.2.0-SNAPSHOT.jar
[JENKINS] Archiving <https://builds.apache.org/job/Tobago%202.0.x/ws/tobago-theme/tobago-theme-example/pom.xml>
to org.apache.myfaces.tobago/tobago-theme-example/2.2.0-SNAPSHOT/tobago-theme-example-2.2.0-SNAPSHOT.pom
[JENKINS] Archiving <https://builds.apache.org/job/Tobago%202.0.x/ws/tobago-theme/tobago-theme-example/target/tobago-theme-example-2.2.0-SNAPSHOT.jar>
to org.apache.myfaces.tobago/tobago-theme-example/2.2.0-SNAPSHOT/tobago-theme-example-2.2.0-SNAPSHOT.jar
[JENKINS] Archiving <https://builds.apache.org/job/Tobago%202.0.x/ws/tobago-example/tobago-example-blank/pom.xml>
to org.apache.myfaces.tobago/tobago-example-blank/2.2.0-SNAPSHOT/tobago-example-blank-2.2.0-SNAPSHOT.pom
[JENKINS] Archiving <https://builds.apache.org/job/Tobago%202.0.x/ws/tobago-example/tobago-example-blank/target/tobago-example-blank.war>
to org.apache.myfaces.tobago/tobago-example-blank/2.2.0-SNAPSHOT/tobago-example-blank-2.2.0-SNAPSHOT.war
[Fast Archiver] Compressed 6.60 MB of artifacts by 63.4% relative to #1509
[JENKINS] Archiving <https://builds.apache.org/job/Tobago%202.0.x/ws/tobago-assembly/pom.xml>
to org.apache.myfaces.tobago/tobago-assembly/2.2.0-SNAPSHOT/tobago-assembly-2.2.0-SNAPSHOT.pom
[JENKINS] Archiving <https://builds.apache.org/job/Tobago%202.0.x/ws/tobago-extension/tobago-security/pom.xml>
to org.apache.myfaces.tobago/tobago-security/2.2.0-SNAPSHOT/tobago-security-2.2.0-SNAPSHOT.pom
[JENKINS] Archiving <https://builds.apache.org/job/Tobago%202.0.x/ws/tobago-extension/tobago-security/target/tobago-security-2.2.0-SNAPSHOT.jar>
to org.apache.myfaces.tobago/tobago-security/2.2.0-SNAPSHOT/tobago-security-2.2.0-SNAPSHOT.jar
[JENKINS] Archiving <https://builds.apache.org/job/Tobago%202.0.x/ws/tobago-theme/tobago-theme-standard/pom.xml>
to org.apache.myfaces.tobago/tobago-theme-standard/2.2.0-SNAPSHOT/tobago-theme-standard-2.2.0-SNAPSHOT.pom
[JENKINS] Archiving <https://builds.apache.org/job/Tobago%202.0.x/ws/tobago-theme/tobago-theme-standard/target/tobago-theme-standard-2.2.0-SNAPSHOT.jar>
to org.apache.myfaces.tobago/tobago-theme-standard/2.2.0-SNAPSHOT/tobago-theme-standard-2.2.0-SNAPSHOT.jar
[Fast Archiver] Compressed 725.46 KB of artifacts by 13.2% relative to #1509
[JENKINS] Archiving <https://builds.apache.org/job/Tobago%202.0.x/ws/tobago-theme/tobago-theme-scarborough/pom.xml>
to org.apache.myfaces.tobago/tobago-theme-scarborough/2.2.0-SNAPSHOT/tobago-theme-scarborough-2.2.0-SNAPSHOT.pom
[JENKINS] Archiving <https://builds.apache.org/job/Tobago%202.0.x/ws/tobago-theme/tobago-theme-scarborough/target/tobago-theme-scarborough-2.2.0-SNAPSHOT.jar>
to org.apache.myfaces.tobago/tobago-theme-scarborough/2.2.0-SNAPSHOT/tobago-theme-scarborough-2.2.0-SNAPSHOT.jar
[JENKINS] Archiving <https://builds.apache.org/job/Tobago%202.0.x/ws/tobago-example/tobago-example-assembly/pom.xml>
to org.apache.myfaces.tobago/tobago-example-assembly/2.2.0-SNAPSHOT/tobago-example-assembly-2.2.0-SNAPSHOT.pom
[JENKINS] Archiving <https://builds.apache.org/job/Tobago%202.0.x/ws/tobago-theme/tobago-theme-speyside/pom.xml>
to org.apache.myfaces.tobago/tobago-theme-speyside/2.2.0-SNAPSHOT/tobago-theme-speyside-2.2.0-SNAPSHOT.pom
[JENKINS] Archiving <https://builds.apache.org/job/Tobago%202.0.x/ws/tobago-theme/tobago-theme-speyside/target/tobago-theme-speyside-2.2.0-SNAPSHOT.jar>
to org.apache.myfaces.tobago/tobago-theme-speyside/2.2.0-SNAPSHOT/tobago-theme-speyside-2.2.0-SNAPSHOT.jar
[JENKINS] Archiving <https://builds.apache.org/job/Tobago%202.0.x/ws/tobago-extension/pom.xml>
to org.apache.myfaces.tobago/tobago-extension/2.2.0-SNAPSHOT/tobago-extension-2.2.0-SNAPSHOT.pom
[JENKINS] Archiving <https://builds.apache.org/job/Tobago%202.0.x/ws/tobago-tool/tobago-tool-annotation/pom.xml>
to org.apache.myfaces.tobago/tobago-tool-annotation/2.2.0-SNAPSHOT/tobago-tool-annotation-2.2.0-SNAPSHOT.pom
[JENKINS] Archiving <https://builds.apache.org/job/Tobago%202.0.x/ws/tobago-tool/tobago-tool-annotation/target/tobago-tool-annotation-2.2.0-SNAPSHOT.jar>
to org.apache.myfaces.tobago/tobago-tool-annotation/2.2.0-SNAPSHOT/tobago-tool-annotation-2.2.0-SNAPSHOT.jar
[JENKINS] Archiving <https://builds.apache.org/job/Tobago%202.0.x/ws/tobago-example/tobago-example-security/pom.xml>
to org.apache.myfaces.tobago/tobago-example-security/2.2.0-SNAPSHOT/tobago-example-security-2.2.0-SNAPSHOT.pom
[JENKINS] Archiving <https://builds.apache.org/job/Tobago%202.0.x/ws/tobago-example/tobago-example-data/pom.xml>
to org.apache.myfaces.tobago/tobago-example-data/2.2.0-SNAPSHOT/tobago-example-data-2.2.0-SNAPSHOT.pom
[JENKINS] Archiving <https://builds.apache.org/job/Tobago%202.0.x/ws/tobago-example/tobago-example-data/target/tobago-example-data-2.2.0-SNAPSHOT.jar>
to org.apache.myfaces.tobago/tobago-example-data/2.2.0-SNAPSHOT/tobago-example-data-2.2.0-SNAPSHOT.jar
[JENKINS] Archiving <https://builds.apache.org/job/Tobago%202.0.x/ws/tobago-example/tobago-example-test/pom.xml>
to org.apache.myfaces.tobago/tobago-example-test/2.2.0-SNAPSHOT/tobago-example-test-2.2.0-SNAPSHOT.pom
[JENKINS] Archiving <https://builds.apache.org/job/Tobago%202.0.x/ws/tobago-tool/pom.xml>
to org.apache.myfaces.tobago/tobago-tool/2.2.0-SNAPSHOT/tobago-tool-2.2.0-SNAPSHOT.pom
[JENKINS] Archiving <https://builds.apache.org/job/Tobago%202.0.x/ws/tobago-core/pom.xml>
to org.apache.myfaces.tobago/tobago-core/2.2.0-SNAPSHOT/tobago-core-2.2.0-SNAPSHOT.pom
[JENKINS] Archiving <https://builds.apache.org/job/Tobago%202.0.x/ws/tobago-core/target/tobago-core-2.2.0-SNAPSHOT.jar>
to org.apache.myfaces.tobago/tobago-core/2.2.0-SNAPSHOT/tobago-core-2.2.0-SNAPSHOT.jar
[JENKINS] Archiving <https://builds.apache.org/job/Tobago%202.0.x/ws/tobago-core/target/tobago-core-2.2.0-SNAPSHOT-tests.jar>
to org.apache.myfaces.tobago/tobago-core/2.2.0-SNAPSHOT/tobago-core-2.2.0-SNAPSHOT-tests.jar
[JENKINS] Archiving <https://builds.apache.org/job/Tobago%202.0.x/ws/tobago-core/target/tobago-core-2.2.0-SNAPSHOT-sources.jar>
to org.apache.myfaces.tobago/tobago-core/2.2.0-SNAPSHOT/tobago-core-2.2.0-SNAPSHOT-sources.jar
[JENKINS] Archiving <https://builds.apache.org/job/Tobago%202.0.x/ws/tobago-tool/tobago-theme-plugin/pom.xml>
to org.apache.myfaces.tobago/tobago-theme-plugin/2.2.0-SNAPSHOT/tobago-theme-plugin-2.2.0-SNAPSHOT.pom
[JENKINS] Archiving <https://builds.apache.org/job/Tobago%202.0.x/ws/tobago-tool/tobago-theme-plugin/target/tobago-theme-plugin-2.2.0-SNAPSHOT.jar>
to org.apache.myfaces.tobago/tobago-theme-plugin/2.2.0-SNAPSHOT/tobago-theme-plugin-2.2.0-SNAPSHOT.jar
[JENKINS] Archiving <https://builds.apache.org/job/Tobago%202.0.x/ws/tobago-extension/tobago-sandbox/pom.xml>
to org.apache.myfaces.tobago/tobago-sandbox/2.2.0-SNAPSHOT/tobago-sandbox-2.2.0-SNAPSHOT.pom
[JENKINS] Archiving <https://builds.apache.org/job/Tobago%202.0.x/ws/tobago-extension/tobago-sandbox/target/tobago-sandbox-2.2.0-SNAPSHOT.jar>
to org.apache.myfaces.tobago/tobago-sandbox/2.2.0-SNAPSHOT/tobago-sandbox-2.2.0-SNAPSHOT.jar
[JENKINS] Archiving <https://builds.apache.org/job/Tobago%202.0.x/ws/tobago-theme/tobago-theme-charlotteville/pom.xml>
to org.apache.myfaces.tobago/tobago-theme-charlotteville/2.2.0-SNAPSHOT/tobago-theme-charlotteville-2.2.0-SNAPSHOT.pom
[JENKINS] Archiving <https://builds.apache.org/job/Tobago%202.0.x/ws/tobago-theme/tobago-theme-charlotteville/target/tobago-theme-charlotteville-2.2.0-SNAPSHOT.jar>
to org.apache.myfaces.tobago/tobago-theme-charlotteville/2.2.0-SNAPSHOT/tobago-theme-charlotteville-2.2.0-SNAPSHOT.jar
[JENKINS] Archiving <https://builds.apache.org/job/Tobago%202.0.x/ws/tobago-example/tobago-example-demo/pom.xml>
to org.apache.myfaces.tobago/tobago-example-demo/2.2.0-SNAPSHOT/tobago-example-demo-2.2.0-SNAPSHOT.pom
Sending e-mails to: commits@myfaces.apache.org
channel stopped
CVE-2018 issue doesn't exist in JIRA

Mime
View raw message