myfaces-commits mailing list archives

Site index · List index
Message view « Date » · « Thread »
Top « Date » · « Thread »
From Apache Jenkins Server <jenk...@builds.apache.org>
Subject Build failed in Jenkins: myfaces-current23 #358
Date Sat, 20 Oct 2018 22:44:19 GMT
See <https://builds.apache.org/job/myfaces-current23/358/display/redirect?page=changes>

Changes:

[tandraschko] removed unused code

------------------------------------------
[...truncated 121.22 KB...]
[INFO] Using 'eval' reduces the level of compression!
function (){var _r=window.eval ---> . <--- call(window,code);if(

[WARNING] [WARNING] Using 'eval' is not recommended...
[INFO] Using 'eval' reduces the level of compression!
_T[_e]||((_w.eval ---> && <--- (!_b.isBlackBerry||_b.isBlackBerry

[WARNING] [WARNING] Using 'eval' is not recommended...
[INFO] Using 'eval' reduces the level of compression!
_T[_e]||((_w.eval ---> ) <--- ?"_evalHeadAppendix":null);}if(

[WARNING] [WARNING] Using 'eval' is not recommended...
[INFO] Using 'eval' reduces the level of compression!
[_e]](c);}eval ---> . <--- call(window,c);return null

[WARNING] [WARNING] The variable _T has already been declared in the same scope...
,tv=parseFloat(dav);var _T ---> = <--- this;_T.browser={};

[WARNING] [WARNING] The variable tagNameStart has already been declared in the same scope...
,_tokenPos=0,_tokenForward=1,tagNameStart ---> = <--- (!tagNameStart)?BEGIN_TAG:tagNameStart;

[WARNING] [WARNING] The variable i has already been declared in the same scope...
&&params!=null){for(var i ---> = <--- 0,param;(param=params[

[WARNING] [WARNING] The variable param has already been declared in the same scope...
){for(var i=0,param ---> ; <--- (param=params[i]);

[WARNING] [WARNING] The symbol assigned is declared but is apparently never used.
This code can probably be written in a more efficient way.
}:function (){};var assigned ---> = <--- true;}if("function"!=typeof newCls

[WARNING] [WARNING] The symbol found is declared but is apparently never used.
This code can probably be written in a more efficient way.
obj,finalAttr,value);}var found ---> = <--- false;var prefix=(value)?

[WARNING] [WARNING] The symbol _tokenPos is declared but is apparently never used.
This code can probably be written in a more efficient way.
=-1,_contentEnd=-1,_tokenPos ---> = <--- 0,_tokenForward=1,tagNameStart=(

[WARNING] [WARNING] The symbol _tokenForward is declared but is apparently never used.
This code can probably be written in a more efficient way.
_contentEnd=-1,_tokenPos=0,_tokenForward ---> = <--- 1,tagNameStart=(!tagNameStart)?

[WARNING] [WARNING] The symbol _RT is declared but is apparently never used.
This code can probably be written in a more efficient way.
{var _Lang=this._Lang;var _RT ---> = <--- this._RT;var _Dom=this.

[WARNING] [WARNING] The symbol _Dom is declared but is apparently never used.
This code can probably be written in a more efficient way.
;var _RT=this._RT;var _Dom ---> = <--- this._Dom;try{var scopeThis=

[WARNING] [WARNING] The symbol _AJAXUTIL is declared but is apparently never used.
This code can probably be written in a more efficient way.
},getFormData:function (){var _AJAXUTIL ---> = <--- this._AJAXUTIL,myfacesOptions=this._context

[WARNING] [WARNING] The symbol myfacesOptions is declared but is apparently never used.
This code can probably be written in a more efficient way.
){var _AJAXUTIL=this._AJAXUTIL,myfacesOptions ---> = <--- this._context.myfaces;return
this.

[WARNING] [WARNING] The symbol _Lang is declared but is apparently never used.
This code can probably be written in a more efficient way.
,fixViewStates:function (context){var _Lang ---> = <--- this._Lang;var mfInternal=context.

[WARNING] [WARNING] The symbol _Lang is declared but is apparently never used.
This code can probably be written in a more efficient way.
:function (context,theForm){var _Lang ---> = <--- this._Lang;var mfInternal=context.

[WARNING] [WARNING] The symbol prefix is declared but is apparently never used.
This code can probably be written in a more efficient way.
(context,value,identifier){var prefix ---> = <--- this._getPrefix(context);var sourceForm

[WARNING] [WARNING] The symbol self is declared but is apparently never used.
This code can probably be written in a more efficient way.
};var clientIdsByTokens={};var self ---> = <--- {};function Socket(channelToken,url
[INFO] jsf-minimal.js (342,554 bytes) ............................. compressed at 73%
[INFO] Object.js (3,563 bytes) .................................... compressed at 67%
[INFO] _EndImpl.js (1,552 bytes) .................................. compressed at 84%
[INFO] _ExtRuntime.js (7,643 bytes) ............................... compressed at 78%
[INFO] _RuntimeQuirks.js (2,130 bytes) ............................ compressed at 78%
[INFO] _StartImpl.js (1,729 bytes) ................................ compressed at 75%
[INFO] Messages.js (5,777 bytes) .................................. compressed at 47%
[INFO] Messages_de.js (5,949 bytes) ............................... compressed at 44%
[INFO] Messages_es.js (5,488 bytes) ............................... compressed at 39%
[INFO] Messages_fr.js (5,613 bytes) ............................... compressed at 41%
[INFO] Messages_it.js (5,179 bytes) ............................... compressed at 39%
[INFO] Messages_nl.js (5,196 bytes) ............................... compressed at 40%
[INFO] Messages_ru.js (5,935 bytes) ............................... compressed at 34%
[INFO] Messages_zh_CN.js (5,758 bytes) ............................ compressed at 52%
[INFO] Messages_zh_HK.js (6,090 bytes) ............................ compressed at 55%
[INFO] Messages_zh_TW.js (6,499 bytes) ............................ compressed at 58%
[INFO] BaseRequest.js (4,813 bytes) ............................... compressed at 82%
[INFO] FormData.js (2,588 bytes) .................................. compressed at 71%
[INFO] IFrame.js (12,067 bytes) ................................... compressed at 70%
[INFO] Xhr1.js (6,589 bytes) ...................................... compressed at 60%
[INFO] XhrConst.js (1,469 bytes) .................................. compressed at 84%
[INFO] _ExtAjaxRequest.js (2,726 bytes) ........................... compressed at 77%
[INFO] _ExtTransport.js (8,327 bytes) ............................. compressed at 85%

[WARNING] [WARNING] Found an undeclared symbol: jsf
,"partial/ajax");var viewState=decodeURIComponent(jsf ---> . <--- getViewState(this._sourceForm));viewState

[WARNING] [WARNING] The symbol jsf is declared but is apparently never used.
This code can probably be written in a more efficient way.
,"partial/ajax");var viewState=decodeURIComponent(jsf ---> . <--- getViewState(this._sourceForm));viewState
[INFO] _IFrameRequest.js (2,974 bytes) ............................ compressed at 74%
[INFO] _PartialSubmitUtils.js (5,264 bytes) ....................... compressed at 77%
[INFO] _DomExperimental.js (1,629 bytes) .......................... compressed at 75%
[INFO] _DomQuirks.js (25,781 bytes) ............................... compressed at 76%
[INFO] _ExtDom.js (13,061 bytes) .................................. compressed at 74%
[INFO] _ExtLang.js (4,363 bytes) .................................. compressed at 74%
[INFO] _LangQuirks.js (8,389 bytes) ............................... compressed at 77%
[INFO] _Logging.js (4,749 bytes) .................................. compressed at 66%
[INFO] ------------------------------------------------------------------------------
[INFO] compression saved 3,168 bytes
[INFO] 
[INFO] --- maven-compiler-plugin:3.6.1:compile (default-compile) @ myfaces-api ---
[INFO] Nothing to compile - all classes are up to date
[INFO] 
[INFO] --- maven-bundle-plugin:3.0.1:manifest (bundle-manifest) @ myfaces-api ---
[INFO] 
[INFO] --- maven-resources-plugin:2.5:testResources (default-testResources) @ myfaces-api
---
[debug] execute contextualize
[INFO] Using 'UTF-8' encoding to copy filtered resources.
[INFO] skip non existing resourceDirectory F:\jenkins\jenkins-slave\workspace\myfaces-current23\api\src\test\resources
[INFO] Copying 3 resources
[INFO] Copying 3 resources
[INFO] 
[INFO] --- maven-compiler-plugin:3.6.1:testCompile (default-testCompile) @ myfaces-api ---
[INFO] No sources to compile
[INFO] 
[INFO] --- maven-surefire-plugin:2.22.1:test (default-test) @ myfaces-api ---
[INFO] Skipping execution of surefire because it has already been run for this configuration
[JENKINS] Recording test results
[INFO] 
[INFO] --- maven-surefire-plugin:2.22.1:test (default) @ myfaces-api ---
[INFO] Skipping execution of surefire because it has already been run for this configuration
[JENKINS] Recording test results
[INFO] 
[INFO] --- maven-jar-plugin:2.2:jar (default-jar) @ myfaces-api ---
[INFO] Building jar: F:\jenkins\jenkins-slave\workspace\myfaces-current23\api\target\myfaces-api-3.0.0-SNAPSHOT.jar
[INFO] 
[INFO] >>> maven-source-plugin:2.2.1:jar (attach-source) > generate-sources @
myfaces-api >>>
[INFO] 
[INFO] --- maven-enforcer-plugin:1.4.1:enforce (enforce-maven-version) @ myfaces-api ---
[INFO] 
[INFO] --- build-helper-maven-plugin:1.9.1:parse-version (parse-version) @ myfaces-api ---
[INFO] 
[INFO] --- myfaces-builder-plugin:1.0.10:build-metadata (default) @ myfaces-api ---
[INFO] model is up to date
[INFO] 
[INFO] --- myfaces-builder-plugin:1.0.10:make-components (makecomp) @ myfaces-api ---
[INFO] generated component files are up to date
[WARNING] Failed to getClass for org.apache.maven.plugin.source.SourceJarMojo
[INFO] 
[INFO] <<< maven-source-plugin:2.2.1:jar (attach-source) < generate-sources @
myfaces-api <<<
[INFO] 
[INFO] 
[INFO] --- maven-source-plugin:2.2.1:jar (attach-source) @ myfaces-api ---
[INFO] Building jar: F:\jenkins\jenkins-slave\workspace\myfaces-current23\api\target\myfaces-api-3.0.0-SNAPSHOT-sources.jar
[INFO] 
[INFO] --- maven-site-plugin:3.3:attach-descriptor (attach-descriptor) @ myfaces-api ---
[INFO] 
[INFO] --- maven-jar-plugin:2.2:test-jar (default) @ myfaces-api ---
[INFO] Building jar: F:\jenkins\jenkins-slave\workspace\myfaces-current23\api\target\myfaces-api-3.0.0-SNAPSHOT-tests.jar
[INFO] 
[INFO] --- maven-checkstyle-plugin:2.17:check (verify-style) @ myfaces-api ---
[INFO] Starting audit...
Audit done.
[INFO] 
[INFO] --- maven-install-plugin:2.5.2:install (default-install) @ myfaces-api ---
[INFO] Installing F:\jenkins\jenkins-slave\workspace\myfaces-current23\api\target\myfaces-api-3.0.0-SNAPSHOT.jar
to f:\jenkins\jenkins-slave\maven-repositories\1\org\apache\myfaces\core\myfaces-api\3.0.0-SNAPSHOT\myfaces-api-3.0.0-SNAPSHOT.jar
[INFO] Installing F:\jenkins\jenkins-slave\workspace\myfaces-current23\api\pom.xml to f:\jenkins\jenkins-slave\maven-repositories\1\org\apache\myfaces\core\myfaces-api\3.0.0-SNAPSHOT\myfaces-api-3.0.0-SNAPSHOT.pom
[INFO] Installing F:\jenkins\jenkins-slave\workspace\myfaces-current23\api\target\myfaces-api-3.0.0-SNAPSHOT-sources.jar
to f:\jenkins\jenkins-slave\maven-repositories\1\org\apache\myfaces\core\myfaces-api\3.0.0-SNAPSHOT\myfaces-api-3.0.0-SNAPSHOT-sources.jar
[INFO] Installing F:\jenkins\jenkins-slave\workspace\myfaces-current23\api\target\myfaces-api-3.0.0-SNAPSHOT-tests.jar
to f:\jenkins\jenkins-slave\maven-repositories\1\org\apache\myfaces\core\myfaces-api\3.0.0-SNAPSHOT\myfaces-api-3.0.0-SNAPSHOT-tests.jar
[INFO] Installing F:\jenkins\jenkins-slave\workspace\myfaces-current23\api\target\myfaces-api-3.0.0-SNAPSHOT-sources.jar
to f:\jenkins\jenkins-slave\maven-repositories\1\org\apache\myfaces\core\myfaces-api\3.0.0-SNAPSHOT\myfaces-api-3.0.0-SNAPSHOT-sources.jar
[INFO] Installing F:\jenkins\jenkins-slave\workspace\myfaces-current23\api\target\myfaces-api-3.0.0-SNAPSHOT-tests.jar
to f:\jenkins\jenkins-slave\maven-repositories\1\org\apache\myfaces\core\myfaces-api\3.0.0-SNAPSHOT\myfaces-api-3.0.0-SNAPSHOT-tests.jar
[INFO] 
[INFO] --- maven-deploy-plugin:2.8.2:deploy (default-deploy) @ myfaces-api ---
[INFO] Downloading from apache.snapshots.https: https://repository.apache.org/content/repositories/snapshots/org/apache/myfaces/core/myfaces-api/3.0.0-SNAPSHOT/maven-metadata.xml
[INFO] Downloaded from apache.snapshots.https: https://repository.apache.org/content/repositories/snapshots/org/apache/myfaces/core/myfaces-api/3.0.0-SNAPSHOT/maven-metadata.xml
(1.2 kB at 2.0 kB/s)
[INFO] Uploading to apache.snapshots.https: https://repository.apache.org/content/repositories/snapshots/org/apache/myfaces/core/myfaces-api/3.0.0-SNAPSHOT/myfaces-api-3.0.0-20181020.224350-17.jar
[INFO] Uploaded to apache.snapshots.https: https://repository.apache.org/content/repositories/snapshots/org/apache/myfaces/core/myfaces-api/3.0.0-SNAPSHOT/myfaces-api-3.0.0-20181020.224350-17.jar
(1.3 MB at 740 kB/s)
[INFO] Uploading to apache.snapshots.https: https://repository.apache.org/content/repositories/snapshots/org/apache/myfaces/core/myfaces-api/3.0.0-SNAPSHOT/myfaces-api-3.0.0-20181020.224350-17.pom
[INFO] Uploaded to apache.snapshots.https: https://repository.apache.org/content/repositories/snapshots/org/apache/myfaces/core/myfaces-api/3.0.0-SNAPSHOT/myfaces-api-3.0.0-20181020.224350-17.pom
(34 kB at 28 kB/s)
[INFO] Downloading from apache.snapshots.https: https://repository.apache.org/content/repositories/snapshots/org/apache/myfaces/core/myfaces-api/maven-metadata.xml
[INFO] Downloaded from apache.snapshots.https: https://repository.apache.org/content/repositories/snapshots/org/apache/myfaces/core/myfaces-api/maven-metadata.xml
(653 B at 1.1 kB/s)
[INFO] Uploading to apache.snapshots.https: https://repository.apache.org/content/repositories/snapshots/org/apache/myfaces/core/myfaces-api/3.0.0-SNAPSHOT/maven-metadata.xml
[INFO] Uploaded to apache.snapshots.https: https://repository.apache.org/content/repositories/snapshots/org/apache/myfaces/core/myfaces-api/3.0.0-SNAPSHOT/maven-metadata.xml
(1.2 kB at 1.1 kB/s)
[INFO] Uploading to apache.snapshots.https: https://repository.apache.org/content/repositories/snapshots/org/apache/myfaces/core/myfaces-api/maven-metadata.xml
[INFO] Uploaded to apache.snapshots.https: https://repository.apache.org/content/repositories/snapshots/org/apache/myfaces/core/myfaces-api/maven-metadata.xml
(653 B at 549 B/s)
[INFO] Uploading to apache.snapshots.https: https://repository.apache.org/content/repositories/snapshots/org/apache/myfaces/core/myfaces-api/3.0.0-SNAPSHOT/myfaces-api-3.0.0-20181020.224350-17-sources.jar
[INFO] Uploaded to apache.snapshots.https: https://repository.apache.org/content/repositories/snapshots/org/apache/myfaces/core/myfaces-api/3.0.0-SNAPSHOT/myfaces-api-3.0.0-20181020.224350-17-sources.jar
(972 kB at 546 kB/s)
[INFO] Uploading to apache.snapshots.https: https://repository.apache.org/content/repositories/snapshots/org/apache/myfaces/core/myfaces-api/3.0.0-SNAPSHOT/maven-metadata.xml
[INFO] Uploaded to apache.snapshots.https: https://repository.apache.org/content/repositories/snapshots/org/apache/myfaces/core/myfaces-api/3.0.0-SNAPSHOT/maven-metadata.xml
(1.2 kB at 1.0 kB/s)
[INFO] Uploading to apache.snapshots.https: https://repository.apache.org/content/repositories/snapshots/org/apache/myfaces/core/myfaces-api/3.0.0-SNAPSHOT/myfaces-api-3.0.0-20181020.224350-17-tests.jar
[INFO] Uploaded to apache.snapshots.https: https://repository.apache.org/content/repositories/snapshots/org/apache/myfaces/core/myfaces-api/3.0.0-SNAPSHOT/myfaces-api-3.0.0-20181020.224350-17-tests.jar
(12 kB at 10 kB/s)
[INFO] Uploading to apache.snapshots.https: https://repository.apache.org/content/repositories/snapshots/org/apache/myfaces/core/myfaces-api/3.0.0-SNAPSHOT/maven-metadata.xml
[INFO] Uploaded to apache.snapshots.https: https://repository.apache.org/content/repositories/snapshots/org/apache/myfaces/core/myfaces-api/3.0.0-SNAPSHOT/maven-metadata.xml
(1.2 kB at 1.1 kB/s)
[INFO] Uploading to apache.snapshots.https: https://repository.apache.org/content/repositories/snapshots/org/apache/myfaces/core/myfaces-api/3.0.0-SNAPSHOT/myfaces-api-3.0.0-20181020.224350-17-sources.jar
[INFO] Uploaded to apache.snapshots.https: https://repository.apache.org/content/repositories/snapshots/org/apache/myfaces/core/myfaces-api/3.0.0-SNAPSHOT/myfaces-api-3.0.0-20181020.224350-17-sources.jar
(972 kB at 555 kB/s)
[INFO] Uploading to apache.snapshots.https: https://repository.apache.org/content/repositories/snapshots/org/apache/myfaces/core/myfaces-api/3.0.0-SNAPSHOT/maven-metadata.xml
[INFO] Uploaded to apache.snapshots.https: https://repository.apache.org/content/repositories/snapshots/org/apache/myfaces/core/myfaces-api/3.0.0-SNAPSHOT/maven-metadata.xml
(1.2 kB at 1.1 kB/s)
[INFO] Uploading to apache.snapshots.https: https://repository.apache.org/content/repositories/snapshots/org/apache/myfaces/core/myfaces-api/3.0.0-SNAPSHOT/myfaces-api-3.0.0-20181020.224350-17-tests.jar
[INFO] Uploaded to apache.snapshots.https: https://repository.apache.org/content/repositories/snapshots/org/apache/myfaces/core/myfaces-api/3.0.0-SNAPSHOT/myfaces-api-3.0.0-20181020.224350-17-tests.jar
(12 kB at 11 kB/s)
[INFO] Uploading to apache.snapshots.https: https://repository.apache.org/content/repositories/snapshots/org/apache/myfaces/core/myfaces-api/3.0.0-SNAPSHOT/maven-metadata.xml
[INFO] Uploaded to apache.snapshots.https: https://repository.apache.org/content/repositories/snapshots/org/apache/myfaces/core/myfaces-api/3.0.0-SNAPSHOT/maven-metadata.xml
(1.2 kB at 1.1 kB/s)
[INFO] 
[INFO] ------------------------------------------------------------------------
[INFO] Building Apache MyFaces Core 3.0 - Impl 3.0.0-SNAPSHOT
[INFO] ------------------------------------------------------------------------
[WARNING] The POM for org.apache.myfaces.test:myfaces-test30:jar:1.0.9-SNAPSHOT is missing,
no dependency information available
[INFO] ------------------------------------------------------------------------
[INFO] Reactor Summary:
[INFO] 
[INFO] Apache MyFaces Core 3.0 - Parent ................... SUCCESS [ 17.964 s]
[INFO] Apache MyFaces Core 3.0 - API ...................... SUCCESS [01:08 min]
[INFO] Apache MyFaces Core 3.0 - Impl ..................... FAILURE [  0.280 s]
[INFO] Apache MyFaces Core 3.0 - OSGi Bundle .............. SKIPPED
[INFO] Apache MyFaces Core 3.0 ............................ SKIPPED
[INFO] ------------------------------------------------------------------------
[INFO] BUILD FAILURE
[INFO] ------------------------------------------------------------------------
[INFO] Total time: 01:36 min
[INFO] Finished at: 2018-10-20T15:44:11-07:00
[INFO] Final Memory: 75M/778M
[INFO] ------------------------------------------------------------------------
[ERROR] Failed to execute goal on project myfaces-impl: Could not resolve dependencies for
project org.apache.myfaces.core:myfaces-impl:jar:3.0.0-SNAPSHOT: Failure to find org.apache.myfaces.test:myfaces-test30:jar:1.0.9-SNAPSHOT
in http://repository.apache.org/snapshots/ was cached in the local repository, resolution
will not be reattempted until the update interval of apache-snapshots has elapsed or updates
are forced -> [Help 1]
[ERROR] 
[ERROR] To see the full stack trace of the errors, re-run Maven with the -e switch.
[ERROR] Re-run Maven using the -X switch to enable full debug logging.
[ERROR] 
[ERROR] For more information about the errors and possible solutions, please read the following
articles:
[ERROR] [Help 1] http://cwiki.apache.org/confluence/display/MAVEN/DependencyResolutionException
[ERROR] 
[ERROR] After correcting the problems, you can resume the build with the command
[ERROR]   mvn <goals> -rf :myfaces-impl
[JENKINS] Archiving F:\jenkins\jenkins-slave\workspace\myfaces-current23\api\pom.xml to org.apache.myfaces.core/myfaces-api/3.0.0-SNAPSHOT/myfaces-api-3.0.0-SNAPSHOT.pom
[JENKINS] Archiving F:\jenkins\jenkins-slave\workspace\myfaces-current23\api\target\myfaces-api-3.0.0-SNAPSHOT.jar
to org.apache.myfaces.core/myfaces-api/3.0.0-20181020.224350-17/myfaces-api-3.0.0-20181020.224350-17.jar
[JENKINS] Archiving F:\jenkins\jenkins-slave\workspace\myfaces-current23\api\target\myfaces-api-3.0.0-SNAPSHOT-sources.jar
to org.apache.myfaces.core/myfaces-api/3.0.0-20181020.224350-17/myfaces-api-3.0.0-20181020.224350-17-sources.jar
[JENKINS] Archiving F:\jenkins\jenkins-slave\workspace\myfaces-current23\api\target\myfaces-api-3.0.0-SNAPSHOT-tests.jar
to org.apache.myfaces.core/myfaces-api/3.0.0-20181020.224350-17/myfaces-api-3.0.0-20181020.224350-17-tests.jar
[Fast Archiver] Compressed 2.22 MB of artifacts by 29.5% relative to #357
[JENKINS] Archiving F:\jenkins\jenkins-slave\workspace\myfaces-current23\impl\pom.xml to org.apache.myfaces.core/myfaces-impl/3.0.0-SNAPSHOT/myfaces-impl-3.0.0-SNAPSHOT.pom
[JENKINS] Archiving F:\jenkins\jenkins-slave\workspace\myfaces-current23\bundle\pom.xml to
org.apache.myfaces.core/myfaces-bundle/3.0.0-SNAPSHOT/myfaces-bundle-3.0.0-SNAPSHOT.pom
[JENKINS] Archiving <https://builds.apache.org/job/myfaces-current23/ws/pom.xml> to
org.apache.myfaces.core/myfaces-core-module/3.0.0-SNAPSHOT/myfaces-core-module-3.0.0-SNAPSHOT.pom
[JENKINS] Archiving F:\jenkins\jenkins-slave\workspace\myfaces-current23\parent\pom.xml to
org.apache.myfaces.core/myfaces-core-project/3.0.0-SNAPSHOT/myfaces-core-project-3.0.0-SNAPSHOT.pom
[JENKINS] Archiving F:\jenkins\jenkins-slave\workspace\myfaces-current23\parent\target\myfaces-core-project-3.0.0-SNAPSHOT-site.xml
to org.apache.myfaces.core/myfaces-core-project/3.0.0-20181020.224246-22/myfaces-core-project-3.0.0-20181020.224246-22-site.xml
Sending e-mails to: commits@myfaces.apache.org grantsmith@apache.org tandraschko@apache.org
channel stopped
Java HotSpot(TM) 64-Bit Server VM warning: ignoring option MaxPermSize=256m; support was removed
in 8.0

Mime
View raw message