myfaces-commits mailing list archives

Site index · List index
Message view « Date » · « Thread »
Top « Date » · « Thread »
From Apache Jenkins Server <jenk...@builds.apache.org>
Subject Build failed in Jenkins: Tobago Trunk #1610
Date Thu, 29 Nov 2018 14:42:51 GMT
See <https://builds.apache.org/job/Tobago%20Trunk/1610/display/redirect?page=changes>

Changes:

[lofwyr] TOBAGO-1757: Docker example for demo

[lofwyr] show CDI version

[lofwyr] TOBAGO-1757: Docker example for demo

------------------------------------------
[...truncated 268.26 KB...]
[INFO] > tobago-theme-charlotteville@5.0.0-SNAPSHOT css <https://builds.apache.org/job/Tobago%20Trunk/ws/tobago-theme/tobago-theme-charlotteville/target/npm>
[INFO] > npm-run-all --parallel css-compile --sequential css-prefix css-minify
[INFO] 
[INFO] 
[INFO] > tobago-theme-charlotteville@5.0.0-SNAPSHOT css-compile <https://builds.apache.org/job/Tobago%20Trunk/ws/tobago-theme/tobago-theme-charlotteville/target/npm>
[INFO] > node-sass --output-style expanded --source-map true --source-map-contents true
--precision 6 scss/tobago-theme.scss css/tobago.css
[INFO] 
[INFO] Rendering Complete, saving .css file...
[INFO] Wrote CSS to <https://builds.apache.org/job/Tobago%20Trunk/ws/tobago-theme/tobago-theme-charlotteville/target/npm/css/tobago.css>
[INFO] Wrote Source Map to <https://builds.apache.org/job/Tobago%20Trunk/ws/tobago-theme/tobago-theme-charlotteville/target/npm/css/tobago.css.map>
[INFO] 
[INFO] > tobago-theme-charlotteville@5.0.0-SNAPSHOT css-prefix <https://builds.apache.org/job/Tobago%20Trunk/ws/tobago-theme/tobago-theme-charlotteville/target/npm>
[INFO] > postcss --config postcss.config.js --replace "css/*.css" "!css/*.min.css"
[INFO] 
[INFO] 
[INFO] > tobago-theme-charlotteville@5.0.0-SNAPSHOT css-minify <https://builds.apache.org/job/Tobago%20Trunk/ws/tobago-theme/tobago-theme-charlotteville/target/npm>
[INFO] > cleancss --level 1 --source-map --source-map-inline-sources --output css/tobago.min.css
css/tobago.css
[INFO] 
[INFO] 
[INFO] --- maven-resources-plugin:2.7:resources (default-resources) @ tobago-theme-charlotteville
---
[INFO] Using 'UTF-8' encoding to copy filtered resources.
[INFO] Copying 1 resource
[INFO] skip non existing resourceDirectory <https://builds.apache.org/job/Tobago%20Trunk/ws/tobago-theme/tobago-theme-charlotteville/src/main/resources/META-INF/resources/tobago/charlotteville>
[INFO] skip non existing resourceDirectory <https://builds.apache.org/job/Tobago%20Trunk/ws/tobago-theme/tobago-theme-charlotteville/src/main/resources/META-INF/resources/tobago/charlotteville/tobago-bootstrap/_version>
[INFO] Copying 3 resources
[INFO] Copying 3 resources
[INFO] 
[INFO] --- maven-resources-plugin:2.7:copy-resources (step #6: copy-bootstrap-dist to src)
@ tobago-theme-charlotteville ---
[INFO] Using 'UTF-8' encoding to copy filtered resources.
[INFO] Copying 1 resource
[INFO] 
[INFO] --- maven-resources-plugin:2.7:copy-resources (step #7: copy-bootstrap-dist to target)
@ tobago-theme-charlotteville ---
[INFO] Using 'UTF-8' encoding to copy filtered resources.
[INFO] Copying 4 resources
[INFO] 
[INFO] --- maven-compiler-plugin:3.8.0:compile (default-compile) @ tobago-theme-charlotteville
---
[INFO] No sources to compile
[INFO] 
[INFO] --- maven-resources-plugin:2.7:testResources (default-testResources) @ tobago-theme-charlotteville
---
[INFO] Using 'UTF-8' encoding to copy filtered resources.
[INFO] skip non existing resourceDirectory <https://builds.apache.org/job/Tobago%20Trunk/ws/tobago-theme/tobago-theme-charlotteville/src/test/resources>
[INFO] Copying 3 resources
[INFO] Copying 3 resources
[INFO] 
[INFO] --- maven-compiler-plugin:3.8.0:testCompile (default-testCompile) @ tobago-theme-charlotteville
---
[INFO] No sources to compile
[INFO] 
[INFO] --- maven-surefire-plugin:2.19.1:test (default-test) @ tobago-theme-charlotteville
---
[JENKINS] Recording test results
[INFO] 
[INFO] --- maven-jar-plugin:3.0.2:jar (default-jar) @ tobago-theme-charlotteville ---
[INFO] Building jar: <https://builds.apache.org/job/Tobago%20Trunk/ws/tobago-theme/tobago-theme-charlotteville/target/tobago-theme-charlotteville-5.0.0-SNAPSHOT.jar>
[INFO] 
[INFO] --- maven-site-plugin:3.6:attach-descriptor (attach-descriptor) @ tobago-theme-charlotteville
---
[INFO] Skipping because packaging 'jar' is not pom.
[INFO] 
[INFO] --- maven-install-plugin:2.5.2:install (default-install) @ tobago-theme-charlotteville
---
[INFO] Installing <https://builds.apache.org/job/Tobago%20Trunk/ws/tobago-theme/tobago-theme-charlotteville/target/tobago-theme-charlotteville-5.0.0-SNAPSHOT.jar>
to /home/jenkins/jenkins-slave/maven-repositories/0/org/apache/myfaces/tobago/tobago-theme-charlotteville/5.0.0-SNAPSHOT/tobago-theme-charlotteville-5.0.0-SNAPSHOT.jar
[INFO] Installing <https://builds.apache.org/job/Tobago%20Trunk/ws/tobago-theme/tobago-theme-charlotteville/pom.xml>
to /home/jenkins/jenkins-slave/maven-repositories/0/org/apache/myfaces/tobago/tobago-theme-charlotteville/5.0.0-SNAPSHOT/tobago-theme-charlotteville-5.0.0-SNAPSHOT.pom
[INFO] 
[INFO] --------------< org.apache.myfaces.tobago:tobago-example >--------------
[INFO] Building Tobago Examples 5.0.0-SNAPSHOT                          [15/19]
[INFO] --------------------------------[ pom ]---------------------------------
[INFO] 
[INFO] --- maven-clean-plugin:2.6.1:clean (default-clean) @ tobago-example ---
[INFO] Deleting <https://builds.apache.org/job/Tobago%20Trunk/ws/tobago-example/target>
[INFO] 
[INFO] --- animal-sniffer-maven-plugin:1.14:check (default-cli) @ tobago-example ---
[INFO] Checking unresolved references to org.codehaus.mojo.signature:java18:1.0
[INFO] 
[INFO] --- maven-checkstyle-plugin:2.17:check (default-cli) @ tobago-example ---
[INFO] Starting audit...
Audit done.
[INFO] 
[INFO] --- maven-enforcer-plugin:3.0.0-M1:enforce (enforce-maven-version) @ tobago-example
---
[INFO] 
[INFO] --- maven-enforcer-plugin:3.0.0-M1:enforce (enforce) @ tobago-example ---
[INFO] 
[INFO] --- maven-remote-resources-plugin:1.5:process (default) @ tobago-example ---
[INFO] 
[INFO] --- maven-remote-resources-plugin:1.5:process (process-resource-bundles) @ tobago-example
---
[INFO] 
[INFO] --- maven-site-plugin:3.6:attach-descriptor (attach-descriptor) @ tobago-example ---
[INFO] No site descriptor found: nothing to attach.
[INFO] 
[INFO] --- maven-install-plugin:2.5.2:install (default-install) @ tobago-example ---
[INFO] Installing <https://builds.apache.org/job/Tobago%20Trunk/ws/tobago-example/pom.xml>
to /home/jenkins/jenkins-slave/maven-repositories/0/org/apache/myfaces/tobago/tobago-example/5.0.0-SNAPSHOT/tobago-example-5.0.0-SNAPSHOT.pom
[INFO] 
[INFO] -----------< org.apache.myfaces.tobago:tobago-example-blank >-----------
[INFO] Building Tobago Example Blank 5.0.0-SNAPSHOT                     [16/19]
[INFO] --------------------------------[ war ]---------------------------------
[INFO] 
[INFO] --- maven-clean-plugin:2.6.1:clean (default-clean) @ tobago-example-blank ---
[INFO] Deleting <https://builds.apache.org/job/Tobago%20Trunk/ws/tobago-example/tobago-example-blank/target>
[INFO] 
[INFO] --- animal-sniffer-maven-plugin:1.14:check (default-cli) @ tobago-example-blank ---
[INFO] Checking unresolved references to org.codehaus.mojo.signature:java18:1.0
[INFO] 
[INFO] --- maven-checkstyle-plugin:2.17:check (default-cli) @ tobago-example-blank ---
[INFO] Starting audit...
Audit done.
[INFO] 
[INFO] --- maven-enforcer-plugin:3.0.0-M1:enforce (enforce-maven-version) @ tobago-example-blank
---
[INFO] 
[INFO] --- maven-enforcer-plugin:3.0.0-M1:enforce (enforce) @ tobago-example-blank ---
[INFO] 
[INFO] --- maven-remote-resources-plugin:1.5:process (default) @ tobago-example-blank ---
[INFO] 
[INFO] --- maven-remote-resources-plugin:1.5:process (process-resource-bundles) @ tobago-example-blank
---
[INFO] 
[INFO] --- maven-resources-plugin:2.7:resources (default-resources) @ tobago-example-blank
---
[INFO] Using 'UTF-8' encoding to copy filtered resources.
[INFO] Copying 1 resource
[INFO] Copying 3 resources
[INFO] Copying 3 resources
[INFO] 
[INFO] --- maven-compiler-plugin:3.8.0:compile (default-compile) @ tobago-example-blank ---
[INFO] Compiling 1 source file to <https://builds.apache.org/job/Tobago%20Trunk/ws/tobago-example/tobago-example-blank/target/classes>
[INFO] 
[INFO] --- maven-resources-plugin:2.7:testResources (default-testResources) @ tobago-example-blank
---
[INFO] Using 'UTF-8' encoding to copy filtered resources.
[INFO] skip non existing resourceDirectory <https://builds.apache.org/job/Tobago%20Trunk/ws/tobago-example/tobago-example-blank/src/test/resources>
[INFO] Copying 3 resources
[INFO] Copying 3 resources
[INFO] 
[INFO] --- maven-compiler-plugin:3.8.0:testCompile (default-testCompile) @ tobago-example-blank
---
[INFO] No sources to compile
[INFO] 
[INFO] --- maven-surefire-plugin:2.19.1:test (default-test) @ tobago-example-blank ---
[JENKINS] Recording test results
[INFO] 
[INFO] --- maven-war-plugin:3.1.0:war (default-war) @ tobago-example-blank ---
[INFO] Packaging webapp
[INFO] Assembling webapp [tobago-example-blank] in [<https://builds.apache.org/job/Tobago%20Trunk/ws/tobago-example/tobago-example-blank/target/tobago-example-blank]>
[INFO] Processing war project
[INFO] Copying webapp resources [<https://builds.apache.org/job/Tobago%20Trunk/ws/tobago-example/tobago-example-blank/src/main/webapp]>
[INFO] Webapp assembled in [71 msecs]
[INFO] Building war: <https://builds.apache.org/job/Tobago%20Trunk/ws/tobago-example/tobago-example-blank/target/tobago-example-blank.war>
[INFO] 
[INFO] --- maven-site-plugin:3.6:attach-descriptor (attach-descriptor) @ tobago-example-blank
---
[INFO] Skipping because packaging 'war' is not pom.
[INFO] 
[INFO] --- maven-install-plugin:2.5.2:install (default-install) @ tobago-example-blank ---
[INFO] Installing <https://builds.apache.org/job/Tobago%20Trunk/ws/tobago-example/tobago-example-blank/target/tobago-example-blank.war>
to /home/jenkins/jenkins-slave/maven-repositories/0/org/apache/myfaces/tobago/tobago-example-blank/5.0.0-SNAPSHOT/tobago-example-blank-5.0.0-SNAPSHOT.war
[INFO] Installing <https://builds.apache.org/job/Tobago%20Trunk/ws/tobago-example/tobago-example-blank/pom.xml>
to /home/jenkins/jenkins-slave/maven-repositories/0/org/apache/myfaces/tobago/tobago-example-blank/5.0.0-SNAPSHOT/tobago-example-blank-5.0.0-SNAPSHOT.pom
[INFO] 
[INFO] -----------< org.apache.myfaces.tobago:tobago-example-demo >------------
[INFO] Building Tobago Example Demo 5.0.0-SNAPSHOT                      [17/19]
[INFO] --------------------------------[ war ]---------------------------------
[INFO] 
[INFO] --- maven-clean-plugin:2.6.1:clean (default-clean) @ tobago-example-demo ---
[INFO] Deleting <https://builds.apache.org/job/Tobago%20Trunk/ws/tobago-example/tobago-example-demo/target>
[INFO] 
[INFO] --- animal-sniffer-maven-plugin:1.14:check (default-cli) @ tobago-example-demo ---
[INFO] Checking unresolved references to org.codehaus.mojo.signature:java18:1.0
[INFO] 
[INFO] --- maven-checkstyle-plugin:2.17:check (default-cli) @ tobago-example-demo ---
[INFO] Starting audit...
<https://builds.apache.org/job/Tobago%20Trunk/ws/tobago-example/tobago-example-demo/src/main/java/org/apache/myfaces/tobago/example/demo/Version.java>:31:32:
error: Name 'cdi10' must match pattern '^[A-Z][A-Z0-9]*(_[A-Z0-9]+)*$'.
<https://builds.apache.org/job/Tobago%20Trunk/ws/tobago-example/tobago-example-demo/src/main/java/org/apache/myfaces/tobago/example/demo/Version.java>:32:32:
error: Name 'cdi1112' must match pattern '^[A-Z][A-Z0-9]*(_[A-Z0-9]+)*$'.
<https://builds.apache.org/job/Tobago%20Trunk/ws/tobago-example/tobago-example-demo/src/main/java/org/apache/myfaces/tobago/example/demo/Version.java>:33:32:
error: Name 'cdi20' must match pattern '^[A-Z][A-Z0-9]*(_[A-Z0-9]+)*$'.
Audit done.
[INFO] There are 3 errors reported by Checkstyle 6.11.2 with tobago/checkstyle.xml ruleset.
[ERROR] src/main/java/org/apache/myfaces/tobago/example/demo/Version.java:[31,32] (naming)
ConstantName: Name 'cdi10' must match pattern '^[A-Z][A-Z0-9]*(_[A-Z0-9]+)*$'.
[ERROR] src/main/java/org/apache/myfaces/tobago/example/demo/Version.java:[32,32] (naming)
ConstantName: Name 'cdi1112' must match pattern '^[A-Z][A-Z0-9]*(_[A-Z0-9]+)*$'.
[ERROR] src/main/java/org/apache/myfaces/tobago/example/demo/Version.java:[33,32] (naming)
ConstantName: Name 'cdi20' must match pattern '^[A-Z][A-Z0-9]*(_[A-Z0-9]+)*$'.
[INFO] ------------------------------------------------------------------------
[INFO] Reactor Summary:
[INFO] 
[INFO] Apache Tobago 5.0.0-SNAPSHOT ....................... SUCCESS [  9.284 s]
[INFO] Tobago Tool ........................................ SUCCESS [  3.781 s]
[INFO] Tobago Package for jQuery UI ....................... SUCCESS [  6.321 s]
[INFO] Tobago Package for Typeahead ....................... SUCCESS [  5.435 s]
[INFO] Tobago Tool Annotation ............................. SUCCESS [  5.791 s]
[INFO] Tobago Tool Apt .................................... SUCCESS [01:09 min]
[INFO] Tobago Tool Test ................................... SUCCESS [  4.803 s]
[INFO] Tobago Core ........................................ SUCCESS [ 20.430 s]
[INFO] Tobago Themes ...................................... SUCCESS [  5.944 s]
[INFO] Tobago Theme Standard .............................. SUCCESS [ 35.406 s]
[INFO] Tobago Theme Scarborough ........................... SUCCESS [ 30.201 s]
[INFO] Tobago Theme Speyside .............................. SUCCESS [ 29.711 s]
[INFO] Tobago Theme Roxborough ............................ SUCCESS [ 31.217 s]
[INFO] Tobago Theme Charlotteville ........................ SUCCESS [ 29.766 s]
[INFO] Tobago Examples .................................... SUCCESS [  4.617 s]
[INFO] Tobago Example Blank ............................... SUCCESS [  6.700 s]
[INFO] Tobago Example Demo ................................ FAILURE [  3.611 s]
[INFO] Tobago Example Assembly ............................ SKIPPED
[INFO] Tobago Assembly 5.0.0-SNAPSHOT ..................... SKIPPED
[INFO] ------------------------------------------------------------------------
[INFO] BUILD FAILURE
[INFO] ------------------------------------------------------------------------
[INFO] Total time: 06:26 min
[INFO] Finished at: 2018-11-29T14:42:21Z
[INFO] ------------------------------------------------------------------------
Waiting for Jenkins to finish collecting data
[ERROR] Failed to execute goal org.apache.maven.plugins:maven-checkstyle-plugin:2.17:check
(default-cli) on project tobago-example-demo: You have 3 Checkstyle violations. -> [Help
1]
[ERROR] 
[ERROR] To see the full stack trace of the errors, re-run Maven with the -e switch.
[ERROR] Re-run Maven using the -X switch to enable full debug logging.
[ERROR] 
[ERROR] For more information about the errors and possible solutions, please read the following
articles:
[ERROR] [Help 1] http://cwiki.apache.org/confluence/display/MAVEN/MojoFailureException
[ERROR] 
[ERROR] After correcting the problems, you can resume the build with the command
[ERROR]   mvn <goals> -rf :tobago-example-demo
[JENKINS] Archiving <https://builds.apache.org/job/Tobago%20Trunk/ws/tobago-theme/pom.xml>
to org.apache.myfaces.tobago/tobago-theme/5.0.0-SNAPSHOT/tobago-theme-5.0.0-SNAPSHOT.pom
[JENKINS] Archiving <https://builds.apache.org/job/Tobago%20Trunk/ws/tobago-example/tobago-example-blank/pom.xml>
to org.apache.myfaces.tobago/tobago-example-blank/5.0.0-SNAPSHOT/tobago-example-blank-5.0.0-SNAPSHOT.pom
[JENKINS] Archiving <https://builds.apache.org/job/Tobago%20Trunk/ws/tobago-example/tobago-example-blank/target/tobago-example-blank.war>
to org.apache.myfaces.tobago/tobago-example-blank/5.0.0-SNAPSHOT/tobago-example-blank-5.0.0-SNAPSHOT.war
[Fast Archiver] Compressed 10.14 MB of artifacts by 67.8% relative to #1609
[JENKINS] Archiving <https://builds.apache.org/job/Tobago%20Trunk/ws/tobago-assembly/pom.xml>
to org.apache.myfaces.tobago/tobago-assembly/5.0.0-SNAPSHOT/tobago-assembly-5.0.0-SNAPSHOT.pom
[JENKINS] Archiving <https://builds.apache.org/job/Tobago%20Trunk/ws/pom.xml> to org.apache.myfaces.tobago/tobago/5.0.0-SNAPSHOT/tobago-5.0.0-SNAPSHOT.pom
[JENKINS] Archiving <https://builds.apache.org/job/Tobago%20Trunk/ws/target/tobago-5.0.0-SNAPSHOT-site.xml>
to org.apache.myfaces.tobago/tobago/5.0.0-SNAPSHOT/tobago-5.0.0-SNAPSHOT-site.xml
[Fast Archiver] Compressed 52.10 KB of artifacts by 61.4% relative to #1609
[JENKINS] Archiving <https://builds.apache.org/job/Tobago%20Trunk/ws/tobago-theme/tobago-theme-standard/pom.xml>
to org.apache.myfaces.tobago/tobago-theme-standard/5.0.0-SNAPSHOT/tobago-theme-standard-5.0.0-SNAPSHOT.pom
[JENKINS] Archiving <https://builds.apache.org/job/Tobago%20Trunk/ws/tobago-theme/tobago-theme-standard/target/tobago-theme-standard-5.0.0-SNAPSHOT.jar>
to org.apache.myfaces.tobago/tobago-theme-standard/5.0.0-SNAPSHOT/tobago-theme-standard-5.0.0-SNAPSHOT.jar
[Fast Archiver] Compressed 464.06 KB of artifacts by 41.4% relative to #1609
[JENKINS] Archiving <https://builds.apache.org/job/Tobago%20Trunk/ws/tobago-theme/tobago-theme-scarborough/pom.xml>
to org.apache.myfaces.tobago/tobago-theme-scarborough/5.0.0-SNAPSHOT/tobago-theme-scarborough-5.0.0-SNAPSHOT.pom
[JENKINS] Archiving <https://builds.apache.org/job/Tobago%20Trunk/ws/tobago-theme/tobago-theme-scarborough/target/tobago-theme-scarborough-5.0.0-SNAPSHOT.jar>
to org.apache.myfaces.tobago/tobago-theme-scarborough/5.0.0-SNAPSHOT/tobago-theme-scarborough-5.0.0-SNAPSHOT.jar
[Fast Archiver] Compressed 277.02 KB of artifacts by 46.2% relative to #1609
[JENKINS] Archiving <https://builds.apache.org/job/Tobago%20Trunk/ws/tobago-example/tobago-example-assembly/pom.xml>
to org.apache.myfaces.tobago/tobago-example-assembly/5.0.0-SNAPSHOT/tobago-example-assembly-5.0.0-SNAPSHOT.pom
[JENKINS] Archiving <https://builds.apache.org/job/Tobago%20Trunk/ws/tobago-tool/tobago-pack-jquery-ui/pom.xml>
to org.apache.myfaces.tobago/tobago-pack-jquery-ui/5.0.0-SNAPSHOT/tobago-pack-jquery-ui-5.0.0-SNAPSHOT.pom
[JENKINS] Archiving <https://builds.apache.org/job/Tobago%20Trunk/ws/tobago-tool/tobago-pack-jquery-ui/target/tobago-pack-jquery-ui-5.0.0-SNAPSHOT.jar>
to org.apache.myfaces.tobago/tobago-pack-jquery-ui/5.0.0-SNAPSHOT/tobago-pack-jquery-ui-5.0.0-SNAPSHOT.jar
[JENKINS] Archiving <https://builds.apache.org/job/Tobago%20Trunk/ws/tobago-tool/tobago-tool-test/pom.xml>
to org.apache.myfaces.tobago/tobago-tool-test/5.0.0-SNAPSHOT/tobago-tool-test-5.0.0-SNAPSHOT.pom
[JENKINS] Archiving <https://builds.apache.org/job/Tobago%20Trunk/ws/tobago-tool/tobago-tool-test/target/tobago-tool-test-5.0.0-SNAPSHOT.jar>
to org.apache.myfaces.tobago/tobago-tool-test/5.0.0-SNAPSHOT/tobago-tool-test-5.0.0-SNAPSHOT.jar
[JENKINS] Archiving <https://builds.apache.org/job/Tobago%20Trunk/ws/tobago-theme/tobago-theme-speyside/pom.xml>
to org.apache.myfaces.tobago/tobago-theme-speyside/5.0.0-SNAPSHOT/tobago-theme-speyside-5.0.0-SNAPSHOT.pom
[JENKINS] Archiving <https://builds.apache.org/job/Tobago%20Trunk/ws/tobago-theme/tobago-theme-speyside/target/tobago-theme-speyside-5.0.0-SNAPSHOT.jar>
to org.apache.myfaces.tobago/tobago-theme-speyside/5.0.0-SNAPSHOT/tobago-theme-speyside-5.0.0-SNAPSHOT.jar
[Fast Archiver] Compressed 315.74 KB of artifacts by 50.7% relative to #1609
[JENKINS] Archiving <https://builds.apache.org/job/Tobago%20Trunk/ws/tobago-theme/tobago-theme-roxborough/pom.xml>
to org.apache.myfaces.tobago/tobago-theme-roxborough/5.0.0-SNAPSHOT/tobago-theme-roxborough-5.0.0-SNAPSHOT.pom
[JENKINS] Archiving <https://builds.apache.org/job/Tobago%20Trunk/ws/tobago-theme/tobago-theme-roxborough/target/tobago-theme-roxborough-5.0.0-SNAPSHOT.jar>
to org.apache.myfaces.tobago/tobago-theme-roxborough/5.0.0-SNAPSHOT/tobago-theme-roxborough-5.0.0-SNAPSHOT.jar
[Fast Archiver] Compressed 399.31 KB of artifacts by 32.1% relative to #1609
[JENKINS] Archiving <https://builds.apache.org/job/Tobago%20Trunk/ws/tobago-tool/tobago-tool-annotation/pom.xml>
to org.apache.myfaces.tobago/tobago-tool-annotation/5.0.0-SNAPSHOT/tobago-tool-annotation-5.0.0-SNAPSHOT.pom
[JENKINS] Archiving <https://builds.apache.org/job/Tobago%20Trunk/ws/tobago-tool/tobago-tool-annotation/target/tobago-tool-annotation-5.0.0-SNAPSHOT.jar>
to org.apache.myfaces.tobago/tobago-tool-annotation/5.0.0-SNAPSHOT/tobago-tool-annotation-5.0.0-SNAPSHOT.jar
[JENKINS] Archiving <https://builds.apache.org/job/Tobago%20Trunk/ws/tobago-example/pom.xml>
to org.apache.myfaces.tobago/tobago-example/5.0.0-SNAPSHOT/tobago-example-5.0.0-SNAPSHOT.pom
[JENKINS] Archiving <https://builds.apache.org/job/Tobago%20Trunk/ws/tobago-tool/tobago-pack-typeahead/pom.xml>
to org.apache.myfaces.tobago/tobago-pack-typeahead/5.0.0-SNAPSHOT/tobago-pack-typeahead-5.0.0-SNAPSHOT.pom
[JENKINS] Archiving <https://builds.apache.org/job/Tobago%20Trunk/ws/tobago-tool/tobago-pack-typeahead/target/tobago-pack-typeahead-5.0.0-SNAPSHOT.jar>
to org.apache.myfaces.tobago/tobago-pack-typeahead/5.0.0-SNAPSHOT/tobago-pack-typeahead-5.0.0-SNAPSHOT.jar
[JENKINS] Archiving <https://builds.apache.org/job/Tobago%20Trunk/ws/tobago-tool/pom.xml>
to org.apache.myfaces.tobago/tobago-tool/5.0.0-SNAPSHOT/tobago-tool-5.0.0-SNAPSHOT.pom
[JENKINS] Archiving <https://builds.apache.org/job/Tobago%20Trunk/ws/tobago-core/pom.xml>
to org.apache.myfaces.tobago/tobago-core/5.0.0-SNAPSHOT/tobago-core-5.0.0-SNAPSHOT.pom
[JENKINS] Archiving <https://builds.apache.org/job/Tobago%20Trunk/ws/tobago-core/target/tobago-core-5.0.0-SNAPSHOT.jar>
to org.apache.myfaces.tobago/tobago-core/5.0.0-SNAPSHOT/tobago-core-5.0.0-SNAPSHOT.jar
[JENKINS] Archiving <https://builds.apache.org/job/Tobago%20Trunk/ws/tobago-core/target/tobago-core-5.0.0-SNAPSHOT-tests.jar>
to org.apache.myfaces.tobago/tobago-core/5.0.0-SNAPSHOT/tobago-core-5.0.0-SNAPSHOT-tests.jar
[JENKINS] Archiving <https://builds.apache.org/job/Tobago%20Trunk/ws/tobago-core/target/tobago-core-5.0.0-SNAPSHOT-sources.jar>
to org.apache.myfaces.tobago/tobago-core/5.0.0-SNAPSHOT/tobago-core-5.0.0-SNAPSHOT-sources.jar
[JENKINS] Archiving <https://builds.apache.org/job/Tobago%20Trunk/ws/tobago-tool/tobago-tool-apt/pom.xml>
to org.apache.myfaces.tobago/tobago-tool-apt/5.0.0-SNAPSHOT/tobago-tool-apt-5.0.0-SNAPSHOT.pom
[JENKINS] Archiving <https://builds.apache.org/job/Tobago%20Trunk/ws/tobago-tool/tobago-tool-apt/target/tobago-tool-apt-5.0.0-SNAPSHOT.jar>
to org.apache.myfaces.tobago/tobago-tool-apt/5.0.0-SNAPSHOT/tobago-tool-apt-5.0.0-SNAPSHOT.jar
[JENKINS] Archiving <https://builds.apache.org/job/Tobago%20Trunk/ws/tobago-theme/tobago-theme-charlotteville/pom.xml>
to org.apache.myfaces.tobago/tobago-theme-charlotteville/5.0.0-SNAPSHOT/tobago-theme-charlotteville-5.0.0-SNAPSHOT.pom
[JENKINS] Archiving <https://builds.apache.org/job/Tobago%20Trunk/ws/tobago-theme/tobago-theme-charlotteville/target/tobago-theme-charlotteville-5.0.0-SNAPSHOT.jar>
to org.apache.myfaces.tobago/tobago-theme-charlotteville/5.0.0-SNAPSHOT/tobago-theme-charlotteville-5.0.0-SNAPSHOT.jar
[Fast Archiver] Compressed 275.97 KB of artifacts by 46.4% relative to #1609
[JENKINS] Archiving <https://builds.apache.org/job/Tobago%20Trunk/ws/tobago-example/tobago-example-demo/pom.xml>
to org.apache.myfaces.tobago/tobago-example-demo/5.0.0-SNAPSHOT/tobago-example-demo-5.0.0-SNAPSHOT.pom
Sending e-mails to: commits@myfaces.apache.org
channel stopped
[JIRA] Updating issue TOBAGO-1757

Mime
View raw message