myfaces-commits mailing list archives

Site index · List index
Message view « Date » · « Thread »
Top « Date » · « Thread »
From Apache Jenkins Server <jenk...@builds.apache.org>
Subject Build failed in Jenkins: Tobago 4.x #25
Date Fri, 02 Nov 2018 16:48:39 GMT
See <https://builds.apache.org/job/Tobago%204.x/25/display/redirect?page=changes>

Changes:

[lofwyr] update check rules

------------------------------------------
Started by an SCM change
[EnvInject] - Loading node environment variables.
Building remotely on H39 (ubuntu xenial) in workspace <https://builds.apache.org/job/Tobago%204.x/ws/>
 > git rev-parse --is-inside-work-tree # timeout=10
Fetching changes from the remote Git repository
 > git config remote.origin.url https://gitbox.apache.org/repos/asf/myfaces-tobago.git
# timeout=10
Fetching upstream changes from https://gitbox.apache.org/repos/asf/myfaces-tobago.git
 > git --version # timeout=10
 > git fetch --tags --progress https://gitbox.apache.org/repos/asf/myfaces-tobago.git +refs/heads/*:refs/remotes/origin/*
 > git rev-parse refs/remotes/origin/tobago-4.x^{commit} # timeout=10
 > git rev-parse refs/remotes/origin/origin/tobago-4.x^{commit} # timeout=10
Checking out Revision 9b85b2a2e3376f36dba9f7e32f307a0ed9f66ab7 (refs/remotes/origin/tobago-4.x)
 > git config core.sparsecheckout # timeout=10
 > git checkout -f 9b85b2a2e3376f36dba9f7e32f307a0ed9f66ab7
Commit message: "update check rules"
 > git rev-list --no-walk cca2f2e3b3757b961099b92daf6a39e4496e1f92 # timeout=10
Parsing POMs
Established TCP socket on 42870
maven35-agent.jar already up to date
maven35-interceptor.jar already up to date
maven3-interceptor-commons.jar already up to date
[Tobago 4.x] $ /home/jenkins/tools/java/latest1.8/bin/java -Xmx4g -Xms4g -cp /home/jenkins/jenkins-slave/maven35-agent.jar:/home/jenkins/tools/maven/latest/boot/plexus-classworlds-2.5.2.jar:/home/jenkins/tools/maven/latest/conf/logging
jenkins.maven3.agent.Maven35Main /home/jenkins/tools/maven/latest/ /home/jenkins/jenkins-slave/slave.jar
/home/jenkins/jenkins-slave/maven35-interceptor.jar /home/jenkins/jenkins-slave/maven3-interceptor-commons.jar
42870
<===[JENKINS REMOTING CAPACITY]===>   channel started
Executing Maven:  -B -f <https://builds.apache.org/job/Tobago%204.x/ws/pom.xml> -Dmaven.repo.local=/home/jenkins/jenkins-slave/maven-repositories/1
clean animal-sniffer:check checkstyle:check install
[INFO] Scanning for projects...
[INFO] ------------------------------------------------------------------------
[INFO] Reactor Build Order:
[INFO] 
[INFO] Apache Tobago                                                      [pom]
[INFO] Tobago Tool                                                        [pom]
[INFO] Tobago Tool Annotation                                             [jar]
[INFO] Tobago Tool Apt                                                    [jar]
[INFO] Tobago Tool Test                                                   [jar]
[INFO] Tobago Core                                                        [jar]
[INFO] Tobago Themes                                                      [pom]
[INFO] Tobago Theme Standard                                              [jar]
[INFO] Tobago Theme Scarborough                                           [jar]
[INFO] Tobago Theme Speyside                                              [jar]
[INFO] Tobago Theme Roxborough                                            [jar]
[INFO] Tobago Theme Charlotteville                                        [jar]
[INFO] Tobago Examples                                                    [pom]
[INFO] Tobago Example Blank                                               [war]
[INFO] Tobago Example Demo                                                [war]
[INFO] Tobago Example Assembly                                            [pom]
[INFO] Tobago Assembly                                                    [pom]
[INFO] 
[INFO] ------------------< org.apache.myfaces.tobago:tobago >------------------
[INFO] Building Apache Tobago 4.3.2-SNAPSHOT                             [1/17]
[INFO] --------------------------------[ pom ]---------------------------------
[INFO] 
[INFO] --- maven-clean-plugin:2.6.1:clean (default-clean) @ tobago ---
[INFO] Deleting <https://builds.apache.org/job/Tobago%204.x/ws/target>
[INFO] 
[INFO] --- animal-sniffer-maven-plugin:1.14:check (default-cli) @ tobago ---
[INFO] Checking unresolved references to org.codehaus.mojo.signature:java18:1.0
[INFO] 
[INFO] --- maven-checkstyle-plugin:2.17:check (default-cli) @ tobago ---
[INFO] Downloading from central: https://repo.maven.apache.org/maven2/org/apache/myfaces/buildtools/checkstyle-rules/12/checkstyle-rules-12.pom
[WARNING] The POM for org.apache.myfaces.buildtools:checkstyle-rules:jar:12 is missing, no
dependency information available
[INFO] Downloading from central: https://repo.maven.apache.org/maven2/org/apache/myfaces/buildtools/checkstyle-rules/12/checkstyle-rules-12.jar
[WARNING] Failed to getClass for org.apache.maven.plugin.checkstyle.CheckstyleViolationCheckMojo
[WARNING] Attempt to (de-)serialize anonymous class hudson.maven.reporters.MavenArtifactArchiver$2;
see: https://jenkins.io/redirect/serialization-of-anonymous-classes/
[WARNING] Attempt to (de-)serialize anonymous class hudson.maven.reporters.MavenFingerprinter$1;
see: https://jenkins.io/redirect/serialization-of-anonymous-classes/
[INFO] ------------------------------------------------------------------------
[INFO] Reactor Summary:
[INFO] 
[INFO] Apache Tobago 4.3.2-SNAPSHOT ....................... FAILURE [  6.355 s]
[INFO] Tobago Tool ........................................ SKIPPED
[INFO] Tobago Tool Annotation ............................. SKIPPED
[INFO] Tobago Tool Apt .................................... SKIPPED
[INFO] Tobago Tool Test ................................... SKIPPED
[INFO] Tobago Core ........................................ SKIPPED
[INFO] Tobago Themes ...................................... SKIPPED
[INFO] Tobago Theme Standard .............................. SKIPPED
[INFO] Tobago Theme Scarborough ........................... SKIPPED
[INFO] Tobago Theme Speyside .............................. SKIPPED
[INFO] Tobago Theme Roxborough ............................ SKIPPED
[INFO] Tobago Theme Charlotteville ........................ SKIPPED
[INFO] Tobago Examples .................................... SKIPPED
[INFO] Tobago Example Blank ............................... SKIPPED
[INFO] Tobago Example Demo ................................ SKIPPED
[INFO] Tobago Example Assembly ............................ SKIPPED
[INFO] Tobago Assembly 4.3.2-SNAPSHOT ..................... SKIPPED
[INFO] ------------------------------------------------------------------------
[INFO] BUILD FAILURE
[INFO] ------------------------------------------------------------------------
[INFO] Total time: 25.240 s
[INFO] Finished at: 2018-11-02T16:47:58Z
[INFO] ------------------------------------------------------------------------
Waiting for Jenkins to finish collecting data
[ERROR] Failed to execute goal org.apache.maven.plugins:maven-checkstyle-plugin:2.17:check
(default-cli) on project tobago: Execution default-cli of goal org.apache.maven.plugins:maven-checkstyle-plugin:2.17:check
failed: Plugin org.apache.maven.plugins:maven-checkstyle-plugin:2.17 or one of its dependencies
could not be resolved: Could not find artifact org.apache.myfaces.buildtools:checkstyle-rules:jar:12
in central (https://repo.maven.apache.org/maven2) -> [Help 1]
[ERROR] 
[ERROR] To see the full stack trace of the errors, re-run Maven with the -e switch.
[ERROR] Re-run Maven using the -X switch to enable full debug logging.
[ERROR] 
[ERROR] For more information about the errors and possible solutions, please read the following
articles:
[ERROR] [Help 1] http://cwiki.apache.org/confluence/display/MAVEN/PluginResolutionException
[JENKINS] Archiving <https://builds.apache.org/job/Tobago%204.x/ws/tobago-theme/pom.xml>
to org.apache.myfaces.tobago/tobago-theme/4.3.2-SNAPSHOT/tobago-theme-4.3.2-SNAPSHOT.pom
[JENKINS] Archiving <https://builds.apache.org/job/Tobago%204.x/ws/tobago-example/tobago-example-blank/pom.xml>
to org.apache.myfaces.tobago/tobago-example-blank/4.3.2-SNAPSHOT/tobago-example-blank-4.3.2-SNAPSHOT.pom
[JENKINS] Archiving <https://builds.apache.org/job/Tobago%204.x/ws/tobago-assembly/pom.xml>
to org.apache.myfaces.tobago/tobago-assembly/4.3.2-SNAPSHOT/tobago-assembly-4.3.2-SNAPSHOT.pom
[JENKINS] Archiving <https://builds.apache.org/job/Tobago%204.x/ws/pom.xml> to org.apache.myfaces.tobago/tobago/4.3.2-SNAPSHOT/tobago-4.3.2-SNAPSHOT.pom
[JENKINS] Archiving <https://builds.apache.org/job/Tobago%204.x/ws/tobago-theme/tobago-theme-standard/pom.xml>
to org.apache.myfaces.tobago/tobago-theme-standard/4.3.2-SNAPSHOT/tobago-theme-standard-4.3.2-SNAPSHOT.pom
[JENKINS] Archiving <https://builds.apache.org/job/Tobago%204.x/ws/tobago-theme/tobago-theme-scarborough/pom.xml>
to org.apache.myfaces.tobago/tobago-theme-scarborough/4.3.2-SNAPSHOT/tobago-theme-scarborough-4.3.2-SNAPSHOT.pom
[JENKINS] Archiving <https://builds.apache.org/job/Tobago%204.x/ws/tobago-example/tobago-example-assembly/pom.xml>
to org.apache.myfaces.tobago/tobago-example-assembly/4.3.2-SNAPSHOT/tobago-example-assembly-4.3.2-SNAPSHOT.pom
[JENKINS] Archiving <https://builds.apache.org/job/Tobago%204.x/ws/tobago-tool/tobago-tool-test/pom.xml>
to org.apache.myfaces.tobago/tobago-tool-test/4.3.2-SNAPSHOT/tobago-tool-test-4.3.2-SNAPSHOT.pom
[JENKINS] Archiving <https://builds.apache.org/job/Tobago%204.x/ws/tobago-theme/tobago-theme-speyside/pom.xml>
to org.apache.myfaces.tobago/tobago-theme-speyside/4.3.2-SNAPSHOT/tobago-theme-speyside-4.3.2-SNAPSHOT.pom
[JENKINS] Archiving <https://builds.apache.org/job/Tobago%204.x/ws/tobago-theme/tobago-theme-roxborough/pom.xml>
to org.apache.myfaces.tobago/tobago-theme-roxborough/4.3.2-SNAPSHOT/tobago-theme-roxborough-4.3.2-SNAPSHOT.pom
[JENKINS] Archiving <https://builds.apache.org/job/Tobago%204.x/ws/tobago-tool/tobago-tool-annotation/pom.xml>
to org.apache.myfaces.tobago/tobago-tool-annotation/4.3.2-SNAPSHOT/tobago-tool-annotation-4.3.2-SNAPSHOT.pom
[JENKINS] Archiving <https://builds.apache.org/job/Tobago%204.x/ws/tobago-example/pom.xml>
to org.apache.myfaces.tobago/tobago-example/4.3.2-SNAPSHOT/tobago-example-4.3.2-SNAPSHOT.pom
[JENKINS] Archiving <https://builds.apache.org/job/Tobago%204.x/ws/tobago-tool/pom.xml>
to org.apache.myfaces.tobago/tobago-tool/4.3.2-SNAPSHOT/tobago-tool-4.3.2-SNAPSHOT.pom
[JENKINS] Archiving <https://builds.apache.org/job/Tobago%204.x/ws/tobago-core/pom.xml>
to org.apache.myfaces.tobago/tobago-core/4.3.2-SNAPSHOT/tobago-core-4.3.2-SNAPSHOT.pom
[JENKINS] Archiving <https://builds.apache.org/job/Tobago%204.x/ws/tobago-tool/tobago-tool-apt/pom.xml>
to org.apache.myfaces.tobago/tobago-tool-apt/4.3.2-SNAPSHOT/tobago-tool-apt-4.3.2-SNAPSHOT.pom
[JENKINS] Archiving <https://builds.apache.org/job/Tobago%204.x/ws/tobago-theme/tobago-theme-charlotteville/pom.xml>
to org.apache.myfaces.tobago/tobago-theme-charlotteville/4.3.2-SNAPSHOT/tobago-theme-charlotteville-4.3.2-SNAPSHOT.pom
[JENKINS] Archiving <https://builds.apache.org/job/Tobago%204.x/ws/tobago-example/tobago-example-demo/pom.xml>
to org.apache.myfaces.tobago/tobago-example-demo/4.3.2-SNAPSHOT/tobago-example-demo-4.3.2-SNAPSHOT.pom
Sending e-mails to: commits@myfaces.apache.org
channel stopped

Mime
View raw message