myfaces-commits mailing list archives

Site index · List index
Message view « Date » · « Thread »
Top « Date » · « Thread »
From Apache Jenkins Server <jenk...@builds.apache.org>
Subject Build failed in Jenkins: myfaces-current23 #426
Date Sun, 02 Dec 2018 20:38:29 GMT
See <https://builds.apache.org/job/myfaces-current23/426/display/redirect?page=changes>

Changes:

[tandraschko] break up "shaded"

------------------------------------------
[...truncated 235.75 KB...]
[WARNING] RelativeClasspathResourceLoader : initialization complete.
[WARNING] Default ResourceManager initialization complete.
[WARNING] Velocimacro : initialization starting.
[WARNING] Velocimacro : VM library registration complete.
[WARNING] Velocimacro : Velocimacro : initialization complete.
[WARNING] RuntimeInstance successfully initialized.
[INFO] 
[INFO] --- myfaces-builder-plugin:1.0.10:make-config (make_c_facelet_xsd22) @ myfaces-impl
---
[WARNING] *******************************************************************
[WARNING] RuntimeInstance initializing.
[WARNING] Default ResourceManager initializing. (class org.apache.velocity.runtime.resource.ResourceManagerImpl)
[WARNING] FileResourceLoader : initialization starting.
[WARNING] FileResourceLoader : initialization complete.
[WARNING] RelativeClasspathResourceLoader : initialization complete.
[INFO] RelativeClasspathResourceLoader : adding path 'META-INF'
[WARNING] RelativeClasspathResourceLoader : initialization complete.
[WARNING] Default ResourceManager initialization complete.
[WARNING] Velocimacro : initialization starting.
[WARNING] Velocimacro : VM library registration complete.
[WARNING] Velocimacro : Velocimacro : initialization complete.
[WARNING] RuntimeInstance successfully initialized.
[INFO] 
[INFO] --- myfaces-builder-plugin:1.0.10:make-config (make_ui_facelet_xsd22) @ myfaces-impl
---
[WARNING] *******************************************************************
[WARNING] RuntimeInstance initializing.
[WARNING] Default ResourceManager initializing. (class org.apache.velocity.runtime.resource.ResourceManagerImpl)
[WARNING] FileResourceLoader : initialization starting.
[WARNING] FileResourceLoader : initialization complete.
[WARNING] RelativeClasspathResourceLoader : initialization complete.
[INFO] RelativeClasspathResourceLoader : adding path 'META-INF'
[WARNING] RelativeClasspathResourceLoader : initialization complete.
[WARNING] Default ResourceManager initialization complete.
[WARNING] Velocimacro : initialization starting.
[WARNING] Velocimacro : VM library registration complete.
[WARNING] Velocimacro : Velocimacro : initialization complete.
[WARNING] RuntimeInstance successfully initialized.
[INFO] 
[INFO] --- myfaces-builder-plugin:1.0.10:make-config (make_composite_facelet_xsd22) @ myfaces-impl
---
[WARNING] *******************************************************************
[WARNING] RuntimeInstance initializing.
[WARNING] Default ResourceManager initializing. (class org.apache.velocity.runtime.resource.ResourceManagerImpl)
[WARNING] FileResourceLoader : initialization starting.
[WARNING] FileResourceLoader : initialization complete.
[WARNING] RelativeClasspathResourceLoader : initialization complete.
[INFO] RelativeClasspathResourceLoader : adding path 'META-INF'
[WARNING] RelativeClasspathResourceLoader : initialization complete.
[WARNING] Default ResourceManager initialization complete.
[WARNING] Velocimacro : initialization starting.
[WARNING] Velocimacro : VM library registration complete.
[WARNING] Velocimacro : Velocimacro : initialization complete.
[WARNING] RuntimeInstance successfully initialized.
[INFO] 
[INFO] --- maven-remote-resources-plugin:1.5:process (process-resource-bundles) @ myfaces-impl
---
[INFO] 
[INFO] --- maven-resources-plugin:2.5:resources (default-resources) @ myfaces-impl ---
[debug] execute contextualize
[INFO] Using 'UTF-8' encoding to copy filtered resources.
[INFO] Copying 29 resources
[INFO] Copying 14 resources
[INFO] Copying 3 resources
[INFO] 
[INFO] --- maven-compiler-plugin:3.6.1:compile (default-compile) @ myfaces-impl ---
[INFO] Changes detected - recompiling the module!
[INFO] Compiling 1022 source files to <https://builds.apache.org/job/myfaces-current23/ws/impl/target/classes>
[INFO] <https://builds.apache.org/job/myfaces-current23/ws/impl/src/main/java/org/apache/myfaces/view/facelets/impl/DefaultFaceletFactory.java>:
Some input files use or override a deprecated API.
[INFO] <https://builds.apache.org/job/myfaces-current23/ws/impl/src/main/java/org/apache/myfaces/view/facelets/impl/DefaultFaceletFactory.java>:
Recompile with -Xlint:deprecation for details.
[INFO] <https://builds.apache.org/job/myfaces-current23/ws/impl/src/main/java/org/apache/myfaces/view/facelets/tag/jsf/core/PassThroughAttributesHandler.java>:
Some input files use unchecked or unsafe operations.
[INFO] <https://builds.apache.org/job/myfaces-current23/ws/impl/src/main/java/org/apache/myfaces/view/facelets/tag/jsf/core/PassThroughAttributesHandler.java>:
Recompile with -Xlint:unchecked for details.
[INFO] -------------------------------------------------------------
[ERROR] COMPILATION ERROR : 
[INFO] -------------------------------------------------------------
[ERROR] <https://builds.apache.org/job/myfaces-current23/ws/impl/src/main/java/org/apache/myfaces/webapp/AbstractFacesInitializer.java>:[27,45]
package org.apache.myfaces.shared.application does not exist
[ERROR] <https://builds.apache.org/job/myfaces-current23/ws/impl/src/main/java/org/apache/myfaces/webapp/AbstractFacesInitializer.java>:[29,38]
package org.apache.myfaces.shared.util does not exist
[ERROR] <https://builds.apache.org/job/myfaces-current23/ws/impl/src/main/java/org/apache/myfaces/webapp/AbstractFacesInitializer.java>:[30,38]
package org.apache.myfaces.shared.util does not exist
[ERROR] <https://builds.apache.org/job/myfaces-current23/ws/impl/src/main/java/org/apache/myfaces/webapp/AbstractFacesInitializer.java>:[69,38]
package org.apache.myfaces.shared.util does not exist
[ERROR] <https://builds.apache.org/job/myfaces-current23/ws/impl/src/main/java/org/apache/myfaces/view/facelets/el/DefaultFunctionMapper.java>:[30,38]
package org.apache.myfaces.shared.util does not exist
[ERROR] <https://builds.apache.org/job/myfaces-current23/ws/impl/src/main/java/org/apache/myfaces/view/facelets/util/FaceletsViewDeclarationLanguageUtils.java>:[27,53]
package org.apache.myfaces.shared.renderkit.html.util does not exist
[ERROR] <https://builds.apache.org/job/myfaces-current23/ws/impl/src/main/java/org/apache/myfaces/view/facelets/util/FaceletsViewDeclarationLanguageUtils.java>:[28,53]
package org.apache.myfaces.shared.renderkit.html.util does not exist
[ERROR] <https://builds.apache.org/job/myfaces-current23/ws/impl/src/main/java/org/apache/myfaces/view/facelets/util/FaceletsViewDeclarationLanguageUtils.java>:[29,38]
package org.apache.myfaces.shared.util does not exist
[ERROR] <https://builds.apache.org/job/myfaces-current23/ws/impl/src/main/java/org/apache/myfaces/webapp/AbstractFacesInitializer.java>:[156,18]
cannot find symbol
  symbol:   variable WebConfigParamUtils
  location: class org.apache.myfaces.webapp.AbstractFacesInitializer
[ERROR] <https://builds.apache.org/job/myfaces-current23/ws/impl/src/main/java/org/apache/myfaces/webapp/AbstractFacesInitializer.java>:[207,68]
cannot find symbol
  symbol:   variable StateUtils
  location: class org.apache.myfaces.webapp.AbstractFacesInitializer
[ERROR] <https://builds.apache.org/job/myfaces-current23/ws/impl/src/main/java/org/apache/myfaces/webapp/AbstractFacesInitializer.java>:[210,29]
cannot find symbol
  symbol:   variable StateUtils
  location: class org.apache.myfaces.webapp.AbstractFacesInitializer
[ERROR] <https://builds.apache.org/job/myfaces-current23/ws/impl/src/main/java/org/apache/myfaces/webapp/AbstractFacesInitializer.java>:[215,17]
cannot find symbol
  symbol:   variable StateUtils
  location: class org.apache.myfaces.webapp.AbstractFacesInitializer
[ERROR] <https://builds.apache.org/job/myfaces-current23/ws/impl/src/main/java/org/apache/myfaces/webapp/AbstractFacesInitializer.java>:[237,53]
cannot find symbol
  symbol:   variable WebConfigParamUtils
  location: class org.apache.myfaces.webapp.AbstractFacesInitializer
[ERROR] <https://builds.apache.org/job/myfaces-current23/ws/impl/src/main/java/org/apache/myfaces/webapp/AbstractFacesInitializer.java>:[316,14]
cannot find symbol
  symbol:   variable WebConfigParamUtils
  location: class org.apache.myfaces.webapp.AbstractFacesInitializer
[ERROR] <https://builds.apache.org/job/myfaces-current23/ws/impl/src/main/java/org/apache/myfaces/webapp/AbstractFacesInitializer.java>:[427,19]
cannot find symbol
  symbol:   variable WebConfigParamUtils
  location: class org.apache.myfaces.webapp.AbstractFacesInitializer
[ERROR] <https://builds.apache.org/job/myfaces-current23/ws/impl/src/main/java/org/apache/myfaces/webapp/AbstractFacesInitializer.java>:[454,30]
cannot find symbol
  symbol:   variable ClassUtils
  location: class org.apache.myfaces.webapp.AbstractFacesInitializer
[ERROR] <https://builds.apache.org/job/myfaces-current23/ws/impl/src/main/java/org/apache/myfaces/webapp/AbstractFacesInitializer.java>:[606,20]
cannot find symbol
  symbol:   variable ClassUtils
  location: class org.apache.myfaces.webapp.AbstractFacesInitializer
[ERROR] <https://builds.apache.org/job/myfaces-current23/ws/impl/src/main/java/org/apache/myfaces/webapp/AbstractFacesInitializer.java>:[628,23]
cannot find symbol
  symbol:   variable ClassUtils
  location: class org.apache.myfaces.webapp.AbstractFacesInitializer
[ERROR] <https://builds.apache.org/job/myfaces-current23/ws/impl/src/main/java/org/apache/myfaces/webapp/AbstractFacesInitializer.java>:[709,21]
cannot find symbol
  symbol:   variable WebConfigParamUtils
  location: class org.apache.myfaces.webapp.AbstractFacesInitializer
[ERROR] <https://builds.apache.org/job/myfaces-current23/ws/impl/src/main/java/org/apache/myfaces/webapp/AbstractFacesInitializer.java>:[753,62]
cannot find symbol
  symbol:   variable FacesServletMappingUtils
  location: class org.apache.myfaces.webapp.AbstractFacesInitializer
[ERROR] <https://builds.apache.org/job/myfaces-current23/ws/impl/src/main/java/org/apache/myfaces/view/facelets/el/DefaultFunctionMapper.java>:[164,29]
cannot find symbol
  symbol:   variable ClassUtils
  location: class org.apache.myfaces.view.facelets.el.DefaultFunctionMapper.Function
[ERROR] <https://builds.apache.org/job/myfaces-current23/ws/impl/src/main/java/org/apache/myfaces/view/facelets/el/DefaultFunctionMapper.java>:[192,34]
cannot find symbol
  symbol:   variable ClassUtils
  location: class org.apache.myfaces.view.facelets.el.DefaultFunctionMapper.Function
[ERROR] <https://builds.apache.org/job/myfaces-current23/ws/impl/src/main/java/org/apache/myfaces/view/facelets/el/DefaultFunctionMapper.java>:[193,36]
cannot find symbol
  symbol:   variable ClassUtils
  location: class org.apache.myfaces.view.facelets.el.DefaultFunctionMapper.Function
[ERROR] <https://builds.apache.org/job/myfaces-current23/ws/impl/src/main/java/org/apache/myfaces/view/facelets/util/FaceletsViewDeclarationLanguageUtils.java>:[52,20]
cannot find symbol
  symbol:   variable ClassUtils
  location: class org.apache.myfaces.view.facelets.util.FaceletsViewDeclarationLanguageUtils
[ERROR] <https://builds.apache.org/job/myfaces-current23/ws/impl/src/main/java/org/apache/myfaces/view/facelets/util/FaceletsViewDeclarationLanguageUtils.java>:[90,32]
cannot find symbol
  symbol:   variable ClassUtils
  location: class org.apache.myfaces.view.facelets.util.FaceletsViewDeclarationLanguageUtils
[ERROR] <https://builds.apache.org/job/myfaces-current23/ws/impl/src/main/java/org/apache/myfaces/view/facelets/util/FaceletsViewDeclarationLanguageUtils.java>:[129,34]
package ResourceUtils does not exist
[ERROR] <https://builds.apache.org/job/myfaces-current23/ws/impl/src/main/java/org/apache/myfaces/view/facelets/util/FaceletsViewDeclarationLanguageUtils.java>:[130,34]
package ResourceUtils does not exist
[ERROR] <https://builds.apache.org/job/myfaces-current23/ws/impl/src/main/java/org/apache/myfaces/view/facelets/util/FaceletsViewDeclarationLanguageUtils.java>:[132,82]
cannot find symbol
  symbol:   variable JSFAttr
  location: class org.apache.myfaces.view.facelets.util.FaceletsViewDeclarationLanguageUtils
[ERROR] <https://builds.apache.org/job/myfaces-current23/ws/impl/src/main/java/org/apache/myfaces/view/facelets/util/FaceletsViewDeclarationLanguageUtils.java>:[133,81]
cannot find symbol
  symbol:   variable JSFAttr
  location: class org.apache.myfaces.view.facelets.util.FaceletsViewDeclarationLanguageUtils
[INFO] 29 errors 
[INFO] -------------------------------------------------------------
[INFO] ------------------------------------------------------------------------
[INFO] Reactor Summary:
[INFO] 
[INFO] Apache MyFaces Core 3.0 - Parent ................... SUCCESS [ 25.738 s]
[INFO] Apache MyFaces Core 3.0 - API ...................... SUCCESS [ 59.250 s]
[INFO] Apache MyFaces Core 3.0 - Test ..................... SUCCESS [ 25.573 s]
[INFO] Apache MyFaces Core 3.0 - Impl ..................... FAILURE [ 27.679 s]
[INFO] Apache MyFaces Core 3.0 - OSGi Bundle .............. SKIPPED
[INFO] Apache MyFaces Core 3.0 3.0.0-SNAPSHOT ............. SKIPPED
[INFO] ------------------------------------------------------------------------
[INFO] BUILD FAILURE
[INFO] ------------------------------------------------------------------------
[INFO] Total time: 02:52 min
[INFO] Finished at: 2018-12-02T20:38:10Z
[INFO] ------------------------------------------------------------------------
Waiting for Jenkins to finish collecting data
[ERROR] Failed to execute goal org.apache.maven.plugins:maven-compiler-plugin:3.6.1:compile
(default-compile) on project myfaces-impl: Compilation failure: Compilation failure:
[ERROR] <https://builds.apache.org/job/myfaces-current23/ws/impl/src/main/java/org/apache/myfaces/webapp/AbstractFacesInitializer.java>:[27,45]
package org.apache.myfaces.shared.application does not exist
[ERROR] <https://builds.apache.org/job/myfaces-current23/ws/impl/src/main/java/org/apache/myfaces/webapp/AbstractFacesInitializer.java>:[29,38]
package org.apache.myfaces.shared.util does not exist
[ERROR] <https://builds.apache.org/job/myfaces-current23/ws/impl/src/main/java/org/apache/myfaces/webapp/AbstractFacesInitializer.java>:[30,38]
package org.apache.myfaces.shared.util does not exist
[ERROR] <https://builds.apache.org/job/myfaces-current23/ws/impl/src/main/java/org/apache/myfaces/webapp/AbstractFacesInitializer.java>:[69,38]
package org.apache.myfaces.shared.util does not exist
[ERROR] <https://builds.apache.org/job/myfaces-current23/ws/impl/src/main/java/org/apache/myfaces/view/facelets/el/DefaultFunctionMapper.java>:[30,38]
package org.apache.myfaces.shared.util does not exist
[ERROR] <https://builds.apache.org/job/myfaces-current23/ws/impl/src/main/java/org/apache/myfaces/view/facelets/util/FaceletsViewDeclarationLanguageUtils.java>:[27,53]
package org.apache.myfaces.shared.renderkit.html.util does not exist
[ERROR] <https://builds.apache.org/job/myfaces-current23/ws/impl/src/main/java/org/apache/myfaces/view/facelets/util/FaceletsViewDeclarationLanguageUtils.java>:[28,53]
package org.apache.myfaces.shared.renderkit.html.util does not exist
[ERROR] <https://builds.apache.org/job/myfaces-current23/ws/impl/src/main/java/org/apache/myfaces/view/facelets/util/FaceletsViewDeclarationLanguageUtils.java>:[29,38]
package org.apache.myfaces.shared.util does not exist
[ERROR] <https://builds.apache.org/job/myfaces-current23/ws/impl/src/main/java/org/apache/myfaces/webapp/AbstractFacesInitializer.java>:[156,18]
cannot find symbol
[ERROR] symbol:   variable WebConfigParamUtils
[ERROR] location: class org.apache.myfaces.webapp.AbstractFacesInitializer
[ERROR] <https://builds.apache.org/job/myfaces-current23/ws/impl/src/main/java/org/apache/myfaces/webapp/AbstractFacesInitializer.java>:[207,68]
cannot find symbol
[ERROR] symbol:   variable StateUtils
[ERROR] location: class org.apache.myfaces.webapp.AbstractFacesInitializer
[ERROR] <https://builds.apache.org/job/myfaces-current23/ws/impl/src/main/java/org/apache/myfaces/webapp/AbstractFacesInitializer.java>:[210,29]
cannot find symbol
[ERROR] symbol:   variable StateUtils
[ERROR] location: class org.apache.myfaces.webapp.AbstractFacesInitializer
[ERROR] <https://builds.apache.org/job/myfaces-current23/ws/impl/src/main/java/org/apache/myfaces/webapp/AbstractFacesInitializer.java>:[215,17]
cannot find symbol
[ERROR] symbol:   variable StateUtils
[ERROR] location: class org.apache.myfaces.webapp.AbstractFacesInitializer
[ERROR] <https://builds.apache.org/job/myfaces-current23/ws/impl/src/main/java/org/apache/myfaces/webapp/AbstractFacesInitializer.java>:[237,53]
cannot find symbol
[ERROR] symbol:   variable WebConfigParamUtils
[ERROR] location: class org.apache.myfaces.webapp.AbstractFacesInitializer
[ERROR] <https://builds.apache.org/job/myfaces-current23/ws/impl/src/main/java/org/apache/myfaces/webapp/AbstractFacesInitializer.java>:[316,14]
cannot find symbol
[ERROR] symbol:   variable WebConfigParamUtils
[ERROR] location: class org.apache.myfaces.webapp.AbstractFacesInitializer
[ERROR] <https://builds.apache.org/job/myfaces-current23/ws/impl/src/main/java/org/apache/myfaces/webapp/AbstractFacesInitializer.java>:[427,19]
cannot find symbol
[ERROR] symbol:   variable WebConfigParamUtils
[ERROR] location: class org.apache.myfaces.webapp.AbstractFacesInitializer
[ERROR] <https://builds.apache.org/job/myfaces-current23/ws/impl/src/main/java/org/apache/myfaces/webapp/AbstractFacesInitializer.java>:[454,30]
cannot find symbol
[ERROR] symbol:   variable ClassUtils
[ERROR] location: class org.apache.myfaces.webapp.AbstractFacesInitializer
[ERROR] <https://builds.apache.org/job/myfaces-current23/ws/impl/src/main/java/org/apache/myfaces/webapp/AbstractFacesInitializer.java>:[606,20]
cannot find symbol
[ERROR] symbol:   variable ClassUtils
[ERROR] location: class org.apache.myfaces.webapp.AbstractFacesInitializer
[ERROR] <https://builds.apache.org/job/myfaces-current23/ws/impl/src/main/java/org/apache/myfaces/webapp/AbstractFacesInitializer.java>:[628,23]
cannot find symbol
[ERROR] symbol:   variable ClassUtils
[ERROR] location: class org.apache.myfaces.webapp.AbstractFacesInitializer
[ERROR] <https://builds.apache.org/job/myfaces-current23/ws/impl/src/main/java/org/apache/myfaces/webapp/AbstractFacesInitializer.java>:[709,21]
cannot find symbol
[ERROR] symbol:   variable WebConfigParamUtils
[ERROR] location: class org.apache.myfaces.webapp.AbstractFacesInitializer
[ERROR] <https://builds.apache.org/job/myfaces-current23/ws/impl/src/main/java/org/apache/myfaces/webapp/AbstractFacesInitializer.java>:[753,62]
cannot find symbol
[ERROR] symbol:   variable FacesServletMappingUtils
[ERROR] location: class org.apache.myfaces.webapp.AbstractFacesInitializer
[ERROR] <https://builds.apache.org/job/myfaces-current23/ws/impl/src/main/java/org/apache/myfaces/view/facelets/el/DefaultFunctionMapper.java>:[164,29]
cannot find symbol
[ERROR] symbol:   variable ClassUtils
[ERROR] location: class org.apache.myfaces.view.facelets.el.DefaultFunctionMapper.Function
[ERROR] <https://builds.apache.org/job/myfaces-current23/ws/impl/src/main/java/org/apache/myfaces/view/facelets/el/DefaultFunctionMapper.java>:[192,34]
cannot find symbol
[ERROR] symbol:   variable ClassUtils
[ERROR] location: class org.apache.myfaces.view.facelets.el.DefaultFunctionMapper.Function
[ERROR] <https://builds.apache.org/job/myfaces-current23/ws/impl/src/main/java/org/apache/myfaces/view/facelets/el/DefaultFunctionMapper.java>:[193,36]
cannot find symbol
[ERROR] symbol:   variable ClassUtils
[ERROR] location: class org.apache.myfaces.view.facelets.el.DefaultFunctionMapper.Function
[ERROR] <https://builds.apache.org/job/myfaces-current23/ws/impl/src/main/java/org/apache/myfaces/view/facelets/util/FaceletsViewDeclarationLanguageUtils.java>:[52,20]
cannot find symbol
[ERROR] symbol:   variable ClassUtils
[ERROR] location: class org.apache.myfaces.view.facelets.util.FaceletsViewDeclarationLanguageUtils
[ERROR] <https://builds.apache.org/job/myfaces-current23/ws/impl/src/main/java/org/apache/myfaces/view/facelets/util/FaceletsViewDeclarationLanguageUtils.java>:[90,32]
cannot find symbol
[ERROR] symbol:   variable ClassUtils
[ERROR] location: class org.apache.myfaces.view.facelets.util.FaceletsViewDeclarationLanguageUtils
[ERROR] <https://builds.apache.org/job/myfaces-current23/ws/impl/src/main/java/org/apache/myfaces/view/facelets/util/FaceletsViewDeclarationLanguageUtils.java>:[129,34]
package ResourceUtils does not exist
[ERROR] <https://builds.apache.org/job/myfaces-current23/ws/impl/src/main/java/org/apache/myfaces/view/facelets/util/FaceletsViewDeclarationLanguageUtils.java>:[130,34]
package ResourceUtils does not exist
[ERROR] <https://builds.apache.org/job/myfaces-current23/ws/impl/src/main/java/org/apache/myfaces/view/facelets/util/FaceletsViewDeclarationLanguageUtils.java>:[132,82]
cannot find symbol
[ERROR] symbol:   variable JSFAttr
[ERROR] location: class org.apache.myfaces.view.facelets.util.FaceletsViewDeclarationLanguageUtils
[ERROR] <https://builds.apache.org/job/myfaces-current23/ws/impl/src/main/java/org/apache/myfaces/view/facelets/util/FaceletsViewDeclarationLanguageUtils.java>:[133,81]
cannot find symbol
[ERROR] symbol:   variable JSFAttr
[ERROR] location: class org.apache.myfaces.view.facelets.util.FaceletsViewDeclarationLanguageUtils
[ERROR] -> [Help 1]
[ERROR] 
[ERROR] To see the full stack trace of the errors, re-run Maven with the -e switch.
[ERROR] Re-run Maven using the -X switch to enable full debug logging.
[ERROR] 
[ERROR] For more information about the errors and possible solutions, please read the following
articles:
[ERROR] [Help 1] http://cwiki.apache.org/confluence/display/MAVEN/MojoFailureException
[ERROR] 
[ERROR] After correcting the problems, you can resume the build with the command
[ERROR]   mvn <goals> -rf :myfaces-impl
[JENKINS] Archiving <https://builds.apache.org/job/myfaces-current23/ws/api/pom.xml>
to org.apache.myfaces.core/myfaces-api/3.0.0-SNAPSHOT/myfaces-api-3.0.0-SNAPSHOT.pom
[JENKINS] Archiving <https://builds.apache.org/job/myfaces-current23/ws/api/target/myfaces-api-3.0.0-SNAPSHOT.jar>
to org.apache.myfaces.core/myfaces-api/3.0.0-20181202.203638-144/myfaces-api-3.0.0-20181202.203638-144.jar
[JENKINS] Archiving <https://builds.apache.org/job/myfaces-current23/ws/api/target/myfaces-api-3.0.0-SNAPSHOT-sources.jar>
to org.apache.myfaces.core/myfaces-api/3.0.0-20181202.203638-144/myfaces-api-3.0.0-20181202.203638-144-sources.jar
[JENKINS] Archiving <https://builds.apache.org/job/myfaces-current23/ws/api/target/myfaces-api-3.0.0-SNAPSHOT-tests.jar>
to org.apache.myfaces.core/myfaces-api/3.0.0-20181202.203638-144/myfaces-api-3.0.0-20181202.203638-144-tests.jar
[JENKINS] Archiving <https://builds.apache.org/job/myfaces-current23/ws/test/pom.xml>
to org.apache.myfaces.core/myfaces-test/3.0.0-SNAPSHOT/myfaces-test-3.0.0-SNAPSHOT.pom
[JENKINS] Archiving <https://builds.apache.org/job/myfaces-current23/ws/test/target/myfaces-test-3.0.0-SNAPSHOT.jar>
to org.apache.myfaces.core/myfaces-test/3.0.0-20181202.203713-125/myfaces-test-3.0.0-20181202.203713-125.jar
[JENKINS] Archiving <https://builds.apache.org/job/myfaces-current23/ws/test/target/myfaces-test-3.0.0-SNAPSHOT-sources.jar>
to org.apache.myfaces.core/myfaces-test/3.0.0-20181202.203713-125/myfaces-test-3.0.0-20181202.203713-125-sources.jar
[JENKINS] Archiving <https://builds.apache.org/job/myfaces-current23/ws/impl/pom.xml>
to org.apache.myfaces.core/myfaces-impl/3.0.0-SNAPSHOT/myfaces-impl-3.0.0-SNAPSHOT.pom
[Fast Archiver] Compressed 56.63 KB of artifacts by 56.5% relative to #425
[JENKINS] Archiving <https://builds.apache.org/job/myfaces-current23/ws/bundle/pom.xml>
to org.apache.myfaces.core/myfaces-bundle/3.0.0-SNAPSHOT/myfaces-bundle-3.0.0-SNAPSHOT.pom
[JENKINS] Archiving <https://builds.apache.org/job/myfaces-current23/ws/pom.xml> to
org.apache.myfaces.core/myfaces-core-module/3.0.0-SNAPSHOT/myfaces-core-module-3.0.0-SNAPSHOT.pom
[JENKINS] Archiving <https://builds.apache.org/job/myfaces-current23/ws/parent/pom.xml>
to org.apache.myfaces.core/myfaces-core-project/3.0.0-SNAPSHOT/myfaces-core-project-3.0.0-SNAPSHOT.pom
[JENKINS] Archiving <https://builds.apache.org/job/myfaces-current23/ws/parent/target/myfaces-core-project-3.0.0-SNAPSHOT-site.xml>
to org.apache.myfaces.core/myfaces-core-project/3.0.0-20181202.203539-155/myfaces-core-project-3.0.0-20181202.203539-155-site.xml
Sending e-mails to: commits@myfaces.apache.org grantsmith@apache.org tandraschko@apache.org
channel stopped

Mime
View raw message