myfaces-commits mailing list archives

Site index · List index
Message view « Date » · « Thread »
Top « Date » · « Thread »
From Apache Jenkins Server <jenk...@builds.apache.org>
Subject Build failed in Jenkins: myfaces-current-master #53
Date Wed, 23 Jan 2019 11:36:20 GMT
See <https://builds.apache.org/job/myfaces-current-master/53/display/redirect?page=changes>

Changes:

[werner.punz] MYFACES-4265: adding a test for the chain function fixing a package

------------------------------------------
[...truncated 3.14 MB...]
[INFO] 
[INFO] --- maven-compiler-plugin:3.6.1:compile (default-compile) @ myfaces-bundle ---
[INFO] No sources to compile
[INFO] 
[INFO] --- maven-resources-plugin:2.5:testResources (default-testResources) @ myfaces-bundle
---
[debug] execute contextualize
[INFO] Using 'UTF-8' encoding to copy filtered resources.
[INFO] skip non existing resourceDirectory <https://builds.apache.org/job/myfaces-current-master/ws/bundle/src/test/resources>
[INFO] Copying 3 resources
[INFO] 
[INFO] --- maven-compiler-plugin:3.6.1:testCompile (default-testCompile) @ myfaces-bundle
---
[INFO] No sources to compile
[INFO] 
[INFO] --- maven-surefire-plugin:2.22.1:test (default-test) @ myfaces-bundle ---
[JENKINS] Recording test results
[INFO] 
[INFO] --- maven-bundle-plugin:3.0.1:bundle (default-bundle) @ myfaces-bundle ---
[WARNING] Bundle org.apache.myfaces.core:myfaces-bundle:bundle:3.0.0-SNAPSHOT : Export org.apache.myfaces.application,
 has 3,  private references [org.apache.myfaces.el, org.apache.myfaces.resource, org.apache.myfaces.application.viewstate.token],

[WARNING] Bundle org.apache.myfaces.core:myfaces-bundle:bundle:3.0.0-SNAPSHOT : Export org.apache.myfaces.application.viewstate,
 has 1,  private references [org.apache.myfaces.renderkit], 
[WARNING] Bundle org.apache.myfaces.core:myfaces-bundle:bundle:3.0.0-SNAPSHOT : Export org.apache.myfaces.view.facelets.el,
 has 1,  private references [org.apache.myfaces.view.facelets], 
[WARNING] Bundle org.apache.myfaces.core:myfaces-bundle:bundle:3.0.0-SNAPSHOT : Export org.apache.myfaces.view.facelets.component,
 has 1,  private references [org.apache.myfaces.renderkit.html.base], 
[WARNING] Bundle org.apache.myfaces.core:myfaces-bundle:bundle:3.0.0-SNAPSHOT : Export org.apache.myfaces.view.facelets.tag.jsf,
 has 2,  private references [org.apache.myfaces.view.facelets.tag, org.apache.myfaces.view.facelets],

[WARNING] Bundle org.apache.myfaces.core:myfaces-bundle:bundle:3.0.0-SNAPSHOT : Export org.apache.myfaces.webapp,
 has 2,  private references [org.apache.myfaces.el, org.apache.myfaces.config], 
[INFO] 
[INFO] >>> maven-source-plugin:2.2.1:jar (attach-source) > generate-sources @
myfaces-bundle >>>
[INFO] 
[INFO] --- maven-enforcer-plugin:1.4.1:enforce (enforce-maven-version) @ myfaces-bundle ---
[INFO] 
[INFO] --- maven-checkstyle-plugin:2.17:check (validate) @ myfaces-bundle ---
[INFO] Starting audit...
Audit done.
[WARNING] Failed to getClass for org.apache.maven.plugin.source.SourceJarMojo
[INFO] 
[INFO] <<< maven-source-plugin:2.2.1:jar (attach-source) < generate-sources @
myfaces-bundle <<<
[INFO] 
[INFO] 
[INFO] --- maven-source-plugin:2.2.1:jar (attach-source) @ myfaces-bundle ---
[INFO] Building jar: <https://builds.apache.org/job/myfaces-current-master/ws/bundle/target/myfaces-bundle-3.0.0-SNAPSHOT-sources.jar>
[INFO] 
[INFO] --- maven-site-plugin:3.3:attach-descriptor (attach-descriptor) @ myfaces-bundle ---
[INFO] 
[INFO] --- maven-checkstyle-plugin:2.17:check (verify-style) @ myfaces-bundle ---
[INFO] Starting audit...
Audit done.
[INFO] 
[INFO] --- maven-install-plugin:2.5.2:install (default-install) @ myfaces-bundle ---
[INFO] Installing <https://builds.apache.org/job/myfaces-current-master/ws/bundle/target/myfaces-bundle-3.0.0-SNAPSHOT.jar>
to /home/jenkins/jenkins-slave/maven-repositories/1/org/apache/myfaces/core/myfaces-bundle/3.0.0-SNAPSHOT/myfaces-bundle-3.0.0-SNAPSHOT.jar
[INFO] Installing <https://builds.apache.org/job/myfaces-current-master/ws/bundle/pom.xml>
to /home/jenkins/jenkins-slave/maven-repositories/1/org/apache/myfaces/core/myfaces-bundle/3.0.0-SNAPSHOT/myfaces-bundle-3.0.0-SNAPSHOT.pom
[INFO] Installing <https://builds.apache.org/job/myfaces-current-master/ws/bundle/target/myfaces-bundle-3.0.0-SNAPSHOT-sources.jar>
to /home/jenkins/jenkins-slave/maven-repositories/1/org/apache/myfaces/core/myfaces-bundle/3.0.0-SNAPSHOT/myfaces-bundle-3.0.0-SNAPSHOT-sources.jar
[INFO] 
[INFO] --- maven-bundle-plugin:3.0.1:install (default-install) @ myfaces-bundle ---
[INFO] Installing org/apache/myfaces/core/myfaces-bundle/3.0.0-SNAPSHOT/myfaces-bundle-3.0.0-SNAPSHOT.jar
[INFO] Writing OBR metadata
[INFO] 
[INFO] --- maven-enforcer-plugin:1.4.1:enforce (enforce-maven-version) @ myfaces-bundle ---
[INFO] 
[INFO] --- maven-checkstyle-plugin:2.17:check (validate) @ myfaces-bundle ---
[INFO] Starting audit...
Audit done.
[INFO] 
[INFO] --- maven-remote-resources-plugin:1.5:process (process-resource-bundles) @ myfaces-bundle
---
[INFO] 
[INFO] --- maven-resources-plugin:2.5:resources (default-resources) @ myfaces-bundle ---
[debug] execute contextualize
[INFO] Using 'UTF-8' encoding to copy filtered resources.
[INFO] skip non existing resourceDirectory <https://builds.apache.org/job/myfaces-current-master/ws/bundle/src/main/resources>
[INFO] Copying 3 resources
[INFO] Copying 3 resources
[INFO] 
[INFO] --- maven-compiler-plugin:3.6.1:compile (default-compile) @ myfaces-bundle ---
[INFO] No sources to compile
[INFO] 
[INFO] --- maven-resources-plugin:2.5:testResources (default-testResources) @ myfaces-bundle
---
[debug] execute contextualize
[INFO] Using 'UTF-8' encoding to copy filtered resources.
[INFO] skip non existing resourceDirectory <https://builds.apache.org/job/myfaces-current-master/ws/bundle/src/test/resources>
[INFO] Copying 3 resources
[INFO] Copying 3 resources
[INFO] 
[INFO] --- maven-compiler-plugin:3.6.1:testCompile (default-testCompile) @ myfaces-bundle
---
[INFO] No sources to compile
[INFO] 
[INFO] --- maven-surefire-plugin:2.22.1:test (default-test) @ myfaces-bundle ---
[INFO] Skipping execution of surefire because it has already been run for this configuration
[JENKINS] Recording test results
[INFO] 
[INFO] --- maven-bundle-plugin:3.0.1:bundle (default-bundle) @ myfaces-bundle ---
[WARNING] Bundle org.apache.myfaces.core:myfaces-bundle:bundle:3.0.0-SNAPSHOT : Export org.apache.myfaces.application,
 has 3,  private references [org.apache.myfaces.application.viewstate.token, org.apache.myfaces.el,
org.apache.myfaces.resource], 
[WARNING] Bundle org.apache.myfaces.core:myfaces-bundle:bundle:3.0.0-SNAPSHOT : Export org.apache.myfaces.application.viewstate,
 has 1,  private references [org.apache.myfaces.renderkit], 
[WARNING] Bundle org.apache.myfaces.core:myfaces-bundle:bundle:3.0.0-SNAPSHOT : Export org.apache.myfaces.view.facelets.el,
 has 1,  private references [org.apache.myfaces.view.facelets], 
[WARNING] Bundle org.apache.myfaces.core:myfaces-bundle:bundle:3.0.0-SNAPSHOT : Export org.apache.myfaces.view.facelets.component,
 has 1,  private references [org.apache.myfaces.renderkit.html.base], 
[WARNING] Bundle org.apache.myfaces.core:myfaces-bundle:bundle:3.0.0-SNAPSHOT : Export org.apache.myfaces.view.facelets.tag.jsf,
 has 2,  private references [org.apache.myfaces.view.facelets.tag, org.apache.myfaces.view.facelets],

[WARNING] Bundle org.apache.myfaces.core:myfaces-bundle:bundle:3.0.0-SNAPSHOT : Export org.apache.myfaces.webapp,
 has 2,  private references [org.apache.myfaces.el, org.apache.myfaces.config], 
[INFO] 
[INFO] >>> maven-source-plugin:2.2.1:jar (attach-source) > generate-sources @
myfaces-bundle >>>
[INFO] 
[INFO] --- maven-enforcer-plugin:1.4.1:enforce (enforce-maven-version) @ myfaces-bundle ---
[INFO] 
[INFO] --- maven-checkstyle-plugin:2.17:check (validate) @ myfaces-bundle ---
[INFO] Starting audit...
Audit done.
[WARNING] Failed to getClass for org.apache.maven.plugin.source.SourceJarMojo
[INFO] 
[INFO] <<< maven-source-plugin:2.2.1:jar (attach-source) < generate-sources @
myfaces-bundle <<<
[INFO] 
[INFO] 
[INFO] --- maven-source-plugin:2.2.1:jar (attach-source) @ myfaces-bundle ---
[INFO] Building jar: <https://builds.apache.org/job/myfaces-current-master/ws/bundle/target/myfaces-bundle-3.0.0-SNAPSHOT-sources.jar>
[INFO] 
[INFO] --- maven-site-plugin:3.3:attach-descriptor (attach-descriptor) @ myfaces-bundle ---
[INFO] 
[INFO] --- maven-checkstyle-plugin:2.17:check (verify-style) @ myfaces-bundle ---
[INFO] Starting audit...
Audit done.
[INFO] 
[INFO] --- maven-install-plugin:2.5.2:install (default-install) @ myfaces-bundle ---
[INFO] Installing <https://builds.apache.org/job/myfaces-current-master/ws/bundle/target/myfaces-bundle-3.0.0-SNAPSHOT.jar>
to /home/jenkins/jenkins-slave/maven-repositories/1/org/apache/myfaces/core/myfaces-bundle/3.0.0-SNAPSHOT/myfaces-bundle-3.0.0-SNAPSHOT.jar
[INFO] Installing <https://builds.apache.org/job/myfaces-current-master/ws/bundle/pom.xml>
to /home/jenkins/jenkins-slave/maven-repositories/1/org/apache/myfaces/core/myfaces-bundle/3.0.0-SNAPSHOT/myfaces-bundle-3.0.0-SNAPSHOT.pom
[INFO] Installing <https://builds.apache.org/job/myfaces-current-master/ws/bundle/target/myfaces-bundle-3.0.0-SNAPSHOT-sources.jar>
to /home/jenkins/jenkins-slave/maven-repositories/1/org/apache/myfaces/core/myfaces-bundle/3.0.0-SNAPSHOT/myfaces-bundle-3.0.0-SNAPSHOT-sources.jar
[INFO] Installing <https://builds.apache.org/job/myfaces-current-master/ws/bundle/target/myfaces-bundle-3.0.0-SNAPSHOT-sources.jar>
to /home/jenkins/jenkins-slave/maven-repositories/1/org/apache/myfaces/core/myfaces-bundle/3.0.0-SNAPSHOT/myfaces-bundle-3.0.0-SNAPSHOT-sources.jar
[INFO] 
[INFO] --- maven-bundle-plugin:3.0.1:install (default-install) @ myfaces-bundle ---
[INFO] Installing org/apache/myfaces/core/myfaces-bundle/3.0.0-SNAPSHOT/myfaces-bundle-3.0.0-SNAPSHOT.jar
[INFO] Writing OBR metadata
[INFO] 
[INFO] --- maven-deploy-plugin:2.8.2:deploy (default-deploy) @ myfaces-bundle ---
[INFO] Downloading from apache.snapshots.https: https://repository.apache.org/content/repositories/snapshots/org/apache/myfaces/core/myfaces-bundle/3.0.0-SNAPSHOT/maven-metadata.xml
[INFO] Downloaded from apache.snapshots.https: https://repository.apache.org/content/repositories/snapshots/org/apache/myfaces/core/myfaces-bundle/3.0.0-SNAPSHOT/maven-metadata.xml
(1.0 kB at 1.6 kB/s)
[INFO] Uploading to apache.snapshots.https: https://repository.apache.org/content/repositories/snapshots/org/apache/myfaces/core/myfaces-bundle/3.0.0-SNAPSHOT/myfaces-bundle-3.0.0-20190123.113517-369.jar
[INFO] Uploaded to apache.snapshots.https: https://repository.apache.org/content/repositories/snapshots/org/apache/myfaces/core/myfaces-bundle/3.0.0-SNAPSHOT/myfaces-bundle-3.0.0-20190123.113517-369.jar
(3.5 MB at 2.0 MB/s)
[INFO] Uploading to apache.snapshots.https: https://repository.apache.org/content/repositories/snapshots/org/apache/myfaces/core/myfaces-bundle/3.0.0-SNAPSHOT/myfaces-bundle-3.0.0-20190123.113517-369.pom
[INFO] Uploaded to apache.snapshots.https: https://repository.apache.org/content/repositories/snapshots/org/apache/myfaces/core/myfaces-bundle/3.0.0-SNAPSHOT/myfaces-bundle-3.0.0-20190123.113517-369.pom
(8.0 kB at 7.2 kB/s)
[INFO] Downloading from apache.snapshots.https: https://repository.apache.org/content/repositories/snapshots/org/apache/myfaces/core/myfaces-bundle/maven-metadata.xml
[INFO] Downloaded from apache.snapshots.https: https://repository.apache.org/content/repositories/snapshots/org/apache/myfaces/core/myfaces-bundle/maven-metadata.xml
(574 B at 964 B/s)
[INFO] Uploading to apache.snapshots.https: https://repository.apache.org/content/repositories/snapshots/org/apache/myfaces/core/myfaces-bundle/3.0.0-SNAPSHOT/maven-metadata.xml
[INFO] Uploaded to apache.snapshots.https: https://repository.apache.org/content/repositories/snapshots/org/apache/myfaces/core/myfaces-bundle/3.0.0-SNAPSHOT/maven-metadata.xml
(1.0 kB at 906 B/s)
[INFO] Uploading to apache.snapshots.https: https://repository.apache.org/content/repositories/snapshots/org/apache/myfaces/core/myfaces-bundle/maven-metadata.xml
[INFO] Uploaded to apache.snapshots.https: https://repository.apache.org/content/repositories/snapshots/org/apache/myfaces/core/myfaces-bundle/maven-metadata.xml
(574 B at 525 B/s)
[INFO] Uploading to apache.snapshots.https: https://repository.apache.org/content/repositories/snapshots/org/apache/myfaces/core/myfaces-bundle/3.0.0-SNAPSHOT/myfaces-bundle-3.0.0-20190123.113517-369-sources.jar
[INFO] Uploaded to apache.snapshots.https: https://repository.apache.org/content/repositories/snapshots/org/apache/myfaces/core/myfaces-bundle/3.0.0-SNAPSHOT/myfaces-bundle-3.0.0-20190123.113517-369-sources.jar
(4.9 kB at 4.5 kB/s)
[INFO] Uploading to apache.snapshots.https: https://repository.apache.org/content/repositories/snapshots/org/apache/myfaces/core/myfaces-bundle/3.0.0-SNAPSHOT/maven-metadata.xml
[INFO] Uploaded to apache.snapshots.https: https://repository.apache.org/content/repositories/snapshots/org/apache/myfaces/core/myfaces-bundle/3.0.0-SNAPSHOT/maven-metadata.xml
(1.0 kB at 908 B/s)
[INFO] Uploading to apache.snapshots.https: https://repository.apache.org/content/repositories/snapshots/org/apache/myfaces/core/myfaces-bundle/3.0.0-SNAPSHOT/myfaces-bundle-3.0.0-20190123.113517-369-sources.jar
[INFO] Uploaded to apache.snapshots.https: https://repository.apache.org/content/repositories/snapshots/org/apache/myfaces/core/myfaces-bundle/3.0.0-SNAPSHOT/myfaces-bundle-3.0.0-20190123.113517-369-sources.jar
(4.9 kB at 4.4 kB/s)
[INFO] Uploading to apache.snapshots.https: https://repository.apache.org/content/repositories/snapshots/org/apache/myfaces/core/myfaces-bundle/3.0.0-SNAPSHOT/maven-metadata.xml
[INFO] Uploaded to apache.snapshots.https: https://repository.apache.org/content/repositories/snapshots/org/apache/myfaces/core/myfaces-bundle/3.0.0-SNAPSHOT/maven-metadata.xml
(1.0 kB at 908 B/s)
[INFO] 
[INFO] --- maven-bundle-plugin:3.0.1:deploy (default-deploy) @ myfaces-bundle ---
[INFO] Remote OBR update disabled (enable with -DremoteOBR)
[INFO] 
[INFO] ---------< org.apache.myfaces.core:myfaces-integration-tests >----------
[INFO] Building Apache MyFaces Core 3.0 - Integration Tests 3.0.0-SNAPSHOT [6/13]
[INFO] --------------------------------[ pom ]---------------------------------
[INFO] Downloading from central: https://repo.maven.apache.org/maven2/org/apache/maven/plugins/maven-clean-plugin/2.5/maven-clean-plugin-2.5.pom
[INFO] Downloaded from central: https://repo.maven.apache.org/maven2/org/apache/maven/plugins/maven-clean-plugin/2.5/maven-clean-plugin-2.5.pom
(3.9 kB at 261 kB/s)
[INFO] Downloading from central: https://repo.maven.apache.org/maven2/org/apache/maven/plugins/maven-plugins/22/maven-plugins-22.pom
[INFO] Downloaded from central: https://repo.maven.apache.org/maven2/org/apache/maven/plugins/maven-plugins/22/maven-plugins-22.pom
(13 kB at 1.0 MB/s)
[INFO] Downloading from central: https://repo.maven.apache.org/maven2/org/apache/maven/plugins/maven-clean-plugin/2.5/maven-clean-plugin-2.5.jar
[INFO] Downloaded from central: https://repo.maven.apache.org/maven2/org/apache/maven/plugins/maven-clean-plugin/2.5/maven-clean-plugin-2.5.jar
(25 kB at 1.8 MB/s)
[INFO] Downloading from central: https://repo.maven.apache.org/maven2/org/apache/maven/plugins/maven-install-plugin/2.4/maven-install-plugin-2.4.pom
[INFO] Downloaded from central: https://repo.maven.apache.org/maven2/org/apache/maven/plugins/maven-install-plugin/2.4/maven-install-plugin-2.4.pom
(6.4 kB at 532 kB/s)
[INFO] Downloading from central: https://repo.maven.apache.org/maven2/org/apache/maven/plugins/maven-install-plugin/2.4/maven-install-plugin-2.4.jar
[INFO] Downloaded from central: https://repo.maven.apache.org/maven2/org/apache/maven/plugins/maven-install-plugin/2.4/maven-install-plugin-2.4.jar
(27 kB at 2.1 MB/s)
[INFO] Downloading from central: https://repo.maven.apache.org/maven2/org/apache/maven/plugins/maven-deploy-plugin/2.7/maven-deploy-plugin-2.7.pom
[INFO] Downloaded from central: https://repo.maven.apache.org/maven2/org/apache/maven/plugins/maven-deploy-plugin/2.7/maven-deploy-plugin-2.7.pom
(5.6 kB at 510 kB/s)
[INFO] Downloading from central: https://repo.maven.apache.org/maven2/org/apache/maven/plugins/maven-deploy-plugin/2.7/maven-deploy-plugin-2.7.jar
[INFO] Downloaded from central: https://repo.maven.apache.org/maven2/org/apache/maven/plugins/maven-deploy-plugin/2.7/maven-deploy-plugin-2.7.jar
(27 kB at 2.1 MB/s)
[INFO] 
[INFO] --- maven-clean-plugin:2.5:clean (default-clean) @ myfaces-integration-tests ---
[INFO] 
[INFO] --- maven-install-plugin:2.4:install (default-install) @ myfaces-integration-tests
---
[INFO] Downloading from central: https://repo.maven.apache.org/maven2/org/codehaus/plexus/plexus-utils/3.0.5/plexus-utils-3.0.5.pom
[INFO] Downloaded from central: https://repo.maven.apache.org/maven2/org/codehaus/plexus/plexus-utils/3.0.5/plexus-utils-3.0.5.pom
(2.5 kB at 140 kB/s)
[INFO] Downloading from central: https://repo.maven.apache.org/maven2/org/codehaus/plexus/plexus-utils/3.0.5/plexus-utils-3.0.5.jar
[INFO] Downloaded from central: https://repo.maven.apache.org/maven2/org/codehaus/plexus/plexus-utils/3.0.5/plexus-utils-3.0.5.jar
(230 kB at 8.9 MB/s)
[INFO] Installing <https://builds.apache.org/job/myfaces-current-master/ws/integration-tests/pom.xml>
to /home/jenkins/jenkins-slave/maven-repositories/1/org/apache/myfaces/core/myfaces-integration-tests/3.0.0-SNAPSHOT/myfaces-integration-tests-3.0.0-SNAPSHOT.pom
[INFO] 
[INFO] --- maven-install-plugin:2.4:install (default-install) @ myfaces-integration-tests
---
[INFO] Installing <https://builds.apache.org/job/myfaces-current-master/ws/integration-tests/pom.xml>
to /home/jenkins/jenkins-slave/maven-repositories/1/org/apache/myfaces/core/myfaces-integration-tests/3.0.0-SNAPSHOT/myfaces-integration-tests-3.0.0-SNAPSHOT.pom
[INFO] 
[INFO] --- maven-deploy-plugin:2.7:deploy (default-deploy) @ myfaces-integration-tests ---
[INFO] ------------------------------------------------------------------------
[INFO] Reactor Summary for Apache MyFaces Core 3.0 3.0.0-SNAPSHOT:
[INFO] 
[INFO] Apache MyFaces Core 3.0 - Parent ................... SUCCESS [ 20.418 s]
[INFO] Apache MyFaces Core 3.0 - API ...................... SUCCESS [ 50.940 s]
[INFO] Apache MyFaces Core 3.0 - Test ..................... SUCCESS [ 23.979 s]
[INFO] Apache MyFaces Core 3.0 - Impl ..................... SUCCESS [04:31 min]
[INFO] Apache MyFaces Core 3.0 - OSGi Bundle .............. SUCCESS [ 28.596 s]
[INFO] Apache MyFaces Core 3.0 - Integration Tests ........ FAILURE [  1.543 s]
[INFO] Apache MyFaces Core 3.0 - Integration Tests - faceletToXhtmlMapping SKIPPED
[INFO] Apache MyFaces Core 3.0 - Integration Tests - faceletToXhtmlMappingDisabled SKIPPED
[INFO] Apache MyFaces Core 3.0 - Integration Tests - exactMapping SKIPPED
[INFO] Apache MyFaces Core 3.0 - Integration Tests - autoLookupExpressionFactoryWithoutJSP
SKIPPED
[INFO] Apache MyFaces Core 3.0 - Integration Tests - protectedViews SKIPPED
[INFO] Apache MyFaces Core 3.0 - Integration Tests - ajax . SKIPPED
[INFO] Apache MyFaces Core 3.0 ............................ SKIPPED
[INFO] ------------------------------------------------------------------------
[INFO] BUILD FAILURE
[INFO] ------------------------------------------------------------------------
[INFO] Total time:  07:20 min
[INFO] Finished at: 2019-01-23T11:35:50Z
[INFO] ------------------------------------------------------------------------
Waiting for Jenkins to finish collecting data
[ERROR] Failed to execute goal org.apache.maven.plugins:maven-deploy-plugin:2.7:deploy (default-deploy)
on project myfaces-integration-tests: Deployment failed: repository element was not specified
in the POM inside distributionManagement element or in -DaltDeploymentRepository=id::layout::url
parameter -> [Help 1]
[ERROR] 
[ERROR] To see the full stack trace of the errors, re-run Maven with the -e switch.
[ERROR] Re-run Maven using the -X switch to enable full debug logging.
[ERROR] 
[ERROR] For more information about the errors and possible solutions, please read the following
articles:
[ERROR] [Help 1] http://cwiki.apache.org/confluence/display/MAVEN/MojoExecutionException
[ERROR] 
[ERROR] After correcting the problems, you can resume the build with the command
[ERROR]   mvn <goals> -rf :myfaces-integration-tests
[JENKINS] Archiving <https://builds.apache.org/job/myfaces-current-master/ws/api/pom.xml>
to org.apache.myfaces.core/myfaces-api/3.0.0-SNAPSHOT/myfaces-api-3.0.0-SNAPSHOT.pom
[JENKINS] Archiving <https://builds.apache.org/job/myfaces-current-master/ws/api/target/myfaces-api-3.0.0-SNAPSHOT.jar>
to org.apache.myfaces.core/myfaces-api/3.0.0-20190123.112934-384/myfaces-api-3.0.0-20190123.112934-384.jar
[JENKINS] Archiving <https://builds.apache.org/job/myfaces-current-master/ws/api/target/myfaces-api-3.0.0-SNAPSHOT-sources.jar>
to org.apache.myfaces.core/myfaces-api/3.0.0-20190123.112934-384/myfaces-api-3.0.0-20190123.112934-384-sources.jar
[JENKINS] Archiving <https://builds.apache.org/job/myfaces-current-master/ws/api/target/myfaces-api-3.0.0-SNAPSHOT-tests.jar>
to org.apache.myfaces.core/myfaces-api/3.0.0-20190123.112934-384/myfaces-api-3.0.0-20190123.112934-384-tests.jar
[JENKINS] Archiving <https://builds.apache.org/job/myfaces-current-master/ws/integration-tests/faceletToXhtmlMappingDisabled/pom.xml>
to org.apache.myfaces.core.integration-tests/faceletToXhtmlMappingDisabled/3.0.0-SNAPSHOT/faceletToXhtmlMappingDisabled-3.0.0-SNAPSHOT.pom
[Fast Archiver] No prior successful build to compare, so performing full copy of artifacts
[JENKINS] Archiving <https://builds.apache.org/job/myfaces-current-master/ws/impl/pom.xml>
to org.apache.myfaces.core/myfaces-impl/3.0.0-SNAPSHOT/myfaces-impl-3.0.0-SNAPSHOT.pom
[JENKINS] Archiving <https://builds.apache.org/job/myfaces-current-master/ws/impl/target/myfaces-impl-3.0.0-SNAPSHOT.jar>
to org.apache.myfaces.core/myfaces-impl/3.0.0-20190123.113432-367/myfaces-impl-3.0.0-20190123.113432-367.jar
[JENKINS] Archiving <https://builds.apache.org/job/myfaces-current-master/ws/impl/target/myfaces-impl-3.0.0-SNAPSHOT-sources.jar>
to org.apache.myfaces.core/myfaces-impl/3.0.0-20190123.113432-367/myfaces-impl-3.0.0-20190123.113432-367-sources.jar
[JENKINS] Archiving <https://builds.apache.org/job/myfaces-current-master/ws/impl/target/myfaces-impl-3.0.0-SNAPSHOT-test-sources.jar>
to org.apache.myfaces.core/myfaces-impl/3.0.0-20190123.113432-367/myfaces-impl-3.0.0-20190123.113432-367-test-sources.jar
[JENKINS] Archiving <https://builds.apache.org/job/myfaces-current-master/ws/impl/target/myfaces-impl-3.0.0-SNAPSHOT-tests.jar>
to org.apache.myfaces.core/myfaces-impl/3.0.0-20190123.113432-367/myfaces-impl-3.0.0-20190123.113432-367-tests.jar
[JENKINS] Archiving <https://builds.apache.org/job/myfaces-current-master/ws/integration-tests/exactMapping/pom.xml>
to org.apache.myfaces.core.integration-tests/exactMapping/3.0.0-SNAPSHOT/exactMapping-3.0.0-SNAPSHOT.pom
[Fast Archiver] No prior successful build to compare, so performing full copy of artifacts
[JENKINS] Archiving <https://builds.apache.org/job/myfaces-current-master/ws/integration-tests/autoLookupExpressionFactoryWithoutJSP/pom.xml>
to org.apache.myfaces.core.integration-tests/autoLookupExpressionFactoryWithoutJSP/3.0.0-SNAPSHOT/autoLookupExpressionFactoryWithoutJSP-3.0.0-SNAPSHOT.pom
[Fast Archiver] No prior successful build to compare, so performing full copy of artifacts
[JENKINS] Archiving <https://builds.apache.org/job/myfaces-current-master/ws/integration-tests/ajax/pom.xml>
to org.apache.myfaces.core.integration-tests/ajax/3.0.0-SNAPSHOT/ajax-3.0.0-SNAPSHOT.pom
[Fast Archiver] No prior successful build to compare, so performing full copy of artifacts
[JENKINS] Archiving <https://builds.apache.org/job/myfaces-current-master/ws/test/pom.xml>
to org.apache.myfaces.core/myfaces-test/3.0.0-SNAPSHOT/myfaces-test-3.0.0-SNAPSHOT.pom
[JENKINS] Archiving <https://builds.apache.org/job/myfaces-current-master/ws/test/target/myfaces-test-3.0.0-SNAPSHOT.jar>
to org.apache.myfaces.core/myfaces-test/3.0.0-20190123.113008-358/myfaces-test-3.0.0-20190123.113008-358.jar
[JENKINS] Archiving <https://builds.apache.org/job/myfaces-current-master/ws/test/target/myfaces-test-3.0.0-SNAPSHOT-sources.jar>
to org.apache.myfaces.core/myfaces-test/3.0.0-20190123.113008-358/myfaces-test-3.0.0-20190123.113008-358-sources.jar
[JENKINS] Archiving <https://builds.apache.org/job/myfaces-current-master/ws/integration-tests/protectedViews/pom.xml>
to org.apache.myfaces.core.integration-tests/protectedViews/3.0.0-SNAPSHOT/protectedViews-3.0.0-SNAPSHOT.pom
[Fast Archiver] No prior successful build to compare, so performing full copy of artifacts
[JENKINS] Archiving <https://builds.apache.org/job/myfaces-current-master/ws/integration-tests/faceletToXhtmlMapping/pom.xml>
to org.apache.myfaces.core.integration-tests/faceletToXhtmlMapping/3.0.0-SNAPSHOT/faceletToXhtmlMapping-3.0.0-SNAPSHOT.pom
[Fast Archiver] No prior successful build to compare, so performing full copy of artifacts
[JENKINS] Archiving <https://builds.apache.org/job/myfaces-current-master/ws/bundle/pom.xml>
to org.apache.myfaces.core/myfaces-bundle/3.0.0-SNAPSHOT/myfaces-bundle-3.0.0-SNAPSHOT.pom
[JENKINS] Archiving <https://builds.apache.org/job/myfaces-current-master/ws/bundle/target/myfaces-bundle-3.0.0-SNAPSHOT.jar>
to org.apache.myfaces.core/myfaces-bundle/3.0.0-20190123.113517-369/myfaces-bundle-3.0.0-20190123.113517-369.jar
[JENKINS] Archiving <https://builds.apache.org/job/myfaces-current-master/ws/bundle/target/myfaces-bundle-3.0.0-SNAPSHOT-sources.jar>
to org.apache.myfaces.core/myfaces-bundle/3.0.0-20190123.113517-369/myfaces-bundle-3.0.0-20190123.113517-369-sources.jar
[JENKINS] Archiving <https://builds.apache.org/job/myfaces-current-master/ws/integration-tests/pom.xml>
to org.apache.myfaces.core/myfaces-integration-tests/3.0.0-SNAPSHOT/myfaces-integration-tests-3.0.0-SNAPSHOT.pom
[Fast Archiver] No prior successful build to compare, so performing full copy of artifacts
[JENKINS] Archiving <https://builds.apache.org/job/myfaces-current-master/ws/pom.xml>
to org.apache.myfaces.core/myfaces-core-module/3.0.0-SNAPSHOT/myfaces-core-module-3.0.0-SNAPSHOT.pom
[JENKINS] Archiving <https://builds.apache.org/job/myfaces-current-master/ws/parent/pom.xml>
to org.apache.myfaces.core/myfaces-core-project/3.0.0-SNAPSHOT/myfaces-core-project-3.0.0-SNAPSHOT.pom
[JENKINS] Archiving <https://builds.apache.org/job/myfaces-current-master/ws/parent/target/myfaces-core-project-3.0.0-SNAPSHOT-site.xml>
to org.apache.myfaces.core/myfaces-core-project/3.0.0-20190123.112845-396/myfaces-core-project-3.0.0-20190123.112845-396-site.xml
Sending e-mails to: commits@myfaces.apache.org grantsmith@apache.org
channel stopped
Not sending mail to unregistered user werner.punz@gmail.com

Mime
View raw message