myfaces-commits mailing list archives

Site index · List index
Message view « Date » · « Thread »
Top « Date » · « Thread »
From Apache Jenkins Server <jenk...@builds.apache.org>
Subject Build failed in Jenkins: Tobago Trunk » Tobago Theme Standard #1646
Date Wed, 23 Jan 2019 11:22:57 GMT
See <https://builds.apache.org/job/Tobago%20Trunk/org.apache.myfaces.tobago$tobago-theme-standard/1646/display/redirect?page=changes>

Changes:

[lofwyr] TOBAGO-1633: Use TypeScript instead of JavaScript

------------------------------------------
[INFO] 
[INFO] ----------< org.apache.myfaces.tobago:tobago-theme-standard >-----------
[INFO] Building Tobago Theme Standard 5.0.0-SNAPSHOT                    [14/23]
[INFO] --------------------------------[ jar ]---------------------------------
[INFO] 
[INFO] --- maven-clean-plugin:2.6.1:clean (default-clean) @ tobago-theme-standard ---
[INFO] Deleting <https://builds.apache.org/job/Tobago%20Trunk/org.apache.myfaces.tobago$tobago-theme-standard/ws/target>
[INFO] 
[INFO] --- animal-sniffer-maven-plugin:1.14:check (default-cli) @ tobago-theme-standard ---
[INFO] Checking unresolved references to org.codehaus.mojo.signature:java18:1.0
[INFO] 
[INFO] --- maven-checkstyle-plugin:2.17:check (default-cli) @ tobago-theme-standard ---
[INFO] Starting audit...
Audit done.
[INFO] 
[INFO] --- maven-enforcer-plugin:3.0.0-M1:enforce (enforce-maven-version) @ tobago-theme-standard
---
[INFO] 
[INFO] --- maven-enforcer-plugin:3.0.0-M1:enforce (enforce) @ tobago-theme-standard ---
[INFO] 
[INFO] --- maven-remote-resources-plugin:1.5:process (default) @ tobago-theme-standard ---
[INFO] 
[INFO] --- maven-remote-resources-plugin:1.5:process (process-resource-bundles) @ tobago-theme-standard
---
[INFO] 
[INFO] --- maven-resources-plugin:2.7:copy-resources (step #1: copy-custom) @ tobago-theme-standard
---
[INFO] Using 'UTF-8' encoding to copy filtered resources.
[INFO] Copying 28 resources
[INFO] Copying 1 resource
[INFO] 
[INFO] --- maven-dependency-plugin:3.1.1:unpack (step #2: unpack-custom) @ tobago-theme-standard
---
[INFO] Configured Artifact: org.apache.myfaces.tobago:tobago-core:5.0.0-SNAPSHOT:jar
[INFO] Unpacking /home/jenkins/jenkins-slave/workspace/Tobago Trunk/tobago-core/target/tobago-core-5.0.0-SNAPSHOT.jar
to <https://builds.apache.org/job/Tobago%20Trunk/org.apache.myfaces.tobago$tobago-theme-standard/ws/target/npm>
with includes "**/*.scss" and excludes ""
[INFO] 
[INFO] --- frontend-maven-plugin:1.6:install-node-and-npm (step #3: install node and npm)
@ tobago-theme-standard ---
[INFO] Installing node version v8.11.4
[INFO] Unpacking /home/jenkins/jenkins-slave/maven-repositories/0/com/github/eirslett/node/8.11.4/node-8.11.4-linux-x64.tar.gz
into <https://builds.apache.org/job/Tobago%20Trunk/org.apache.myfaces.tobago$tobago-theme-standard/ws/target/npm/node/tmp>
[INFO] Copying node binary from <https://builds.apache.org/job/Tobago%20Trunk/org.apache.myfaces.tobago$tobago-theme-standard/ws/target/npm/node/tmp/node-v8.11.4-linux-x64/bin/node>
to <https://builds.apache.org/job/Tobago%20Trunk/org.apache.myfaces.tobago$tobago-theme-standard/ws/target/npm/node/node>
[INFO] Extracting NPM
[INFO] Installed node locally.
[INFO] 
[INFO] --- frontend-maven-plugin:1.6:npm (step #4: npm install) @ tobago-theme-standard ---
[INFO] Running 'npm install' in <https://builds.apache.org/job/Tobago%20Trunk/org.apache.myfaces.tobago$tobago-theme-standard/ws/target/npm>
[INFO] 
[INFO] > node-sass@4.10.0 install <https://builds.apache.org/job/Tobago%20Trunk/org.apache.myfaces.tobago$tobago-theme-standard/ws/target/npm/node_modules/node-sass>
[INFO] > node scripts/install.js
[INFO] 
[INFO] Cached binary found at /home/jenkins/.npm/node-sass/4.10.0/linux-x64-57_binding.node
[INFO] 
[INFO] > node-sass@4.10.0 postinstall <https://builds.apache.org/job/Tobago%20Trunk/org.apache.myfaces.tobago$tobago-theme-standard/ws/target/npm/node_modules/node-sass>
[INFO] > node scripts/build.js
[INFO] 
[INFO] Binary found at <https://builds.apache.org/job/Tobago%20Trunk/org.apache.myfaces.tobago$tobago-theme-standard/ws/target/npm/node_modules/node-sass/vendor/linux-x64-57/binding.node>
[INFO] Testing binary
[INFO] Binary is fine
[WARNING] npm WARN optional SKIPPING OPTIONAL DEPENDENCY: fsevents@1.2.4 (node_modules/fsevents):
[WARNING] npm WARN notsup SKIPPING OPTIONAL DEPENDENCY: Unsupported platform for fsevents@1.2.4:
wanted {"os":"darwin","arch":"any"} (current: {"os":"linux","arch":"x64"})
[ERROR] 
[INFO] added 514 packages in 10.974s
[INFO] 
[INFO] --- frontend-maven-plugin:1.6:npm (step #5: npm run css) @ tobago-theme-standard ---
[INFO] Running 'npm run css' in <https://builds.apache.org/job/Tobago%20Trunk/org.apache.myfaces.tobago$tobago-theme-standard/ws/target/npm>
[INFO] 
[INFO] > tobago-theme-standard@5.0.0-SNAPSHOT css <https://builds.apache.org/job/Tobago%20Trunk/org.apache.myfaces.tobago$tobago-theme-standard/ws/target/npm>
[INFO] > npm-run-all --parallel css-compile --sequential css-prefix css-minify
[INFO] 
[INFO] 
[INFO] > tobago-theme-standard@5.0.0-SNAPSHOT css-compile <https://builds.apache.org/job/Tobago%20Trunk/org.apache.myfaces.tobago$tobago-theme-standard/ws/target/npm>
[INFO] > node-sass --output-style expanded --source-map true --source-map-contents true
--precision 6 scss/tobago-theme.scss css/tobago.css
[INFO] 
[INFO] Rendering Complete, saving .css file...
[INFO] Wrote CSS to <https://builds.apache.org/job/Tobago%20Trunk/org.apache.myfaces.tobago$tobago-theme-standard/ws/target/npm/css/tobago.css>
[INFO] Wrote Source Map to <https://builds.apache.org/job/Tobago%20Trunk/org.apache.myfaces.tobago$tobago-theme-standard/ws/target/npm/css/tobago.css.map>
[INFO] 
[INFO] > tobago-theme-standard@5.0.0-SNAPSHOT css-prefix <https://builds.apache.org/job/Tobago%20Trunk/org.apache.myfaces.tobago$tobago-theme-standard/ws/target/npm>
[INFO] > postcss --config postcss.config.js --replace "css/*.css" "!css/*.min.css"
[INFO] 
[INFO] 
[INFO] > tobago-theme-standard@5.0.0-SNAPSHOT css-minify <https://builds.apache.org/job/Tobago%20Trunk/org.apache.myfaces.tobago$tobago-theme-standard/ws/target/npm>
[INFO] > cleancss --level 1 --source-map --source-map-inline-sources --output css/tobago.min.css
css/tobago.css
[INFO] 
[INFO] 
[INFO] --- frontend-maven-plugin:1.6:npm (step #5b: ts-compile) @ tobago-theme-standard ---
[INFO] Running 'npm run ts-compile' in <https://builds.apache.org/job/Tobago%20Trunk/org.apache.myfaces.tobago$tobago-theme-standard/ws/target/npm>
[INFO] 
[INFO] > tobago-theme-standard@5.0.0-SNAPSHOT ts-compile <https://builds.apache.org/job/Tobago%20Trunk/org.apache.myfaces.tobago$tobago-theme-standard/ws/target/npm>
[INFO] > tsc
[INFO] 
[ERROR] sh: 1: tsc: not found
[ERROR] npm ERR! file sh
[ERROR] npm ERR! code ELIFECYCLE
[ERROR] npm ERR! errno ENOENT
[ERROR] npm ERR! syscall spawn
[ERROR] npm ERR! tobago-theme-standard@5.0.0-SNAPSHOT ts-compile: `tsc`
[ERROR] npm ERR! spawn ENOENT
[ERROR] npm ERR! 
[ERROR] npm ERR! Failed at the tobago-theme-standard@5.0.0-SNAPSHOT ts-compile script.
[ERROR] npm ERR! This is probably not a problem with npm. There is likely additional logging
output above.
[ERROR] 
[ERROR] npm ERR! A complete log of this run can be found in:
[ERROR] npm ERR!     /home/jenkins/.npm/_logs/2019-01-23T11_22_14_500Z-debug.log

Mime
View raw message