myfaces-commits mailing list archives

Site index · List index
Message view « Date » · « Thread »
Top « Date » · « Thread »
From Apache Jenkins Server <jenk...@builds.apache.org>
Subject Build failed in Jenkins: myfaces-current-master #180
Date Thu, 11 Jul 2019 09:11:19 GMT
See <https://builds.apache.org/job/myfaces-current-master/180/display/redirect?page=changes>

Changes:

[tandraschko] refactored

------------------------------------------
[...truncated 681.89 KB...]
}}catch(e){if(jsf ---> . <--- getProjectStage()==="Development"){var defaultErrorOutput

[WARNING] [WARNING] The symbol jsf is declared but is apparently never used.
This code can probably be written in a more efficient way.
}}catch(e){if(jsf ---> . <--- getProjectStage()==="Development"){var defaultErrorOutput
[INFO] _Dom.js (50,371 bytes) ..................................... compressed at 71%

[WARNING] [WARNING] The variable tagNameStart has already been declared in the same scope...
,_tokenPos=0,_tokenForward=1,tagNameStart ---> = <--- (!tagNameStart)?BEGIN_TAG:tagNameStart;

[WARNING] [WARNING] The symbol _tokenPos is declared but is apparently never used.
This code can probably be written in a more efficient way.
=-1,_contentEnd=-1,_tokenPos ---> = <--- 0,_tokenForward=1,tagNameStart=(

[WARNING] [WARNING] The symbol _tokenForward is declared but is apparently never used.
This code can probably be written in a more efficient way.
_contentEnd=-1,_tokenPos=0,_tokenForward ---> = <--- 1,tagNameStart=(!tagNameStart)?
[INFO] _HtmlStripper.js (5,195 bytes) ............................. compressed at 84%

[WARNING] [WARNING] The symbol found is declared but is apparently never used.
This code can probably be written in a more efficient way.
obj,finalAttr,value);}var found ---> = <--- false;var prefix=(value)?
[INFO] _Lang.js (27,021 bytes) .................................... compressed at 68%
[INFO] _ListenerQueue.js (2,833 bytes) ............................ compressed at 77%
[INFO] _Logging.js (4,613 bytes) .................................. compressed at 65%

[WARNING] [WARNING] The variable i has already been declared in the same scope...
&&params!=null){for(var i ---> = <--- 0,param;(param=params[

[WARNING] [WARNING] The variable param has already been declared in the same scope...
){for(var i=0,param ---> ; <--- (param=params[i]);
[INFO] _OamSubmit.js (5,409 bytes) ................................ compressed at 68%
[INFO] _Queue.js (5,264 bytes) .................................... compressed at 82%
[INFO] ------------------------------------------------------------------------------
[INFO] compression saved 4,336 bytes
[INFO] 
[INFO] --- myfaces-javascript-plugin:1.0.1:compress (compress-alternatives) @ myfaces-api
---
[INFO] Compressing javascript using YahooUI
[INFO] ------------------------------------------------------------------------------

[WARNING] [WARNING] Using 'eval' is not recommended...
[INFO] Using 'eval' reduces the level of compression!
function (){var _r=window.eval ---> . <--- call(window,code);if(

[WARNING] [WARNING] Using 'eval' is not recommended...
[INFO] Using 'eval' reduces the level of compression!
_T[_e]||((_w.eval ---> && <--- (!_b.isBlackBerry||_b.isBlackBerry

[WARNING] [WARNING] Using 'eval' is not recommended...
[INFO] Using 'eval' reduces the level of compression!
_T[_e]||((_w.eval ---> ) <--- ?"_evalHeadAppendix":null);}if(

[WARNING] [WARNING] Using 'eval' is not recommended...
[INFO] Using 'eval' reduces the level of compression!
[_e]](c);}eval ---> . <--- call(window,c);return null

[WARNING] [WARNING] The variable _T has already been declared in the same scope...
,tv=parseFloat(dav);var _T ---> = <--- this;_T.browser={};

[WARNING] [WARNING] The variable tagNameStart has already been declared in the same scope...
,_tokenPos=0,_tokenForward=1,tagNameStart ---> = <--- (!tagNameStart)?BEGIN_TAG:tagNameStart;

[WARNING] [WARNING] The variable i has already been declared in the same scope...
&&params!=null){for(var i ---> = <--- 0,param;(param=params[

[WARNING] [WARNING] The variable param has already been declared in the same scope...
){for(var i=0,param ---> ; <--- (param=params[i]);

[WARNING] [WARNING] The variable _AJAXUTIL has already been declared in the same scope...
!this._partialIdsArray.length){var _AJAXUTIL ---> = <--- this._AJAXUTIL,myfacesOptions=this._context

[WARNING] [WARNING] The variable myfacesOptions has already been declared in the same scope...
){var _AJAXUTIL=this._AJAXUTIL,myfacesOptions ---> = <--- this._context.myfaces;return
this.

[WARNING] [WARNING] The symbol assigned is declared but is apparently never used.
This code can probably be written in a more efficient way.
}:function (){};var assigned ---> = <--- true;}if("function"!=typeof newCls

[WARNING] [WARNING] The symbol found is declared but is apparently never used.
This code can probably be written in a more efficient way.
obj,finalAttr,value);}var found ---> = <--- false;var prefix=(value)?

[WARNING] [WARNING] The symbol _tokenPos is declared but is apparently never used.
This code can probably be written in a more efficient way.
=-1,_contentEnd=-1,_tokenPos ---> = <--- 0,_tokenForward=1,tagNameStart=(

[WARNING] [WARNING] The symbol _tokenForward is declared but is apparently never used.
This code can probably be written in a more efficient way.
_contentEnd=-1,_tokenPos=0,_tokenForward ---> = <--- 1,tagNameStart=(!tagNameStart)?

[WARNING] [WARNING] The symbol _RT is declared but is apparently never used.
This code can probably be written in a more efficient way.
{var _Lang=this._Lang;var _RT ---> = <--- this._RT;try{var scopeThis=

[WARNING] [WARNING] The symbol _Lang is declared but is apparently never used.
This code can probably be written in a more efficient way.
,fixViewStates:function (context){var _Lang ---> = <--- this._Lang;var mfInternal=context.

[WARNING] [WARNING] The symbol _Lang is declared but is apparently never used.
This code can probably be written in a more efficient way.
:function (context,theForm){var _Lang ---> = <--- this._Lang;var mfInternal=context.

[WARNING] [WARNING] The symbol prefix is declared but is apparently never used.
This code can probably be written in a more efficient way.
(context,value,identifier){var prefix ---> = <--- this._getPrefix(context);var sourceForm

[WARNING] [WARNING] The symbol self is declared but is apparently never used.
This code can probably be written in a more efficient way.
};var clientIdsByTokens={};var self ---> = <--- {};function Socket(channelToken,url
[INFO] jsf-minimal.js (278,046 bytes) ............................. compressed at 73%
[INFO] _ExtRuntime.js (7,452 bytes) ............................... compressed at 77%
[INFO] _RuntimeQuirks.js (2,080 bytes) ............................ compressed at 77%
[INFO] Messages_de.js (5,844 bytes) ............................... compressed at 43%
[INFO] Messages_es.js (5,397 bytes) ............................... compressed at 38%
[INFO] Messages_fr.js (5,532 bytes) ............................... compressed at 40%
[INFO] Messages_it.js (5,101 bytes) ............................... compressed at 38%
[INFO] Messages_nl.js (5,112 bytes) ............................... compressed at 39%
[INFO] Messages_ru.js (5,855 bytes) ............................... compressed at 33%
[INFO] Messages_zh_CN.js (5,630 bytes) ............................ compressed at 51%
[INFO] Messages_zh_HK.js (5,962 bytes) ............................ compressed at 54%
[INFO] Messages_zh_TW.js (6,371 bytes) ............................ compressed at 57%
[INFO] FormData.js (2,518 bytes) .................................. compressed at 70%
[INFO] IFrame.js (11,769 bytes) ................................... compressed at 70%
[INFO] Xhr1.js (6,399 bytes) ...................................... compressed at 59%
[INFO] _AjaxRequestLevel2.js (2,762 bytes) ........................ compressed at 71%
[INFO] _ExtAjaxRequest.js (2,664 bytes) ........................... compressed at 77%
[INFO] _FormDataRequest.js (2,875 bytes) .......................... compressed at 74%
[INFO] _Logging.js (4,613 bytes) .................................. compressed at 65%
[INFO] ------------------------------------------------------------------------------
[INFO] compression saved 3,032 bytes
[INFO] 
[INFO] --- maven-compiler-plugin:3.6.1:compile (default-compile) @ myfaces-api ---
[INFO] Nothing to compile - all classes are up to date
[INFO] 
[INFO] --- maven-bundle-plugin:3.0.1:manifest (bundle-manifest) @ myfaces-api ---
[INFO] 
[INFO] --- maven-resources-plugin:2.5:testResources (default-testResources) @ myfaces-api
---
[debug] execute contextualize
[INFO] Using 'UTF-8' encoding to copy filtered resources.
[INFO] skip non existing resourceDirectory F:\jenkins\jenkins-slave\workspace\myfaces-current-master\api\src\test\resources
[INFO] Copying 3 resources
[INFO] Copying 3 resources
[INFO] 
[INFO] --- maven-compiler-plugin:3.6.1:testCompile (default-testCompile) @ myfaces-api ---
[INFO] No sources to compile
[INFO] 
[INFO] --- maven-surefire-plugin:2.22.1:test (default-test) @ myfaces-api ---
[INFO] Skipping execution of surefire because it has already been run for this configuration
[JENKINS] Recording test results
[INFO] 
[INFO] --- maven-jar-plugin:2.2:jar (default-jar) @ myfaces-api ---
[INFO] Building jar: F:\jenkins\jenkins-slave\workspace\myfaces-current-master\api\target\myfaces-api-3.0.0-SNAPSHOT.jar
[INFO] 
[INFO] >>> maven-source-plugin:2.2.1:jar (attach-source) > generate-sources @
myfaces-api >>>
[INFO] 
[INFO] --- maven-enforcer-plugin:1.4.1:enforce (enforce-maven-version) @ myfaces-api ---
[INFO] 
[INFO] --- build-helper-maven-plugin:1.9.1:parse-version (parse-version) @ myfaces-api ---
[INFO] 
[INFO] --- maven-checkstyle-plugin:2.17:check (validate) @ myfaces-api ---
[INFO] Starting audit...
Audit done.
[INFO] 
[INFO] --- myfaces-builder-plugin:1.0.10:build-metadata (default) @ myfaces-api ---
[INFO] model is up to date
[INFO] 
[INFO] --- myfaces-builder-plugin:1.0.10:make-components (makecomp) @ myfaces-api ---
[INFO] generated component files are up to date
[WARNING] Failed to getClass for org.apache.maven.plugin.source.SourceJarMojo
[INFO] 
[INFO] <<< maven-source-plugin:2.2.1:jar (attach-source) < generate-sources @
myfaces-api <<<
[INFO] 
[INFO] 
[INFO] --- maven-source-plugin:2.2.1:jar (attach-source) @ myfaces-api ---
[INFO] Building jar: F:\jenkins\jenkins-slave\workspace\myfaces-current-master\api\target\myfaces-api-3.0.0-SNAPSHOT-sources.jar
[INFO] 
[INFO] --- maven-site-plugin:3.3:attach-descriptor (attach-descriptor) @ myfaces-api ---
[INFO] 
[INFO] --- maven-jar-plugin:2.2:jar (default) @ myfaces-api ---
[INFO] 
[INFO] --- maven-jar-plugin:2.2:test-jar (default) @ myfaces-api ---
[INFO] Building jar: F:\jenkins\jenkins-slave\workspace\myfaces-current-master\api\target\myfaces-api-3.0.0-SNAPSHOT-tests.jar
[INFO] 
[INFO] --- maven-checkstyle-plugin:2.17:check (verify-style) @ myfaces-api ---
[INFO] Starting audit...
Audit done.
[INFO] 
[INFO] --- maven-install-plugin:2.5.2:install (default-install) @ myfaces-api ---
[INFO] Installing F:\jenkins\jenkins-slave\workspace\myfaces-current-master\api\target\myfaces-api-3.0.0-SNAPSHOT.jar
to f:\jenkins\jenkins-slave\maven-repositories\2\org\apache\myfaces\core\myfaces-api\3.0.0-SNAPSHOT\myfaces-api-3.0.0-SNAPSHOT.jar
[INFO] Installing F:\jenkins\jenkins-slave\workspace\myfaces-current-master\api\pom.xml to
f:\jenkins\jenkins-slave\maven-repositories\2\org\apache\myfaces\core\myfaces-api\3.0.0-SNAPSHOT\myfaces-api-3.0.0-SNAPSHOT.pom
[INFO] Installing F:\jenkins\jenkins-slave\workspace\myfaces-current-master\api\target\myfaces-api-3.0.0-SNAPSHOT-sources.jar
to f:\jenkins\jenkins-slave\maven-repositories\2\org\apache\myfaces\core\myfaces-api\3.0.0-SNAPSHOT\myfaces-api-3.0.0-SNAPSHOT-sources.jar
[INFO] Installing F:\jenkins\jenkins-slave\workspace\myfaces-current-master\api\target\myfaces-api-3.0.0-SNAPSHOT-tests.jar
to f:\jenkins\jenkins-slave\maven-repositories\2\org\apache\myfaces\core\myfaces-api\3.0.0-SNAPSHOT\myfaces-api-3.0.0-SNAPSHOT-tests.jar
[INFO] Installing F:\jenkins\jenkins-slave\workspace\myfaces-current-master\api\target\myfaces-api-3.0.0-SNAPSHOT-sources.jar
to f:\jenkins\jenkins-slave\maven-repositories\2\org\apache\myfaces\core\myfaces-api\3.0.0-SNAPSHOT\myfaces-api-3.0.0-SNAPSHOT-sources.jar
[INFO] Installing F:\jenkins\jenkins-slave\workspace\myfaces-current-master\api\target\myfaces-api-3.0.0-SNAPSHOT-tests.jar
to f:\jenkins\jenkins-slave\maven-repositories\2\org\apache\myfaces\core\myfaces-api\3.0.0-SNAPSHOT\myfaces-api-3.0.0-SNAPSHOT-tests.jar
[INFO] 
[INFO] --- maven-deploy-plugin:2.8.2:deploy (default-deploy) @ myfaces-api ---
[INFO] Downloading from apache.snapshots.https: https://repository.apache.org/content/repositories/snapshots/org/apache/myfaces/core/myfaces-api/3.0.0-SNAPSHOT/maven-metadata.xml
[INFO] Downloaded from apache.snapshots.https: https://repository.apache.org/content/repositories/snapshots/org/apache/myfaces/core/myfaces-api/3.0.0-SNAPSHOT/maven-metadata.xml
(1.2 kB at 1.6 kB/s)
[INFO] Uploading to apache.snapshots.https: https://repository.apache.org/content/repositories/snapshots/org/apache/myfaces/core/myfaces-api/3.0.0-SNAPSHOT/myfaces-api-3.0.0-20190711.091039-613.jar
[INFO] Uploaded to apache.snapshots.https: https://repository.apache.org/content/repositories/snapshots/org/apache/myfaces/core/myfaces-api/3.0.0-SNAPSHOT/myfaces-api-3.0.0-20190711.091039-613.jar
(1.0 MB at 553 kB/s)
[INFO] Uploading to apache.snapshots.https: https://repository.apache.org/content/repositories/snapshots/org/apache/myfaces/core/myfaces-api/3.0.0-SNAPSHOT/myfaces-api-3.0.0-20190711.091039-613.pom
[INFO] Uploaded to apache.snapshots.https: https://repository.apache.org/content/repositories/snapshots/org/apache/myfaces/core/myfaces-api/3.0.0-SNAPSHOT/myfaces-api-3.0.0-20190711.091039-613.pom
(27 kB at 21 kB/s)
[INFO] Downloading from apache.snapshots.https: https://repository.apache.org/content/repositories/snapshots/org/apache/myfaces/core/myfaces-api/maven-metadata.xml
[INFO] Downloaded from apache.snapshots.https: https://repository.apache.org/content/repositories/snapshots/org/apache/myfaces/core/myfaces-api/maven-metadata.xml
(653 B at 1.0 kB/s)
[INFO] Uploading to apache.snapshots.https: https://repository.apache.org/content/repositories/snapshots/org/apache/myfaces/core/myfaces-api/3.0.0-SNAPSHOT/maven-metadata.xml
[INFO] Uploaded to apache.snapshots.https: https://repository.apache.org/content/repositories/snapshots/org/apache/myfaces/core/myfaces-api/3.0.0-SNAPSHOT/maven-metadata.xml
(1.2 kB at 1.0 kB/s)
[INFO] Uploading to apache.snapshots.https: https://repository.apache.org/content/repositories/snapshots/org/apache/myfaces/core/myfaces-api/maven-metadata.xml
[INFO] Uploaded to apache.snapshots.https: https://repository.apache.org/content/repositories/snapshots/org/apache/myfaces/core/myfaces-api/maven-metadata.xml
(653 B at 560 B/s)
[INFO] Uploading to apache.snapshots.https: https://repository.apache.org/content/repositories/snapshots/org/apache/myfaces/core/myfaces-api/3.0.0-SNAPSHOT/myfaces-api-3.0.0-20190711.091039-613-sources.jar
[INFO] ------------------------------------------------------------------------
[INFO] Reactor Summary for Apache MyFaces Core 3.0 3.0.0-SNAPSHOT:
[INFO] 
[INFO] Apache MyFaces Core 3.0 - Parent ................... SUCCESS [ 35.661 s]
[INFO] Apache MyFaces Core 3.0 - API ...................... FAILURE [01:15 min]
[INFO] Apache MyFaces Core 3.0 - Test ..................... SKIPPED
[INFO] Apache MyFaces Core 3.0 - Impl ..................... SKIPPED
[INFO] Apache MyFaces Core 3.0 - OSGi Bundle .............. SKIPPED
[INFO] Apache MyFaces Core 3.0 ............................ SKIPPED
[INFO] ------------------------------------------------------------------------
[INFO] BUILD FAILURE
[INFO] ------------------------------------------------------------------------
[INFO] Total time:  02:09 min
[INFO] Finished at: 2019-07-11T02:11:08-07:00
[INFO] ------------------------------------------------------------------------
Waiting for Jenkins to finish collecting data
[ERROR] Failed to execute goal org.apache.maven.plugins:maven-deploy-plugin:2.8.2:deploy (default-deploy)
on project myfaces-api: Failed to deploy artifacts: Could not transfer artifact org.apache.myfaces.core:myfaces-api:jar:sources:3.0.0-20190711.091039-613
from/to apache.snapshots.https (https://repository.apache.org/content/repositories/snapshots):
Connect to repository.apache.org:443 [repository.apache.org/207.244.88.140] failed: Connection
timed out: connect -> [Help 1]
[ERROR] 
[ERROR] To see the full stack trace of the errors, re-run Maven with the -e switch.
[ERROR] Re-run Maven using the -X switch to enable full debug logging.
[ERROR] 
[ERROR] For more information about the errors and possible solutions, please read the following
articles:
[ERROR] [Help 1] http://cwiki.apache.org/confluence/display/MAVEN/MojoExecutionException
[ERROR] 
[ERROR] After correcting the problems, you can resume the build with the command
[ERROR]   mvn <goals> -rf :myfaces-api
[JENKINS] Archiving F:\jenkins\jenkins-slave\workspace\myfaces-current-master\api\pom.xml
to org.apache.myfaces.core/myfaces-api/3.0.0-SNAPSHOT/myfaces-api-3.0.0-SNAPSHOT.pom
[JENKINS] Archiving F:\jenkins\jenkins-slave\workspace\myfaces-current-master\api\target\myfaces-api-3.0.0-SNAPSHOT.jar
to org.apache.myfaces.core/myfaces-api/3.0.0-20190711.091039-613/myfaces-api-3.0.0-20190711.091039-613.jar
[JENKINS] Archiving F:\jenkins\jenkins-slave\workspace\myfaces-current-master\api\target\myfaces-api-3.0.0-SNAPSHOT-sources.jar
to org.apache.myfaces.core/myfaces-api/3.0.0-20190711.091039-613/myfaces-api-3.0.0-20190711.091039-613-sources.jar
[JENKINS] Archiving F:\jenkins\jenkins-slave\workspace\myfaces-current-master\api\target\myfaces-api-3.0.0-SNAPSHOT-tests.jar
to org.apache.myfaces.core/myfaces-api/3.0.0-20190711.091039-613/myfaces-api-3.0.0-20190711.091039-613-tests.jar
[JENKINS] Archiving F:\jenkins\jenkins-slave\workspace\myfaces-current-master\test\pom.xml
to org.apache.myfaces.core/myfaces-test/3.0.0-SNAPSHOT/myfaces-test-3.0.0-SNAPSHOT.pom
[JENKINS] Archiving F:\jenkins\jenkins-slave\workspace\myfaces-current-master\impl\pom.xml
to org.apache.myfaces.core/myfaces-impl/3.0.0-SNAPSHOT/myfaces-impl-3.0.0-SNAPSHOT.pom
[Fast Archiver] Compressed 56.53 KB of artifacts by 56.6% relative to #179
[JENKINS] Archiving F:\jenkins\jenkins-slave\workspace\myfaces-current-master\bundle\pom.xml
to org.apache.myfaces.core/myfaces-bundle/3.0.0-SNAPSHOT/myfaces-bundle-3.0.0-SNAPSHOT.pom
[JENKINS] Archiving <https://builds.apache.org/job/myfaces-current-master/ws/pom.xml>
to org.apache.myfaces.core/myfaces-core-module/3.0.0-SNAPSHOT/myfaces-core-module-3.0.0-SNAPSHOT.pom
[JENKINS] Archiving F:\jenkins\jenkins-slave\workspace\myfaces-current-master\parent\pom.xml
to org.apache.myfaces.core/myfaces-core-project/3.0.0-SNAPSHOT/myfaces-core-project-3.0.0-SNAPSHOT.pom
[JENKINS] Archiving F:\jenkins\jenkins-slave\workspace\myfaces-current-master\parent\target\myfaces-core-project-3.0.0-SNAPSHOT-site.xml
to org.apache.myfaces.core/myfaces-core-project/3.0.0-20190711.090939-643/myfaces-core-project-3.0.0-20190711.090939-643-site.xml
Sending e-mails to: commits@myfaces.apache.org grantsmith@apache.org tandraschko@apache.org
channel stopped
Java HotSpot(TM) 64-Bit Server VM warning: ignoring option MaxPermSize=256m; support was removed
in 8.0

Mime
View raw message