myfaces-commits mailing list archives

Site index · List index
Message view « Date » · « Thread »
Top « Date » · « Thread »
From Apache Jenkins Server <jenk...@builds.apache.org>
Subject Build failed in Jenkins: myfaces-current23 #801
Date Tue, 08 Oct 2019 19:12:36 GMT
See <https://builds.apache.org/job/myfaces-current23/801/display/redirect?page=changes>

Changes:

[root] [maven-release-plugin] prepare release myfaces-core-module-2.3.5


------------------------------------------
[...truncated 271.89 KB...]
Progress (3): 85/202 kB | 106/165 kB | 53/222 kBProgress (3): 85/202 kB | 106/165 kB | 57/222
kBProgress (3): 90/202 kB | 106/165 kB | 57/222 kBProgress (3): 90/202 kB | 110/165 kB | 57/222
kBProgress (3): 94/202 kB | 110/165 kB | 57/222 kBProgress (3): 94/202 kB | 110/165 kB | 61/222
kBProgress (3): 98/202 kB | 110/165 kB | 61/222 kBProgress (3): 98/202 kB | 114/165 kB | 61/222
kBProgress (3): 98/202 kB | 114/165 kB | 65/222 kBProgress (3): 102/202 kB | 114/165 kB |
65/222 kBProgress (3): 102/202 kB | 118/165 kB | 65/222 kBProgress (3): 106/202 kB | 118/165
kB | 65/222 kBProgress (3): 106/202 kB | 122/165 kB | 65/222 kBProgress (3): 110/202 kB |
122/165 kB | 65/222 kBProgress (3): 110/202 kB | 122/165 kB | 69/222 kBProgress (3): 114/202
kB | 122/165 kB | 69/222 kBProgress (3): 114/202 kB | 126/165 kB | 69/222 kBProgress (3):
114/202 kB | 126/165 kB | 73/222 kBProgress (3): 114/202 kB | 131/165 kB | 73/222 kBProgress
(3): 114/202 kB | 131/165 kB | 77/222 kBProgress (3): 114/202 kB | 131/165 kB | 81/222 kBProgress
(3): 118/202 kB | 131/165 kB | 81/222 kBProgress (3): 122/202 kB | 131/165 kB | 81/222 kBProgress
(3): 122/202 kB | 135/165 kB | 81/222 kBProgress (3): 126/202 kB | 135/165 kB | 81/222 kBProgress
(3): 126/202 kB | 139/165 kB | 81/222 kBProgress (3): 131/202 kB | 139/165 kB | 81/222 kBProgress
(3): 131/202 kB | 143/165 kB | 81/222 kBProgress (3): 131/202 kB | 143/165 kB | 85/222 kBProgress
(3): 131/202 kB | 147/165 kB | 85/222 kBProgress (3): 131/202 kB | 147/165 kB | 90/222 kBProgress
(4): 131/202 kB | 147/165 kB | 90/222 kB | 2.2/4.3 kBProgress (4): 131/202 kB | 147/165 kB
| 94/222 kB | 2.2/4.3 kBProgress (4): 131/202 kB | 147/165 kB | 94/222 kB | 4.3 kB    Progress
(5): 131/202 kB | 147/165 kB | 94/222 kB | 4.3 kB | 4.1/46 kBProgress (5): 135/202 kB | 147/165
kB | 94/222 kB | 4.3 kB | 4.1/46 kBProgress (5): 135/202 kB | 147/165 kB | 94/222 kB | 4.3
kB | 7.6/46 kBProgress (5): 135/202 kB | 147/165 kB | 98/222 kB | 4.3 kB | 7.6/46 kBProgress
(5): 135/202 kB | 151/165 kB | 98/222 kB | 4.3 kB | 7.6/46 kBProgress (5): 135/202 kB | 151/165
kB | 98/222 kB | 4.3 kB | 12/46 kB Progress (5): 139/202 kB | 151/165 kB | 98/222 kB | 4.3
kB | 12/46 kBProgress (5): 139/202 kB | 151/165 kB | 98/222 kB | 4.3 kB | 16/46 kBProgress
(5): 139/202 kB | 155/165 kB | 98/222 kB | 4.3 kB | 16/46 kBProgress (5): 139/202 kB | 155/165
kB | 102/222 kB | 4.3 kB | 16/46 kBProgress (5): 143/202 kB | 155/165 kB | 102/222 kB | 4.3
kB | 16/46 kBProgress (5): 143/202 kB | 155/165 kB | 106/222 kB | 4.3 kB | 16/46 kBProgress
(5): 143/202 kB | 159/165 kB | 106/222 kB | 4.3 kB | 16/46 kBProgress (5): 143/202 kB | 159/165
kB | 110/222 kB | 4.3 kB | 16/46 kBProgress (5): 147/202 kB | 159/165 kB | 110/222 kB | 4.3
kB | 16/46 kBProgress (5): 147/202 kB | 159/165 kB | 110/222 kB | 4.3 kB | 20/46 kBProgress
(5): 147/202 kB | 159/165 kB | 114/222 kB | 4.3 kB | 20/46 kBProgress (5): 147/202 kB | 163/165
kB | 114/222 kB | 4.3 kB | 20/46 kBProgress (5): 147/202 kB | 163/165 kB | 114/222 kB | 4.3
kB | 24/46 kBProgress (5): 147/202 kB | 165 kB | 114/222 kB | 4.3 kB | 24/46 kB    Progress
(5): 151/202 kB | 165 kB | 114/222 kB | 4.3 kB | 24/46 kB                                
                                 Downloaded from central: https://repo.maven.apache.org/maven2/org/codehaus/plexus/plexus-component-annotations/1.7.1/plexus-component-annotations-1.7.1.jar
(4.3 kB at 78 kB/s)
Progress (4): 151/202 kB | 165 kB | 118/222 kB | 24/46 kBProgress (4): 151/202 kB | 165 kB
| 118/222 kB | 28/46 kBProgress (4): 151/202 kB | 165 kB | 122/222 kB | 28/46 kB         
                                               Downloading from central: https://repo.maven.apache.org/maven2/org/sonatype/sisu/sisu-inject-bean/1.4.2/sisu-inject-bean-1.4.2.jar
Progress (4): 155/202 kB | 165 kB | 122/222 kB | 28/46 kBProgress (4): 155/202 kB | 165 kB
| 126/222 kB | 28/46 kBProgress (4): 155/202 kB | 165 kB | 126/222 kB | 32/46 kBProgress (4):
155/202 kB | 165 kB | 131/222 kB | 32/46 kBProgress (4): 159/202 kB | 165 kB | 131/222 kB
| 32/46 kBProgress (4): 163/202 kB | 165 kB | 131/222 kB | 32/46 kBProgress (4): 163/202 kB
| 165 kB | 131/222 kB | 36/46 kBProgress (4): 163/202 kB | 165 kB | 131/222 kB | 40/46 kBProgress
(4): 163/202 kB | 165 kB | 135/222 kB | 40/46 kBProgress (4): 163/202 kB | 165 kB | 135/222
kB | 45/46 kBProgress (4): 167/202 kB | 165 kB | 135/222 kB | 45/46 kBProgress (4): 167/202
kB | 165 kB | 139/222 kB | 45/46 kBProgress (4): 171/202 kB | 165 kB | 139/222 kB | 45/46
kBProgress (4): 171/202 kB | 165 kB | 139/222 kB | 46 kB   Progress (4): 176/202 kB | 165
kB | 139/222 kB | 46 kB                                                      Downloaded from
central: https://repo.maven.apache.org/maven2/org/apache/maven/maven-model/3.0/maven-model-3.0.jar
(165 kB at 2.6 MB/s)
Progress (3): 176/202 kB | 143/222 kB | 46 kB                                            
Downloading from central: https://repo.maven.apache.org/maven2/org/sonatype/sisu/sisu-guice/2.1.7/sisu-guice-2.1.7-noaop.jar
Progress (3): 180/202 kB | 143/222 kB | 46 kBProgress (3): 180/202 kB | 147/222 kB | 46 kBProgress
(4): 180/202 kB | 147/222 kB | 46 kB | 4.1/153 kBProgress (4): 180/202 kB | 151/222 kB | 46
kB | 4.1/153 kBProgress (4): 184/202 kB | 151/222 kB | 46 kB | 4.1/153 kBProgress (4): 184/202
kB | 155/222 kB | 46 kB | 4.1/153 kBProgress (4): 184/202 kB | 155/222 kB | 46 kB | 7.7/153
kBProgress (4): 184/202 kB | 159/222 kB | 46 kB | 7.7/153 kBProgress (4): 188/202 kB | 159/222
kB | 46 kB | 7.7/153 kBProgress (4): 188/202 kB | 163/222 kB | 46 kB | 7.7/153 kBProgress
(4): 188/202 kB | 163/222 kB | 46 kB | 12/153 kB Progress (4): 192/202 kB | 163/222 kB | 46
kB | 12/153 kBProgress (4): 192/202 kB | 163/222 kB | 46 kB | 16/153 kBProgress (4): 196/202
kB | 163/222 kB | 46 kB | 16/153 kBProgress (4): 196/202 kB | 167/222 kB | 46 kB | 16/153
kBProgress (4): 196/202 kB | 171/222 kB | 46 kB | 16/153 kBProgress (4): 200/202 kB | 171/222
kB | 46 kB | 16/153 kBProgress (4): 200/202 kB | 176/222 kB | 46 kB | 16/153 kB          
                                              Downloaded from central: https://repo.maven.apache.org/maven2/org/codehaus/plexus/plexus-classworlds/2.2.3/plexus-classworlds-2.2.3.jar
(46 kB at 668 kB/s)
Progress (3): 200/202 kB | 180/222 kB | 16/153 kBProgress (3): 200/202 kB | 180/222 kB | 20/153
kBProgress (3): 202 kB | 180/222 kB | 20/153 kB    Progress (3): 202 kB | 180/222 kB | 24/153
kB                                             Downloading from central: https://repo.maven.apache.org/maven2/org/apache/maven/shared/maven-shared-utils/3.2.1/maven-shared-utils-3.2.1.jar
Progress (3): 202 kB | 184/222 kB | 24/153 kBProgress (3): 202 kB | 184/222 kB | 28/153 kBProgress
(3): 202 kB | 188/222 kB | 28/153 kBProgress (3): 202 kB | 188/222 kB | 32/153 kBProgress
(3): 202 kB | 192/222 kB | 32/153 kBProgress (3): 202 kB | 196/222 kB | 32/153 kBProgress
(3): 202 kB | 196/222 kB | 36/153 kBProgress (3): 202 kB | 196/222 kB | 40/153 kBProgress
(3): 202 kB | 200/222 kB | 40/153 kBProgress (3): 202 kB | 200/222 kB | 45/153 kBProgress
(4): 202 kB | 200/222 kB | 45/153 kB | 4.1/472 kBProgress (4): 202 kB | 200/222 kB | 49/153
kB | 4.1/472 kBProgress (4): 202 kB | 204/222 kB | 49/153 kB | 4.1/472 kBProgress (4): 202
kB | 204/222 kB | 49/153 kB | 7.7/472 kBProgress (4): 202 kB | 208/222 kB | 49/153 kB | 7.7/472
kBProgress (4): 202 kB | 208/222 kB | 49/153 kB | 12/472 kB Progress (4): 202 kB | 212/222
kB | 49/153 kB | 12/472 kBProgress (4): 202 kB | 212/222 kB | 53/153 kB | 12/472 kBProgress
(4): 202 kB | 212/222 kB | 53/153 kB | 16/472 kBProgress (4): 202 kB | 212/222 kB | 57/153
kB | 16/472 kBProgress (4): 202 kB | 217/222 kB | 57/153 kB | 16/472 kBProgress (4): 202 kB
| 217/222 kB | 61/153 kB | 16/472 kBProgress (4): 202 kB | 221/222 kB | 61/153 kB | 16/472
kBProgress (4): 202 kB | 221/222 kB | 61/153 kB | 20/472 kB                              
                          Downloaded from central: https://repo.maven.apache.org/maven2/org/sonatype/sisu/sisu-inject-plexus/1.4.2/sisu-inject-plexus-1.4.2.jar
(202 kB at 2.6 MB/s)
Downloading from central: https://repo.maven.apache.org/maven2/commons-io/commons-io/2.5/commons-io-2.5.jar
Progress (3): 221/222 kB | 65/153 kB | 20/472 kBProgress (3): 221/222 kB | 65/153 kB | 24/472
kBProgress (3): 222 kB | 65/153 kB | 24/472 kB    Progress (3): 222 kB | 65/153 kB | 28/472
kBProgress (3): 222 kB | 65/153 kB | 32/472 kBProgress (3): 222 kB | 69/153 kB | 32/472 kBProgress
(3): 222 kB | 73/153 kB | 32/472 kBProgress (3): 222 kB | 77/153 kB | 32/472 kBProgress (3):
222 kB | 81/153 kB | 32/472 kBProgress (3): 222 kB | 81/153 kB | 36/472 kBProgress (3): 222
kB | 81/153 kB | 40/472 kBProgress (3): 222 kB | 81/153 kB | 45/472 kBProgress (3): 222 kB
| 81/153 kB | 49/472 kBProgress (3): 222 kB | 85/153 kB | 49/472 kBProgress (3): 222 kB |
90/153 kB | 49/472 kBProgress (3): 222 kB | 94/153 kB | 49/472 kBProgress (4): 222 kB | 94/153
kB | 49/472 kB | 2.2/167 kBProgress (4): 222 kB | 94/153 kB | 53/472 kB | 2.2/167 kBProgress
(4): 222 kB | 98/153 kB | 53/472 kB | 2.2/167 kBProgress (4): 222 kB | 98/153 kB | 57/472
kB | 2.2/167 kBProgress (4): 222 kB | 98/153 kB | 57/472 kB | 5.0/167 kBProgress (4): 222
kB | 98/153 kB | 61/472 kB | 5.0/167 kBProgress (4): 222 kB | 102/153 kB | 61/472 kB | 5.0/167
kBProgress (4): 222 kB | 102/153 kB | 61/472 kB | 7.7/167 kBProgress (4): 222 kB | 102/153
kB | 65/472 kB | 7.7/167 kBProgress (4): 222 kB | 106/153 kB | 65/472 kB | 7.7/167 kBProgress
(4): 222 kB | 106/153 kB | 65/472 kB | 10/167 kB Progress (4): 222 kB | 110/153 kB | 65/472
kB | 10/167 kBProgress (4): 222 kB | 110/153 kB | 69/472 kB | 10/167 kBProgress (4): 222 kB
| 114/153 kB | 69/472 kB | 10/167 kBProgress (4): 222 kB | 114/153 kB | 69/472 kB | 13/167
kBProgress (4): 222 kB | 114/153 kB | 73/472 kB | 13/167 kBProgress (5): 222 kB | 114/153
kB | 73/472 kB | 13/167 kB | 4.1/209 kBProgress (5): 222 kB | 114/153 kB | 73/472 kB | 16/167
kB | 4.1/209 kBProgress (5): 222 kB | 114/153 kB | 77/472 kB | 16/167 kB | 4.1/209 kBProgress
(5): 222 kB | 114/153 kB | 77/472 kB | 16/167 kB | 7.7/209 kBProgress (5): 222 kB | 118/153
kB | 77/472 kB | 16/167 kB | 7.7/209 kBProgress (5): 222 kB | 118/153 kB | 77/472 kB | 16/167
kB | 12/209 kB Progress (5): 222 kB | 118/153 kB | 77/472 kB | 19/167 kB | 12/209 kBProgress
(5): 222 kB | 118/153 kB | 81/472 kB | 19/167 kB | 12/209 kBProgress (5): 222 kB | 118/153
kB | 81/472 kB | 21/167 kB | 12/209 kBProgress (5): 222 kB | 118/153 kB | 81/472 kB | 21/167
kB | 16/209 kBProgress (5): 222 kB | 118/153 kB | 81/472 kB | 24/167 kB | 16/209 kB      
                                                              Downloaded from central: https://repo.maven.apache.org/maven2/org/codehaus/plexus/plexus-utils/2.0.4/plexus-utils-2.0.4.jar
(222 kB at 2.5 MB/s)
Progress (4): 122/153 kB | 81/472 kB | 24/167 kB | 16/209 kBProgress (4): 122/153 kB | 81/472
kB | 24/167 kB | 20/209 kBProgress (4): 122/153 kB | 81/472 kB | 27/167 kB | 20/209 kBProgress
(4): 122/153 kB | 85/472 kB | 27/167 kB | 20/209 kBProgress (4): 122/153 kB | 85/472 kB |
27/167 kB | 24/209 kBProgress (4): 126/153 kB | 85/472 kB | 27/167 kB | 24/209 kBProgress
(4): 126/153 kB | 85/472 kB | 27/167 kB | 28/209 kBProgress (4): 126/153 kB | 85/472 kB |
30/167 kB | 28/209 kBProgress (4): 126/153 kB | 90/472 kB | 30/167 kB | 28/209 kBProgress
(4): 126/153 kB | 90/472 kB | 30/167 kB | 32/209 kBProgress (4): 131/153 kB | 90/472 kB |
30/167 kB | 32/209 kBProgress (4): 131/153 kB | 94/472 kB | 30/167 kB | 32/209 kBProgress
(4): 131/153 kB | 94/472 kB | 32/167 kB | 32/209 kBProgress (4): 131/153 kB | 98/472 kB |
32/167 kB | 32/209 kBProgress (4): 131/153 kB | 98/472 kB | 32/167 kB | 36/209 kBProgress
(4): 135/153 kB | 98/472 kB | 32/167 kB | 36/209 kBProgress (4): 135/153 kB | 98/472 kB |
32/167 kB | 40/209 kBProgress (4): 139/153 kB | 98/472 kB | 32/167 kB | 40/209 kBProgress
(4): 139/153 kB | 98/472 kB | 32/167 kB | 45/209 kBProgress (4): 139/153 kB | 102/472 kB |
32/167 kB | 45/209 kBProgress (4): 139/153 kB | 102/472 kB | 32/167 kB | 49/209 kBProgress
(4): 139/153 kB | 102/472 kB | 36/167 kB | 49/209 kBProgress (4): 143/153 kB | 102/472 kB
| 36/167 kB | 49/209 kBProgress (4): 143/153 kB | 102/472 kB | 40/167 kB | 49/209 kBProgress
(4): 143/153 kB | 106/472 kB | 40/167 kB | 49/209 kBProgress (4): 143/153 kB | 106/472 kB
| 45/167 kB | 49/209 kBProgress (4): 143/153 kB | 106/472 kB | 45/167 kB | 53/209 kBProgress
(4): 147/153 kB | 106/472 kB | 45/167 kB | 53/209 kBProgress (4): 147/153 kB | 106/472 kB
| 45/167 kB | 57/209 kBProgress (4): 147/153 kB | 106/472 kB | 49/167 kB | 57/209 kBProgress
(4): 147/153 kB | 110/472 kB | 49/167 kB | 57/209 kBProgress (4): 151/153 kB | 110/472 kB
| 49/167 kB | 57/209 kBProgress (4): 151/153 kB | 110/472 kB | 49/167 kB | 61/209 kBProgress
(4): 153 kB | 110/472 kB | 49/167 kB | 61/209 kB    Progress (4): 153 kB | 114/472 kB | 49/167
kB | 61/209 kBProgress (4): 153 kB | 114/472 kB | 49/167 kB | 65/209 kBProgress (4): 153 kB
| 114/472 kB | 53/167 kB | 65/209 kBProgress (4): 153 kB | 118/472 kB | 53/167 kB | 65/209
kBProgress (4): 153 kB | 118/472 kB | 57/167 kB | 65/209 kBProgress (4): 153 kB | 122/472
kB | 57/167 kB | 65/209 kBProgress (4): 153 kB | 122/472 kB | 61/167 kB | 65/209 kBProgress
(4): 153 kB | 122/472 kB | 61/167 kB | 69/209 kBProgress (4): 153 kB | 122/472 kB | 65/167
kB | 69/209 kBProgress (4): 153 kB | 126/472 kB | 65/167 kB | 69/209 kBProgress (4): 153 kB
| 126/472 kB | 65/167 kB | 73/209 kBProgress (4): 153 kB | 131/472 kB | 65/167 kB | 73/209
kBProgress (4): 153 kB | 131/472 kB | 65/167 kB | 77/209 kBProgress (4): 153 kB | 131/472
kB | 65/167 kB | 81/209 kBProgress (4): 153 kB | 131/472 kB | 69/167 kB | 81/209 kBProgress
(4): 153 kB | 135/472 kB | 69/167 kB | 81/209 kBProgress (4): 153 kB | 135/472 kB | 73/167
kB | 81/209 kBProgress (4): 153 kB | 135/472 kB | 73/167 kB | 85/209 kBProgress (4): 153 kB
| 139/472 kB | 73/167 kB | 85/209 kBProgress (4): 153 kB | 139/472 kB | 73/167 kB | 90/209
kBProgress (4): 153 kB | 139/472 kB | 77/167 kB | 90/209 kBProgress (4): 153 kB | 139/472
kB | 77/167 kB | 94/209 kBProgress (4): 153 kB | 143/472 kB | 77/167 kB | 94/209 kBProgress
(4): 153 kB | 143/472 kB | 77/167 kB | 98/209 kBProgress (4): 153 kB | 143/472 kB | 81/167
kB | 98/209 kBProgress (4): 153 kB | 147/472 kB | 81/167 kB | 98/209 kBProgress (4): 153 kB
| 147/472 kB | 81/167 kB | 102/209 kBProgress (4): 153 kB | 147/472 kB | 81/167 kB | 106/209
kBProgress (4): 153 kB | 151/472 kB | 81/167 kB | 106/209 kBProgress (4): 153 kB | 151/472
kB | 81/167 kB | 110/209 kBProgress (4): 153 kB | 155/472 kB | 81/167 kB | 110/209 kBProgress
(4): 153 kB | 155/472 kB | 85/167 kB | 110/209 kBProgress (4): 153 kB | 159/472 kB | 85/167
kB | 110/209 kB                                                          Downloaded from central:
https://repo.maven.apache.org/maven2/org/sonatype/sisu/sisu-inject-bean/1.4.2/sisu-inject-bean-1.4.2.jar
(153 kB at 1.5 MB/s)
Progress (3): 159/472 kB | 85/167 kB | 114/209 kBProgress (3): 163/472 kB | 85/167 kB | 114/209
kBProgress (3): 163/472 kB | 90/167 kB | 114/209 kBProgress (3): 163/472 kB | 94/167 kB |
114/209 kBProgress (3): 163/472 kB | 98/167 kB | 114/209 kBProgress (3): 167/472 kB | 98/167
kB | 114/209 kBProgress (3): 167/472 kB | 98/167 kB | 118/209 kBProgress (3): 171/472 kB |
98/167 kB | 118/209 kBProgress (3): 171/472 kB | 98/167 kB | 122/209 kBProgress (3): 176/472
kB | 98/167 kB | 122/209 kBProgress (3): 176/472 kB | 98/167 kB | 126/209 kBProgress (3):
180/472 kB | 98/167 kB | 126/209 kBProgress (3): 180/472 kB | 102/167 kB | 126/209 kBProgress
(3): 180/472 kB | 102/167 kB | 131/209 kBProgress (3): 180/472 kB | 106/167 kB | 131/209 kBProgress
(3): 180/472 kB | 110/167 kB | 131/209 kBProgress (3): 184/472 kB | 110/167 kB | 131/209 kBProgress
(3): 184/472 kB | 114/167 kB | 131/209 kBProgress (3): 188/472 kB | 114/167 kB | 131/209 kBProgress
(3): 188/472 kB | 114/167 kB | 135/209 kBProgress (3): 192/472 kB | 114/167 kB | 135/209 kBProgress
(3): 192/472 kB | 114/167 kB | 139/209 kBProgress (3): 196/472 kB | 114/167 kB | 139/209 kBProgress
(3): 196/472 kB | 114/167 kB | 143/209 kBProgress (3): 196/472 kB | 114/167 kB | 147/209 kBProgress
(3): 196/472 kB | 118/167 kB | 147/209 kBProgress (3): 196/472 kB | 122/167 kB | 147/209 kBProgress
(3): 200/472 kB | 122/167 kB | 147/209 kBProgress (3): 200/472 kB | 126/167 kB | 147/209 kBProgress
(3): 204/472 kB | 126/167 kB | 147/209 kBProgress (3): 204/472 kB | 126/167 kB | 151/209 kBProgress
(3): 208/472 kB | 126/167 kB | 151/209 kBProgress (3): 208/472 kB | 131/167 kB | 151/209 kBProgress
(3): 212/472 kB | 131/167 kB | 151/209 kBProgress (3): 212/472 kB | 131/167 kB | 155/209 kBProgress
(3): 212/472 kB | 131/167 kB | 159/209 kBProgress (3): 212/472 kB | 131/167 kB | 163/209 kBProgress
(3): 217/472 kB | 131/167 kB | 163/209 kBProgress (3): 217/472 kB | 135/167 kB | 163/209 kBProgress
(3): 221/472 kB | 135/167 kB | 163/209 kBProgress (3): 221/472 kB | 135/167 kB | 167/209 kBProgress
(3): 225/472 kB | 135/167 kB | 167/209 kBProgress (3): 225/472 kB | 139/167 kB | 167/209 kBProgress
(3): 229/472 kB | 139/167 kB | 167/209 kBProgress (3): 229/472 kB | 139/167 kB | 171/209 kBProgress
(3): 229/472 kB | 143/167 kB | 171/209 kBProgress (3): 229/472 kB | 143/167 kB | 176/209 kBProgress
(3): 229/472 kB | 147/167 kB | 176/209 kBProgress (3): 229/472 kB | 147/167 kB | 180/209 kBProgress
(3): 233/472 kB | 147/167 kB | 180/209 kBProgress (3): 237/472 kB | 147/167 kB | 180/209 kBProgress
(3): 241/472 kB | 147/167 kB | 180/209 kBProgress (3): 245/472 kB | 147/167 kB | 180/209 kBProgress
(3): 245/472 kB | 147/167 kB | 184/209 kBProgress (3): 245/472 kB | 151/167 kB | 184/209 kBProgress
(3): 245/472 kB | 151/167 kB | 188/209 kBProgress (3): 245/472 kB | 155/167 kB | 188/209 kBProgress
(3): 245/472 kB | 155/167 kB | 192/209 kBProgress (3): 245/472 kB | 159/167 kB | 192/209 kBProgress
(3): 249/472 kB | 159/167 kB | 192/209 kBProgress (3): 249/472 kB | 163/167 kB | 192/209 kBProgress
(3): 249/472 kB | 163/167 kB | 196/209 kBProgress (3): 253/472 kB | 163/167 kB | 196/209 kBProgress
(3): 253/472 kB | 167 kB | 196/209 kB    Progress (3): 258/472 kB | 167 kB | 196/209 kBProgress
(3): 262/472 kB | 167 kB | 196/209 kBProgress (3): 262/472 kB | 167 kB | 200/209 kBProgress
(3): 262/472 kB | 167 kB | 204/209 kBProgress (3): 262/472 kB | 167 kB | 208/209 kBProgress
(3): 262/472 kB | 167 kB | 209 kB    Progress (3): 266/472 kB | 167 kB | 209 kBProgress (3):
270/472 kB | 167 kB | 209 kBProgress (3): 274/472 kB | 167 kB | 209 kBProgress (3): 278/472
kB | 167 kB | 209 kBProgress (3): 282/472 kB | 167 kB | 209 kBProgress (3): 286/472 kB | 167
kB | 209 kBProgress (3): 290/472 kB | 167 kB | 209 kBProgress (3): 294/472 kB | 167 kB | 209
kBProgress (3): 298/472 kB | 167 kB | 209 kBProgress (3): 303/472 kB | 167 kB | 209 kBProgress
(3): 307/472 kB | 167 kB | 209 kBProgress (3): 311/472 kB | 167 kB | 209 kBProgress (3): 315/472
kB | 167 kB | 209 kBProgress (3): 319/472 kB | 167 kB | 209 kBProgress (3): 323/472 kB | 167
kB | 209 kBProgress (3): 327/472 kB | 167 kB | 209 kBProgress (3): 331/472 kB | 167 kB | 209
kBProgress (3): 335/472 kB | 167 kB | 209 kB                                          Downloaded
from central: https://repo.maven.apache.org/maven2/org/apache/maven/shared/maven-shared-utils/3.2.1/maven-shared-utils-3.2.1.jar
(167 kB at 1.4 MB/s)
Downloaded from central: https://repo.maven.apache.org/maven2/commons-io/commons-io/2.5/commons-io-2.5.jar
(209 kB at 1.8 MB/s)
Progress (1): 339/472 kBProgress (1): 344/472 kBProgress (1): 348/472 kBProgress (1): 352/472
kBProgress (1): 356/472 kBProgress (1): 360/472 kBProgress (1): 364/472 kBProgress (1): 368/472
kBProgress (1): 372/472 kBProgress (1): 376/472 kBProgress (1): 380/472 kBProgress (1): 384/472
kBProgress (1): 389/472 kBProgress (1): 393/472 kBProgress (1): 397/472 kBProgress (1): 401/472
kBProgress (1): 405/472 kBProgress (1): 409/472 kBProgress (1): 413/472 kBProgress (1): 417/472
kBProgress (1): 421/472 kBProgress (1): 425/472 kBProgress (1): 430/472 kBProgress (1): 434/472
kBProgress (1): 438/472 kBProgress (1): 442/472 kBProgress (1): 446/472 kBProgress (1): 450/472
kBProgress (1): 454/472 kBProgress (1): 458/472 kBProgress (1): 462/472 kBProgress (1): 466/472
kBProgress (1): 470/472 kBProgress (1): 472 kB                        Downloaded from central:
https://repo.maven.apache.org/maven2/org/sonatype/sisu/sisu-guice/2.1.7/sisu-guice-2.1.7-noaop.jar
(472 kB at 3.5 MB/s)
[INFO] Deleting <https://builds.apache.org/job/myfaces-current23/ws/parent/target>
[INFO] 
[INFO] ----------------< org.apache.myfaces.core:myfaces-api >-----------------
[INFO] Building Apache MyFaces JSF-2.3 Core API 2.3.5                     [2/8]
[INFO] --------------------------------[ jar ]---------------------------------
Downloading from apache.snapshots.plugin: http://repository.apache.org/snapshots/de/berlios/jsunit/jsunit-maven2-plugin/maven-metadata.xml
Downloading from central: https://repo.maven.apache.org/maven2/de/berlios/jsunit/jsunit-maven2-plugin/maven-metadata.xml
Progress (1): 398 B                   Downloaded from central: https://repo.maven.apache.org/maven2/de/berlios/jsunit/jsunit-maven2-plugin/maven-metadata.xml
(398 B at 4.9 kB/s)
Downloading from central: https://repo.maven.apache.org/maven2/de/berlios/jsunit/jsunit-maven2-plugin/1.3/jsunit-maven2-plugin-1.3.pom
Progress (1): 2.2/4.3 kBProgress (1): 4.3 kB                        Downloaded from central:
https://repo.maven.apache.org/maven2/de/berlios/jsunit/jsunit-maven2-plugin/1.3/jsunit-maven2-plugin-1.3.pom
(4.3 kB at 266 kB/s)
Downloading from central: https://repo.maven.apache.org/maven2/de/berlios/jsunit/jsunit-parent/1.3/jsunit-parent-1.3.pom
Progress (1): 2.2/14 kBProgress (1): 5.0/14 kBProgress (1): 7.8/14 kBProgress (1): 11/14 kB
Progress (1): 13/14 kBProgress (1): 14 kB                      Downloaded from central: https://repo.maven.apache.org/maven2/de/berlios/jsunit/jsunit-parent/1.3/jsunit-parent-1.3.pom
(14 kB at 765 kB/s)
Downloading from central: https://repo.maven.apache.org/maven2/de/berlios/jsunit/jsunit-maven2-plugin/1.3/jsunit-maven2-plugin-1.3.jar
Progress (1): 2.2/7.6 kBProgress (1): 5.0/7.6 kBProgress (1): 7.6 kB                     
  Downloaded from central: https://repo.maven.apache.org/maven2/de/berlios/jsunit/jsunit-maven2-plugin/1.3/jsunit-maven2-plugin-1.3.jar
(7.6 kB at 542 kB/s)
Downloading from central: https://repo.maven.apache.org/maven2/org/codehaus/mojo/build-helper-maven-plugin/1.9.1/build-helper-maven-plugin-1.9.1.pom
Progress (1): 2.2/6.8 kBProgress (1): 5.0/6.8 kBProgress (1): 6.8 kB                     
  Downloaded from central: https://repo.maven.apache.org/maven2/org/codehaus/mojo/build-helper-maven-plugin/1.9.1/build-helper-maven-plugin-1.9.1.pom
(6.8 kB at 525 kB/s)
Downloading from central: https://repo.maven.apache.org/maven2/org/codehaus/mojo/mojo-parent/33/mojo-parent-33.pom
Progress (1): 2.2/26 kBProgress (1): 5.0/26 kBProgress (1): 7.8/26 kBProgress (1): 11/26 kB
Progress (1): 13/26 kBProgress (1): 16/26 kBProgress (1): 19/26 kBProgress (1): 21/26 kBProgress
(1): 24/26 kBProgress (1): 26 kB                      Downloaded from central: https://repo.maven.apache.org/maven2/org/codehaus/mojo/mojo-parent/33/mojo-parent-33.pom
(26 kB at 1.7 MB/s)
Downloading from central: https://repo.maven.apache.org/maven2/org/codehaus/codehaus-parent/4/codehaus-parent-4.pom
Progress (1): 2.2/4.8 kBProgress (1): 4.8 kB                        Downloaded from central:
https://repo.maven.apache.org/maven2/org/codehaus/codehaus-parent/4/codehaus-parent-4.pom
(4.8 kB at 371 kB/s)
Downloading from central: https://repo.maven.apache.org/maven2/org/codehaus/mojo/build-helper-maven-plugin/1.9.1/build-helper-maven-plugin-1.9.1.jar
Progress (1): 2.2/47 kBProgress (1): 5.0/47 kBProgress (1): 7.7/47 kBProgress (1): 10/47 kB
Progress (1): 13/47 kBProgress (1): 16/47 kBProgress (1): 19/47 kBProgress (1): 21/47 kBProgress
(1): 24/47 kBProgress (1): 27/47 kBProgress (1): 30/47 kBProgress (1): 32/47 kBProgress (1):
36/47 kBProgress (1): 40/47 kBProgress (1): 45/47 kBProgress (1): 47 kB                  
   Downloaded from central: https://repo.maven.apache.org/maven2/org/codehaus/mojo/build-helper-maven-plugin/1.9.1/build-helper-maven-plugin-1.9.1.jar
(47 kB at 2.9 MB/s)
Downloading from central: https://repo.maven.apache.org/maven2/org/apache/maven/plugins/maven-jar-plugin/2.2/maven-jar-plugin-2.2.pom
Progress (1): 4.1/8.6 kBProgress (1): 7.7/8.6 kBProgress (1): 8.6 kB                     
  Downloaded from central: https://repo.maven.apache.org/maven2/org/apache/maven/plugins/maven-jar-plugin/2.2/maven-jar-plugin-2.2.pom
(8.6 kB at 713 kB/s)
Downloading from central: https://repo.maven.apache.org/maven2/org/apache/maven/plugins/maven-plugins/10/maven-plugins-10.pom
Progress (1): 4.1/7.5 kBProgress (1): 7.5 kB                        Downloaded from central:
https://repo.maven.apache.org/maven2/org/apache/maven/plugins/maven-plugins/10/maven-plugins-10.pom
(7.5 kB at 532 kB/s)
Downloading from central: https://repo.maven.apache.org/maven2/org/apache/maven/maven-parent/7/maven-parent-7.pom
Progress (1): 2.2/21 kBProgress (1): 5.0/21 kBProgress (1): 7.8/21 kBProgress (1): 11/21 kB
Progress (1): 13/21 kBProgress (1): 16/21 kBProgress (1): 19/21 kBProgress (1): 21 kB    
                 Downloaded from central: https://repo.maven.apache.org/maven2/org/apache/maven/maven-parent/7/maven-parent-7.pom
(21 kB at 1.5 MB/s)
Downloading from central: https://repo.maven.apache.org/maven2/org/apache/maven/plugins/maven-jar-plugin/2.2/maven-jar-plugin-2.2.jar
Progress (1): 2.2/27 kBProgress (1): 5.0/27 kBProgress (1): 7.7/27 kBProgress (1): 10/27 kB
Progress (1): 13/27 kBProgress (1): 16/27 kBProgress (1): 19/27 kBProgress (1): 21/27 kBProgress
(1): 24/27 kBProgress (1): 27 kB                      Downloaded from central: https://repo.maven.apache.org/maven2/org/apache/maven/plugins/maven-jar-plugin/2.2/maven-jar-plugin-2.2.jar
(27 kB at 1.9 MB/s)
Downloading from central: https://repo.maven.apache.org/maven2/org/apache/myfaces/buildtools/myfaces-builder-plugin/1.0.10/myfaces-builder-plugin-1.0.10.pom
Progress (1): 2.2/7.5 kBProgress (1): 5.0/7.5 kBProgress (1): 7.5 kB                     
  Downloaded from central: https://repo.maven.apache.org/maven2/org/apache/myfaces/buildtools/myfaces-builder-plugin/1.0.10/myfaces-builder-plugin-1.0.10.pom
(7.5 kB at 466 kB/s)
Downloading from central: https://repo.maven.apache.org/maven2/org/apache/myfaces/buildtools/myfaces-plugin-parent/1.0.6/myfaces-plugin-parent-1.0.6.pom
Progress (1): 2.2/5.8 kBProgress (1): 5.0/5.8 kBProgress (1): 5.8 kB                     
  Downloaded from central: https://repo.maven.apache.org/maven2/org/apache/myfaces/buildtools/myfaces-plugin-parent/1.0.6/myfaces-plugin-parent-1.0.6.pom
(5.8 kB at 364 kB/s)
Downloading from central: https://repo.maven.apache.org/maven2/org/apache/myfaces/myfaces/11/myfaces-11.pom
Progress (1): 2.2/35 kBProgress (1): 5.0/35 kBProgress (1): 7.8/35 kBProgress (1): 11/35 kB
Progress (1): 13/35 kBProgress (1): 16/35 kBProgress (1): 19/35 kBProgress (1): 21/35 kBProgress
(1): 24/35 kBProgress (1): 27/35 kBProgress (1): 30/35 kBProgress (1): 32/35 kBProgress (1):
35/35 kBProgress (1): 35 kB                      Downloaded from central: https://repo.maven.apache.org/maven2/org/apache/myfaces/myfaces/11/myfaces-11.pom
(35 kB at 387 kB/s)
Downloading from central: https://repo.maven.apache.org/maven2/org/apache/myfaces/buildtools/myfaces-builder-plugin/1.0.10/myfaces-builder-plugin-1.0.10.jar
Progress (1): 2.2/378 kBProgress (1): 5.0/378 kBProgress (1): 7.7/378 kBProgress (1): 10/378
kB Progress (1): 13/378 kBProgress (1): 16/378 kBProgress (1): 19/378 kBProgress (1): 21/378
kBProgress (1): 24/378 kBProgress (1): 27/378 kBProgress (1): 30/378 kBProgress (1): 32/378
kBProgress (1): 36/378 kBProgress (1): 40/378 kBProgress (1): 45/378 kBProgress (1): 49/378
kBProgress (1): 53/378 kBProgress (1): 57/378 kBProgress (1): 61/378 kBProgress (1): 65/378
kBProgress (1): 69/378 kBProgress (1): 73/378 kBProgress (1): 77/378 kBProgress (1): 81/378
kBProgress (1): 85/378 kBProgress (1): 90/378 kBProgress (1): 94/378 kBProgress (1): 98/378
kBProgress (1): 102/378 kBProgress (1): 106/378 kBProgress (1): 110/378 kBProgress (1): 114/378
kBProgress (1): 118/378 kBProgress (1): 122/378 kBProgress (1): 126/378 kBProgress (1): 131/378
kBProgress (1): 135/378 kBProgress (1): 139/378 kBProgress (1): 143/378 kBProgress (1): 147/378
kBProgress (1): 151/378 kBProgress (1): 155/378 kBProgress (1): 159/378 kBProgress (1): 163/378
kBProgress (1): 167/378 kBProgress (1): 171/378 kBProgress (1): 176/378 kBProgress (1): 180/378
kBProgress (1): 184/378 kBProgress (1): 188/378 kBProgress (1): 192/378 kBProgress (1): 196/378
kBProgress (1): 200/378 kBProgress (1): 204/378 kBProgress (1): 208/378 kBProgress (1): 212/378
kBProgress (1): 217/378 kBProgress (1): 221/378 kBProgress (1): 225/378 kBProgress (1): 229/378
kBProgress (1): 233/378 kBProgress (1): 237/378 kBProgress (1): 241/378 kBProgress (1): 245/378
kBProgress (1): 249/378 kBProgress (1): 253/378 kBProgress (1): 258/378 kBProgress (1): 262/378
kBProgress (1): 266/378 kBProgress (1): 270/378 kBProgress (1): 274/378 kBProgress (1): 278/378
kBProgress (1): 282/378 kBProgress (1): 286/378 kBProgress (1): 290/378 kBProgress (1): 294/378
kBProgress (1): 298/378 kBProgress (1): 303/378 kBProgress (1): 307/378 kBProgress (1): 311/378
kBProgress (1): 315/378 kBProgress (1): 319/378 kBProgress (1): 323/378 kBProgress (1): 327/378
kBProgress (1): 331/378 kBProgress (1): 335/378 kBProgress (1): 339/378 kBProgress (1): 344/378
kBProgress (1): 348/378 kBProgress (1): 352/378 kBProgress (1): 356/378 kBProgress (1): 360/378
kBProgress (1): 364/378 kBProgress (1): 368/378 kBProgress (1): 372/378 kBProgress (1): 376/378
kBProgress (1): 378 kB                        Downloaded from central: https://repo.maven.apache.org/maven2/org/apache/myfaces/buildtools/myfaces-builder-plugin/1.0.10/myfaces-builder-plugin-1.0.10.jar
(378 kB at 1.9 MB/s)
[INFO] 
[INFO] --- maven-clean-plugin:3.1.0:clean (default-clean) @ myfaces-api ---
[INFO] Deleting <https://builds.apache.org/job/myfaces-current23/ws/api/target>
[INFO] 
[INFO] ----< org.apache.myfaces.core.internal:myfaces-impl-shared-public >-----
[INFO] Building Apache MyFaces JSF-2.3 Core Shared Public 2.3.5           [3/8]
[INFO] --------------------------------[ jar ]---------------------------------
[INFO] 
[INFO] --- maven-clean-plugin:3.1.0:clean (default-clean) @ myfaces-impl-shared-public ---
[INFO] Deleting <https://builds.apache.org/job/myfaces-current23/ws/shared-public/target>
[INFO] 
[INFO] --------< org.apache.myfaces.core.internal:myfaces-impl-shared >--------
[INFO] Building Apache MyFaces JSF-2.3 Core Shared 2.3.5                  [4/8]
[INFO] --------------------------------[ jar ]---------------------------------
[INFO] 
[INFO] --- maven-clean-plugin:3.1.0:clean (default-clean) @ myfaces-impl-shared ---
[INFO] Deleting <https://builds.apache.org/job/myfaces-current23/ws/shared/target>
[INFO] 
[INFO] ----------------< org.apache.myfaces.core:myfaces-impl >----------------
[INFO] Building Apache MyFaces JSF-2.3 Core Impl 2.3.5                    [5/8]
[INFO] --------------------------------[ jar ]---------------------------------
[INFO] 
[INFO] --- maven-clean-plugin:3.1.0:clean (default-clean) @ myfaces-impl ---
[INFO] Deleting <https://builds.apache.org/job/myfaces-current23/ws/impl/target>
[INFO] 
[INFO] ---------------< org.apache.myfaces.core:myfaces-bundle >---------------
[INFO] Building Apache MyFaces JSF-2.3 Core OSGi Bundle 2.3.5             [6/8]
[INFO] -------------------------------[ bundle ]-------------------------------
[INFO] 
[INFO] --- maven-clean-plugin:3.1.0:clean (default-clean) @ myfaces-bundle ---
[INFO] Deleting <https://builds.apache.org/job/myfaces-current23/ws/bundle/target>
[INFO] 
[INFO] -------------< org.apache.myfaces.core:myfaces-impl-test >--------------
[INFO] Building Apache MyFaces JSF-2.3 Impl Test 2.3.5                    [7/8]
[INFO] --------------------------------[ jar ]---------------------------------
[INFO] 
[INFO] --- maven-clean-plugin:3.1.0:clean (default-clean) @ myfaces-impl-test ---
[INFO] Deleting <https://builds.apache.org/job/myfaces-current23/ws/impl-test/target>
[INFO] 
[INFO] ------------< org.apache.myfaces.core:myfaces-core-module >-------------
[INFO] Building Apache MyFaces JSF-2.3 Core Module 2.3.5                  [8/8]
[INFO] --------------------------------[ pom ]---------------------------------
[INFO] 
[INFO] --- maven-clean-plugin:3.1.0:clean (default-clean) @ myfaces-core-module ---
[INFO] Deleting <https://builds.apache.org/job/myfaces-current23/ws/target>
[INFO] ------------------------------------------------------------------------
[INFO] Reactor Summary for Apache MyFaces JSF-2.3 Core Module 2.3.5:
[INFO] 
[INFO] Apache MyFaces JSF-2.3 Core Project ................ SUCCESS [  1.169 s]
[INFO] Apache MyFaces JSF-2.3 Core API .................... SUCCESS [  0.844 s]
[INFO] Apache MyFaces JSF-2.3 Core Shared Public .......... SUCCESS [  0.023 s]
[INFO] Apache MyFaces JSF-2.3 Core Shared ................. SUCCESS [  0.023 s]
[INFO] Apache MyFaces JSF-2.3 Core Impl ................... SUCCESS [  0.147 s]
[INFO] Apache MyFaces JSF-2.3 Core OSGi Bundle ............ SUCCESS [  0.032 s]
[INFO] Apache MyFaces JSF-2.3 Impl Test ................... SUCCESS [  0.008 s]
[INFO] Apache MyFaces JSF-2.3 Core Module ................. SUCCESS [  0.003 s]
[INFO] ------------------------------------------------------------------------
[INFO] BUILD SUCCESS
[INFO] ------------------------------------------------------------------------
[INFO] Total time:  9.612 s
[INFO] Finished at: 2019-10-08T19:10:28Z
[INFO] ------------------------------------------------------------------------
Parsing POMs
Modules changed, recalculating dependency graph
Established TCP socket on 34731
maven35-agent.jar already up to date
maven35-interceptor.jar already up to date
maven3-interceptor-commons.jar already up to date
[myfaces-current23] $ /home/jenkins/tools/java/latest1.8/bin/java -Xmx2048m -Xms128m -XX:MaxPermSize=256m
-cp /home/jenkins/jenkins-slave/maven35-agent.jar:/home/jenkins/tools/maven/latest/boot/plexus-classworlds-2.6.0.jar:/home/jenkins/tools/maven/latest/conf/logging
jenkins.maven3.agent.Maven35Main /home/jenkins/tools/maven/latest/ /home/jenkins/jenkins-slave/remoting.jar
/home/jenkins/jenkins-slave/maven35-interceptor.jar /home/jenkins/jenkins-slave/maven3-interceptor-commons.jar
34731
Java HotSpot(TM) 64-Bit Server VM warning: ignoring option MaxPermSize=256m; support was removed
in 8.0
<===[JENKINS REMOTING CAPACITY]===>   channel started
Executing Maven:  -B -f <https://builds.apache.org/job/myfaces-current23/ws/pom.xml>
-Dmaven.repo.local=/home/jenkins/jenkins-slave/maven-repositories/1 clean install deploy
[INFO] Scanning for projects...
[WARNING] 
[WARNING] Some problems were encountered while building the effective model for org.apache.myfaces.core:myfaces-api:jar:2.3.5
[WARNING] 'build.plugins.plugin.version' for de.berlios.jsunit:jsunit-maven2-plugin is missing.
@ line 325, column 21
[WARNING] 
[WARNING] Some problems were encountered while building the effective model for org.apache.myfaces.core:myfaces-impl:jar:2.3.5
[WARNING] 'build.plugins.plugin.(groupId:artifactId)' must be unique but found duplicate declaration
of plugin org.apache.maven.plugins:maven-jar-plugin @ line 641, column 21
[WARNING] 
[WARNING] It is highly recommended to fix these problems because they threaten the stability
of your build.
[WARNING] 
[WARNING] For this reason, future Maven versions might no longer support building such malformed
projects.
[WARNING] 
[INFO] ------------------------------------------------------------------------
[INFO] Reactor Build Order:
[INFO] 
[INFO] Apache MyFaces JSF-2.3 Core Project                                [pom]
[INFO] Apache MyFaces JSF-2.3 Core API                                    [jar]
[INFO] Apache MyFaces JSF-2.3 Core Shared Public                          [jar]
[INFO] Apache MyFaces JSF-2.3 Core Shared                                 [jar]
[INFO] Apache MyFaces JSF-2.3 Core Impl                                   [jar]
[INFO] Apache MyFaces JSF-2.3 Core OSGi Bundle                         [bundle]
[INFO] Apache MyFaces JSF-2.3 Impl Test                                   [jar]
[INFO] Apache MyFaces JSF-2.3 Core Module                                 [pom]
[INFO] 
[INFO] ------------< org.apache.myfaces.core:myfaces-core-project >------------
[INFO] Building Apache MyFaces JSF-2.3 Core Project 2.3.5                 [1/8]
[INFO] --------------------------------[ pom ]---------------------------------
[INFO] 
[INFO] --- maven-clean-plugin:3.1.0:clean (default-clean) @ myfaces-core-project ---
[INFO] 
[INFO] --- maven-enforcer-plugin:1.4.1:enforce (enforce-maven-version) @ myfaces-core-project
---
[INFO] 
[INFO] --- maven-remote-resources-plugin:1.5:process (process-resource-bundles) @ myfaces-core-project
---
[INFO] 
[INFO] >>> maven-source-plugin:2.2.1:jar (attach-source) > generate-sources @
myfaces-core-project >>>
[INFO] 
[INFO] --- maven-enforcer-plugin:1.4.1:enforce (enforce-maven-version) @ myfaces-core-project
---
[WARNING] Failed to getClass for org.apache.maven.plugin.source.SourceJarMojo
[INFO] 
[INFO] <<< maven-source-plugin:2.2.1:jar (attach-source) < generate-sources @
myfaces-core-project <<<
[INFO] 
[INFO] 
[INFO] --- maven-source-plugin:2.2.1:jar (attach-source) @ myfaces-core-project ---
[INFO] 
[INFO] --- maven-site-plugin:3.3:attach-descriptor (attach-descriptor) @ myfaces-core-project
---
[INFO] 
[INFO] --- maven-checkstyle-plugin:2.17:check (verify-style) @ myfaces-core-project ---
[INFO] Starting audit...
Audit done.
[INFO] 
[INFO] --- maven-install-plugin:2.5.2:install (default-install) @ myfaces-core-project ---
[INFO] Installing <https://builds.apache.org/job/myfaces-current23/ws/parent/pom.xml>
to /home/jenkins/jenkins-slave/maven-repositories/1/org/apache/myfaces/core/myfaces-core-project/2.3.5/myfaces-core-project-2.3.5.pom
[INFO] Installing <https://builds.apache.org/job/myfaces-current23/ws/parent/target/myfaces-core-project-2.3.5-site.xml>
to /home/jenkins/jenkins-slave/maven-repositories/1/org/apache/myfaces/core/myfaces-core-project/2.3.5/myfaces-core-project-2.3.5-site.xml
[INFO] 
[INFO] --- maven-enforcer-plugin:1.4.1:enforce (enforce-maven-version) @ myfaces-core-project
---
[INFO] 
[INFO] --- maven-remote-resources-plugin:1.5:process (process-resource-bundles) @ myfaces-core-project
---
[INFO] 
[INFO] >>> maven-source-plugin:2.2.1:jar (attach-source) > generate-sources @
myfaces-core-project >>>
[INFO] 
[INFO] --- maven-enforcer-plugin:1.4.1:enforce (enforce-maven-version) @ myfaces-core-project
---
[WARNING] Failed to getClass for org.apache.maven.plugin.source.SourceJarMojo
[INFO] 
[INFO] <<< maven-source-plugin:2.2.1:jar (attach-source) < generate-sources @
myfaces-core-project <<<
[INFO] 
[INFO] 
[INFO] --- maven-source-plugin:2.2.1:jar (attach-source) @ myfaces-core-project ---
[INFO] 
[INFO] --- maven-site-plugin:3.3:attach-descriptor (attach-descriptor) @ myfaces-core-project
---
[INFO] 
[INFO] --- maven-checkstyle-plugin:2.17:check (verify-style) @ myfaces-core-project ---
[INFO] Starting audit...
Audit done.
[INFO] 
[INFO] --- maven-install-plugin:2.5.2:install (default-install) @ myfaces-core-project ---
[INFO] Installing <https://builds.apache.org/job/myfaces-current23/ws/parent/pom.xml>
to /home/jenkins/jenkins-slave/maven-repositories/1/org/apache/myfaces/core/myfaces-core-project/2.3.5/myfaces-core-project-2.3.5.pom
[INFO] Installing <https://builds.apache.org/job/myfaces-current23/ws/parent/target/myfaces-core-project-2.3.5-site.xml>
to /home/jenkins/jenkins-slave/maven-repositories/1/org/apache/myfaces/core/myfaces-core-project/2.3.5/myfaces-core-project-2.3.5-site.xml
[INFO] Installing <https://builds.apache.org/job/myfaces-current23/ws/parent/target/myfaces-core-project-2.3.5-site.xml>
to /home/jenkins/jenkins-slave/maven-repositories/1/org/apache/myfaces/core/myfaces-core-project/2.3.5/myfaces-core-project-2.3.5-site.xml
[INFO] 
[INFO] --- maven-deploy-plugin:2.8.2:deploy (default-deploy) @ myfaces-core-project ---
[INFO] Uploading to apache.releases.https: https://repository.apache.org/service/local/staging/deploy/maven2/org/apache/myfaces/core/myfaces-core-project/2.3.5/myfaces-core-project-2.3.5.pom
[INFO] ------------------------------------------------------------------------
[INFO] Reactor Summary for Apache MyFaces JSF-2.3 Core Module 2.3.5:
[INFO] 
[INFO] Apache MyFaces JSF-2.3 Core Project ................ FAILURE [ 13.630 s]
[INFO] Apache MyFaces JSF-2.3 Core API .................... SKIPPED
[INFO] Apache MyFaces JSF-2.3 Core Shared Public .......... SKIPPED
[INFO] Apache MyFaces JSF-2.3 Core Shared ................. SKIPPED
[INFO] Apache MyFaces JSF-2.3 Core Impl ................... SKIPPED
[INFO] Apache MyFaces JSF-2.3 Core OSGi Bundle ............ SKIPPED
[INFO] Apache MyFaces JSF-2.3 Impl Test ................... SKIPPED
[INFO] Apache MyFaces JSF-2.3 Core Module ................. SKIPPED
[INFO] ------------------------------------------------------------------------
[INFO] BUILD FAILURE
[INFO] ------------------------------------------------------------------------
[INFO] Total time:  30.084 s
[INFO] Finished at: 2019-10-08T19:12:14Z
[INFO] ------------------------------------------------------------------------
Waiting for Jenkins to finish collecting data[ERROR] Failed to execute goal org.apache.maven.plugins:maven-deploy-plugin:2.8.2:deploy
(default-deploy) on project myfaces-core-project: Failed to deploy artifacts: Could not transfer
artifact org.apache.myfaces.core:myfaces-core-project:pom:2.3.5 from/to apache.releases.https
(https://repository.apache.org/service/local/staging/deploy/maven2): Failed to transfer file
https://repository.apache.org/service/local/staging/deploy/maven2/org/apache/myfaces/core/myfaces-core-project/2.3.5/myfaces-core-project-2.3.5.pom
with status code 401 -> [Help 1]
[ERROR] 
[ERROR] To see the full stack trace of the errors, re-run Maven with the -e switch.
[ERROR] Re-run Maven using the -X switch to enable full debug logging.
[ERROR] 
[ERROR] For more information about the errors and possible solutions, please read the following
articles:
[ERROR] [Help 1] http://cwiki.apache.org/confluence/display/MAVEN/MojoExecutionException

[JENKINS] Archiving <https://builds.apache.org/job/myfaces-current23/ws/api/pom.xml>
to org.apache.myfaces.core/myfaces-api/2.3.5/myfaces-api-2.3.5.pom
[JENKINS] Archiving <https://builds.apache.org/job/myfaces-current23/ws/shared/pom.xml>
to org.apache.myfaces.core.internal/myfaces-impl-shared/2.3.5/myfaces-impl-shared-2.3.5.pom
[JENKINS] Archiving <https://builds.apache.org/job/myfaces-current23/ws/impl/pom.xml>
to org.apache.myfaces.core/myfaces-impl/2.3.5/myfaces-impl-2.3.5.pom
[JENKINS] Archiving <https://builds.apache.org/job/myfaces-current23/ws/bundle/pom.xml>
to org.apache.myfaces.core/myfaces-bundle/2.3.5/myfaces-bundle-2.3.5.pom
[JENKINS] Archiving <https://builds.apache.org/job/myfaces-current23/ws/pom.xml> to
org.apache.myfaces.core/myfaces-core-module/2.3.5/myfaces-core-module-2.3.5.pom
[JENKINS] Archiving <https://builds.apache.org/job/myfaces-current23/ws/shared-public/pom.xml>
to org.apache.myfaces.core.internal/myfaces-impl-shared-public/2.3.5/myfaces-impl-shared-public-2.3.5.pom
[JENKINS] Archiving <https://builds.apache.org/job/myfaces-current23/ws/impl-test/pom.xml>
to org.apache.myfaces.core/myfaces-impl-test/2.3.5/myfaces-impl-test-2.3.5.pom
[JENKINS] Archiving <https://builds.apache.org/job/myfaces-current23/ws/parent/pom.xml>
to org.apache.myfaces.core/myfaces-core-project/2.3.5/myfaces-core-project-2.3.5.pom
[JENKINS] Archiving <https://builds.apache.org/job/myfaces-current23/ws/parent/target/myfaces-core-project-2.3.5-site.xml>
to org.apache.myfaces.core/myfaces-core-project/2.3.5/myfaces-core-project-2.3.5-site.xml
No mail will be sent out, as 'myfaces-current23 » Apache MyFaces JSF-2.3 Core API #801'
does not have a result yet. Please make sure you set a proper result in case of pipeline/build
scripts.
No mail will be sent out, as 'myfaces-current23 » Apache MyFaces JSF-2.3 Core Shared #801'
does not have a result yet. Please make sure you set a proper result in case of pipeline/build
scripts.
No mail will be sent out, as 'myfaces-current23 » Apache MyFaces JSF-2.3 Core Impl #801'
does not have a result yet. Please make sure you set a proper result in case of pipeline/build
scripts.
No mail will be sent out, as 'myfaces-current23 » Apache MyFaces JSF-2.3 Core OSGi Bundle
#801' does not have a result yet. Please make sure you set a proper result in case of pipeline/build
scripts.
No mail will be sent out, as 'myfaces-current23 » Apache MyFaces JSF-2.3 Core Module #801'
does not have a result yet. Please make sure you set a proper result in case of pipeline/build
scripts.
No mail will be sent out, as 'myfaces-current23 » Apache MyFaces JSF-2.3 Core Shared Public
#801' does not have a result yet. Please make sure you set a proper result in case of pipeline/build
scripts.
No mail will be sent out, as 'myfaces-current23 » Apache MyFaces JSF-2.3 Impl Test #801'
does not have a result yet. Please make sure you set a proper result in case of pipeline/build
scripts.
Not sending mail to unregistered user pnicolucci@gmail.com
Sending e-mails to: commits@myfaces.apache.org grantsmith@apache.org
channel stopped
Not sending mail to unregistered user pnicolucci@gmail.com

Mime
View raw message