myfaces-commits mailing list archives

Site index · List index
Message view « Date » · « Thread »
Top « Date » · « Thread »
From Apache Jenkins Server <jenk...@builds.apache.org>
Subject Build failed in Jenkins: myfaces-current-master #376
Date Mon, 02 Mar 2020 09:20:49 GMT
See <https://builds.apache.org/job/myfaces-current-master/376/display/redirect?page=changes>

Changes:

[rmpestano] - Enable native mode - adds tests for jvm and native mode

[rmpestano] - fix lazy sorter - adds readme for showcase

[rmpestano] readme update

[rmpestano] removes unnecessary classes registered for reflection


------------------------------------------
[...truncated 2.63 MB...]
[INFO] Downloading from central: https://repo.maven.apache.org/maven2/org/junit/platform/junit-platform-launcher/1.2.0/junit-platform-launcher-1.2.0.pom
[INFO] Downloaded from central: https://repo.maven.apache.org/maven2/org/junit/platform/junit-platform-launcher/1.2.0/junit-platform-launcher-1.2.0.pom
(2.2 kB at 185 kB/s)
[INFO] Downloading from central: https://repo.maven.apache.org/maven2/org/apiguardian/apiguardian-api/1.0.0/apiguardian-api-1.0.0.pom
[INFO] Downloaded from central: https://repo.maven.apache.org/maven2/org/apiguardian/apiguardian-api/1.0.0/apiguardian-api-1.0.0.pom
(1.2 kB at 106 kB/s)
[INFO] Downloading from central: https://repo.maven.apache.org/maven2/org/junit/platform/junit-platform-engine/1.2.0/junit-platform-engine-1.2.0.pom
[INFO] Downloaded from central: https://repo.maven.apache.org/maven2/org/junit/platform/junit-platform-engine/1.2.0/junit-platform-engine-1.2.0.pom
(2.4 kB at 199 kB/s)
[INFO] Downloading from central: https://repo.maven.apache.org/maven2/org/junit/platform/junit-platform-commons/1.2.0/junit-platform-commons-1.2.0.pom
[INFO] Downloaded from central: https://repo.maven.apache.org/maven2/org/junit/platform/junit-platform-commons/1.2.0/junit-platform-commons-1.2.0.pom
(2.0 kB at 184 kB/s)
[INFO] Downloading from central: https://repo.maven.apache.org/maven2/org/opentest4j/opentest4j/1.1.0/opentest4j-1.1.0.pom
[INFO] Downloaded from central: https://repo.maven.apache.org/maven2/org/opentest4j/opentest4j/1.1.0/opentest4j-1.1.0.pom
(1.7 kB at 129 kB/s)
[INFO] Downloading from central: https://repo.maven.apache.org/maven2/org/apache/maven/surefire/surefire-junit-platform/2.22.0/surefire-junit-platform-2.22.0.jar
[INFO] Downloading from central: https://repo.maven.apache.org/maven2/org/junit/platform/junit-platform-launcher/1.2.0/junit-platform-launcher-1.2.0.jar
[INFO] Downloading from central: https://repo.maven.apache.org/maven2/org/junit/platform/junit-platform-engine/1.2.0/junit-platform-engine-1.2.0.jar
[INFO] Downloading from central: https://repo.maven.apache.org/maven2/org/apiguardian/apiguardian-api/1.0.0/apiguardian-api-1.0.0.jar
[INFO] Downloading from central: https://repo.maven.apache.org/maven2/org/junit/platform/junit-platform-commons/1.2.0/junit-platform-commons-1.2.0.jar
[INFO] Downloaded from central: https://repo.maven.apache.org/maven2/org/apiguardian/apiguardian-api/1.0.0/apiguardian-api-1.0.0.jar
(2.2 kB at 166 kB/s)
[INFO] Downloading from central: https://repo.maven.apache.org/maven2/org/opentest4j/opentest4j/1.1.0/opentest4j-1.1.0.jar
[INFO] Downloaded from central: https://repo.maven.apache.org/maven2/org/apache/maven/surefire/surefire-junit-platform/2.22.0/surefire-junit-platform-2.22.0.jar
(66 kB at 4.1 MB/s)
[INFO] Downloaded from central: https://repo.maven.apache.org/maven2/org/junit/platform/junit-platform-engine/1.2.0/junit-platform-engine-1.2.0.jar
(90 kB at 5.6 MB/s)
[INFO] Downloaded from central: https://repo.maven.apache.org/maven2/org/junit/platform/junit-platform-launcher/1.2.0/junit-platform-launcher-1.2.0.jar
(80 kB at 4.7 MB/s)
[INFO] Downloaded from central: https://repo.maven.apache.org/maven2/org/junit/platform/junit-platform-commons/1.2.0/junit-platform-commons-1.2.0.jar
(78 kB at 4.9 MB/s)
[INFO] Downloaded from central: https://repo.maven.apache.org/maven2/org/opentest4j/opentest4j/1.1.0/opentest4j-1.1.0.jar
(6.8 kB at 568 kB/s)
[INFO] 
[INFO] -------------------------------------------------------
[INFO]  T E S T S
[INFO] -------------------------------------------------------
[INFO] Running org.apache.myfaces.core.extensions.quarkus.showcase.QuarkusMyFacesShowcaseTest
Using org.apache.myfaces.webapp.MyFacesContainerInitializer
MyFaces Core Bean Validation support disabled
MyFaces Core CDI support enabled
MyFaces Core EL 3.0 support enabled
MyFaces Core Servlet 4.0 support enabled
Running on PrimeFaces 7.0
UT026005: Adding programmatic server endpoint class org.apache.myfaces.push.EndpointImpl for
path /javax.faces.push/{channel}


********************************************************************
*** WARNING: Apache MyFaces Core is running in DEVELOPMENT mode. ***
***                                            ^^^^^^^^^^^       ***
*** Do NOT deploy to your live server(s) without changing this.  ***
*** See Application#getProjectStage() for more information.      ***
********************************************************************


MyFaces Core has started, it took [671] ms.
MyFaces already initialized
Quarkus 1.2.1.Final started in 1.961s. Listening on: http://0.0.0.0:8081
Profile test activated. 
Installed features: [cdi, myfaces, servlet, undertow-websockets]
Link type 'stylesheet' not supported.
Link type 'stylesheet' not supported.
[INFO] Tests run: 1, Failures: 0, Errors: 0, Skipped: 0, Time elapsed: 11.996 s - in org.apache.myfaces.core.extensions.quarkus.showcase.QuarkusMyFacesShowcaseTest
Quarkus stopped in 0.056s
[INFO] 
[INFO] Results:
[INFO] 
[INFO] Tests run: 1, Failures: 0, Errors: 0, Skipped: 0
[INFO] 
[JENKINS] Recording test results
[INFO] 
[INFO] --- maven-jar-plugin:2.4:jar (default-jar) @ quarkus-myfaces-showcase ---
[INFO] Building jar: <https://builds.apache.org/job/myfaces-current-master/ws/extensions/quarkus/showcase/target/quarkus-myfaces-showcase-1.0-SNAPSHOT.jar>
[INFO] 
[INFO] --- quarkus-maven-plugin:1.2.1.Final:build (default) @ quarkus-myfaces-showcase ---
[INFO] Downloading from central: https://repo.maven.apache.org/maven2/io/quarkus/quarkus-platform-descriptor-json/1.2.1.Final/quarkus-platform-descriptor-json-1.2.1.Final.pom
[INFO] Downloaded from central: https://repo.maven.apache.org/maven2/io/quarkus/quarkus-platform-descriptor-json/1.2.1.Final/quarkus-platform-descriptor-json-1.2.1.Final.pom
(4.0 kB at 285 kB/s)
[INFO] Downloading from central: https://repo.maven.apache.org/maven2/io/quarkus/quarkus-devtools-all/1.2.1.Final/quarkus-devtools-all-1.2.1.Final.pom
[INFO] Downloaded from central: https://repo.maven.apache.org/maven2/io/quarkus/quarkus-devtools-all/1.2.1.Final/quarkus-devtools-all-1.2.1.Final.pom
(1.0 kB at 80 kB/s)
[INFO] Downloading from central: https://repo.maven.apache.org/maven2/io/quarkus/quarkus-devtools-common/1.2.1.Final/quarkus-devtools-common-1.2.1.Final.pom
[INFO] Downloaded from central: https://repo.maven.apache.org/maven2/io/quarkus/quarkus-devtools-common/1.2.1.Final/quarkus-devtools-common-1.2.1.Final.pom
(4.0 kB at 306 kB/s)
[INFO] Downloading from central: https://repo.maven.apache.org/maven2/io/quarkus/quarkus-tools-parent/1.2.1.Final/quarkus-tools-parent-1.2.1.Final.pom
[INFO] Downloaded from central: https://repo.maven.apache.org/maven2/io/quarkus/quarkus-tools-parent/1.2.1.Final/quarkus-tools-parent-1.2.1.Final.pom
(18 kB at 1.4 MB/s)
[INFO] Downloading from central: https://repo.maven.apache.org/maven2/io/quarkus/quarkus-platform-descriptor-api/1.2.1.Final/quarkus-platform-descriptor-api-1.2.1.Final.pom
[INFO] Downloaded from central: https://repo.maven.apache.org/maven2/io/quarkus/quarkus-platform-descriptor-api/1.2.1.Final/quarkus-platform-descriptor-api-1.2.1.Final.pom
(951 B at 73 kB/s)
[INFO] Downloading from central: https://repo.maven.apache.org/maven2/io/quarkus/quarkus-bom-descriptor-json/1.2.1.Final/quarkus-bom-descriptor-json-1.2.1.Final.pom
[INFO] Downloaded from central: https://repo.maven.apache.org/maven2/io/quarkus/quarkus-bom-descriptor-json/1.2.1.Final/quarkus-bom-descriptor-json-1.2.1.Final.pom
(1.4 kB at 120 kB/s)
[INFO] Downloading from central: https://repo.maven.apache.org/maven2/io/quarkus/quarkus-platform-descriptor-resolver-json/1.2.1.Final/quarkus-platform-descriptor-resolver-json-1.2.1.Final.pom
[INFO] Downloaded from central: https://repo.maven.apache.org/maven2/io/quarkus/quarkus-platform-descriptor-resolver-json/1.2.1.Final/quarkus-platform-descriptor-resolver-json-1.2.1.Final.pom
(1.8 kB at 147 kB/s)
[INFO] Downloading from central: https://repo.maven.apache.org/maven2/com/eclipsesource/minimal-json/minimal-json/0.9.5/minimal-json-0.9.5.pom
[INFO] Downloaded from central: https://repo.maven.apache.org/maven2/com/eclipsesource/minimal-json/minimal-json/0.9.5/minimal-json-0.9.5.pom
(4.3 kB at 331 kB/s)
[INFO] Downloading from central: https://repo.maven.apache.org/maven2/io/quarkus/quarkus-creator/1.2.1.Final/quarkus-creator-1.2.1.Final.pom
[INFO] Downloaded from central: https://repo.maven.apache.org/maven2/io/quarkus/quarkus-creator/1.2.1.Final/quarkus-creator-1.2.1.Final.pom
(1.4 kB at 115 kB/s)
[INFO] Downloading from central: https://repo.maven.apache.org/maven2/io/quarkus/quarkus-development-mode/1.2.1.Final/quarkus-development-mode-1.2.1.Final.pom
[INFO] Downloaded from central: https://repo.maven.apache.org/maven2/io/quarkus/quarkus-development-mode/1.2.1.Final/quarkus-development-mode-1.2.1.Final.pom
(2.1 kB at 178 kB/s)
[INFO] Downloading from central: https://repo.maven.apache.org/maven2/jline/jline/2.14.6/jline-2.14.6.pom
[INFO] Downloaded from central: https://repo.maven.apache.org/maven2/jline/jline/2.14.6/jline-2.14.6.pom
(20 kB at 1.5 MB/s)
[INFO] Downloading from central: https://repo.maven.apache.org/maven2/org/freemarker/freemarker/2.3.29/freemarker-2.3.29.pom
[INFO] Downloaded from central: https://repo.maven.apache.org/maven2/org/freemarker/freemarker/2.3.29/freemarker-2.3.29.pom
(3.4 kB at 280 kB/s)
[INFO] Downloading from central: https://repo.maven.apache.org/maven2/org/twdata/maven/mojo-executor/2.3.0/mojo-executor-2.3.0.pom
[INFO] Downloaded from central: https://repo.maven.apache.org/maven2/org/twdata/maven/mojo-executor/2.3.0/mojo-executor-2.3.0.pom
(2.5 kB at 207 kB/s)
[INFO] Downloading from central: https://repo.maven.apache.org/maven2/org/twdata/maven/mojo-executor-parent/2.3.0/mojo-executor-parent-2.3.0.pom
[INFO] Downloaded from central: https://repo.maven.apache.org/maven2/org/twdata/maven/mojo-executor-parent/2.3.0/mojo-executor-parent-2.3.0.pom
(9.4 kB at 726 kB/s)
[INFO] Downloading from central: https://repo.maven.apache.org/maven2/org/apache/maven/maven/3.0.5/maven-3.0.5.pom
[INFO] Downloaded from central: https://repo.maven.apache.org/maven2/org/apache/maven/maven/3.0.5/maven-3.0.5.pom
(22 kB at 1.6 MB/s)
[INFO] Downloading from central: https://repo.maven.apache.org/maven2/org/apache/maven/wagon/wagon-provider-api/3.3.3/wagon-provider-api-3.3.3.jar
[INFO] Downloading from central: https://repo.maven.apache.org/maven2/org/jsoup/jsoup/1.11.3/jsoup-1.11.3.jar
[INFO] Downloading from central: https://repo.maven.apache.org/maven2/io/quarkus/quarkus-platform-descriptor-json/1.2.1.Final/quarkus-platform-descriptor-json-1.2.1.Final.jar
[INFO] Downloading from central: https://repo.maven.apache.org/maven2/io/quarkus/quarkus-devtools-common/1.2.1.Final/quarkus-devtools-common-1.2.1.Final.jar
[INFO] Downloading from central: https://repo.maven.apache.org/maven2/io/quarkus/quarkus-platform-descriptor-api/1.2.1.Final/quarkus-platform-descriptor-api-1.2.1.Final.jar
[INFO] Downloaded from central: https://repo.maven.apache.org/maven2/org/apache/maven/wagon/wagon-provider-api/3.3.3/wagon-provider-api-3.3.3.jar
(56 kB at 3.1 MB/s)
[INFO] Downloading from central: https://repo.maven.apache.org/maven2/io/quarkus/quarkus-bom-descriptor-json/1.2.1.Final/quarkus-bom-descriptor-json-1.2.1.Final.json
[INFO] Downloaded from central: https://repo.maven.apache.org/maven2/io/quarkus/quarkus-platform-descriptor-api/1.2.1.Final/quarkus-platform-descriptor-api-1.2.1.Final.jar
(12 kB at 732 kB/s)
[INFO] Downloading from central: https://repo.maven.apache.org/maven2/io/quarkus/quarkus-platform-descriptor-resolver-json/1.2.1.Final/quarkus-platform-descriptor-resolver-json-1.2.1.Final.jar
[INFO] Downloaded from central: https://repo.maven.apache.org/maven2/io/quarkus/quarkus-platform-descriptor-json/1.2.1.Final/quarkus-platform-descriptor-json-1.2.1.Final.jar
(51 kB at 2.5 MB/s)
[INFO] Downloading from central: https://repo.maven.apache.org/maven2/com/eclipsesource/minimal-json/minimal-json/0.9.5/minimal-json-0.9.5.jar
[INFO] Downloaded from central: https://repo.maven.apache.org/maven2/io/quarkus/quarkus-devtools-common/1.2.1.Final/quarkus-devtools-common-1.2.1.Final.jar
(104 kB at 5.0 MB/s)
[INFO] Downloading from central: https://repo.maven.apache.org/maven2/io/quarkus/quarkus-creator/1.2.1.Final/quarkus-creator-1.2.1.Final.jar
[INFO] Downloaded from central: https://repo.maven.apache.org/maven2/io/quarkus/quarkus-platform-descriptor-resolver-json/1.2.1.Final/quarkus-platform-descriptor-resolver-json-1.2.1.Final.jar
(19 kB at 684 kB/s)
[INFO] Downloading from central: https://repo.maven.apache.org/maven2/io/quarkus/quarkus-development-mode/1.2.1.Final/quarkus-development-mode-1.2.1.Final.jar
[INFO] Downloaded from central: https://repo.maven.apache.org/maven2/io/quarkus/quarkus-bom-descriptor-json/1.2.1.Final/quarkus-bom-descriptor-json-1.2.1.Final.json
(68 kB at 2.3 MB/s)
[INFO] Downloading from central: https://repo.maven.apache.org/maven2/jline/jline/2.14.6/jline-2.14.6.jar
[INFO] Downloaded from central: https://repo.maven.apache.org/maven2/org/jsoup/jsoup/1.11.3/jsoup-1.11.3.jar
(396 kB at 12 MB/s)
[INFO] Downloading from central: https://repo.maven.apache.org/maven2/org/freemarker/freemarker/2.3.29/freemarker-2.3.29.jar
[INFO] Downloaded from central: https://repo.maven.apache.org/maven2/com/eclipsesource/minimal-json/minimal-json/0.9.5/minimal-json-0.9.5.jar
(34 kB at 1.1 MB/s)
[INFO] Downloading from central: https://repo.maven.apache.org/maven2/org/twdata/maven/mojo-executor/2.3.0/mojo-executor-2.3.0.jar
[INFO] Downloaded from central: https://repo.maven.apache.org/maven2/io/quarkus/quarkus-creator/1.2.1.Final/quarkus-creator-1.2.1.Final.jar
(49 kB at 1.5 MB/s)
[INFO] Downloaded from central: https://repo.maven.apache.org/maven2/io/quarkus/quarkus-development-mode/1.2.1.Final/quarkus-development-mode-1.2.1.Final.jar
(41 kB at 988 kB/s)
[INFO] Downloaded from central: https://repo.maven.apache.org/maven2/org/twdata/maven/mojo-executor/2.3.0/mojo-executor-2.3.0.jar
(13 kB at 292 kB/s)
[INFO] Downloaded from central: https://repo.maven.apache.org/maven2/jline/jline/2.14.6/jline-2.14.6.jar
(269 kB at 5.4 MB/s)
[INFO] Downloaded from central: https://repo.maven.apache.org/maven2/org/freemarker/freemarker/2.3.29/freemarker-2.3.29.jar
(1.6 MB at 18 MB/s)
[WARNING] [io.quarkus.creator.curator.Curator] These dependencies are not recommended:
	- jakarta.xml.bind:jakarta.xml.bind-api should be replaced by org.jboss.spec.javax.xml.bind:jboss-jaxb-api_2.3_spec
	- javax.validation:validation-api should be replaced by jakarta.validation:jakarta.validation-api
You might end up with two different versions of the same classes or with an artifact you shouldn't
have in your classpath.
[INFO] [org.jboss.threads] JBoss Threads version 3.0.0.Final
[INFO] [io.quarkus.deployment.pkg.steps.JarResultBuildStep] Building thin jar: <https://builds.apache.org/job/myfaces-current-master/ws/extensions/quarkus/showcase/target/quarkus-myfaces-showcase-1.0-SNAPSHOT-runner.jar>
[INFO] [io.quarkus.deployment.QuarkusAugmentor] Quarkus augmentation completed in 3141ms
[INFO] 
[INFO] --- maven-install-plugin:2.4:install (default-install) @ quarkus-myfaces-showcase ---
[INFO] Downloading from central: https://repo.maven.apache.org/maven2/org/codehaus/plexus/plexus-utils/3.0.5/plexus-utils-3.0.5.pom
[INFO] Downloaded from central: https://repo.maven.apache.org/maven2/org/codehaus/plexus/plexus-utils/3.0.5/plexus-utils-3.0.5.pom
(2.5 kB at 105 kB/s)
[INFO] Downloading from central: https://repo.maven.apache.org/maven2/org/codehaus/plexus/plexus-digest/1.0/plexus-digest-1.0.pom
[INFO] Downloaded from central: https://repo.maven.apache.org/maven2/org/codehaus/plexus/plexus-digest/1.0/plexus-digest-1.0.pom
(1.1 kB at 88 kB/s)
[INFO] Downloading from central: https://repo.maven.apache.org/maven2/org/codehaus/plexus/plexus-components/1.1.7/plexus-components-1.1.7.pom
[INFO] Downloaded from central: https://repo.maven.apache.org/maven2/org/codehaus/plexus/plexus-components/1.1.7/plexus-components-1.1.7.pom
(5.0 kB at 415 kB/s)
[INFO] Downloading from central: https://repo.maven.apache.org/maven2/org/codehaus/plexus/plexus-utils/3.0.5/plexus-utils-3.0.5.jar
[INFO] Downloading from central: https://repo.maven.apache.org/maven2/org/codehaus/plexus/plexus-digest/1.0/plexus-digest-1.0.jar
[INFO] Downloaded from central: https://repo.maven.apache.org/maven2/org/codehaus/plexus/plexus-digest/1.0/plexus-digest-1.0.jar
(12 kB at 847 kB/s)
[INFO] Downloaded from central: https://repo.maven.apache.org/maven2/org/codehaus/plexus/plexus-utils/3.0.5/plexus-utils-3.0.5.jar
(230 kB at 11 MB/s)
[INFO] Installing <https://builds.apache.org/job/myfaces-current-master/ws/extensions/quarkus/showcase/target/quarkus-myfaces-showcase-1.0-SNAPSHOT.jar>
to /home/jenkins/jenkins-slave/maven-repositories/0/io/quarkus/quarkus-myfaces-showcase/1.0-SNAPSHOT/quarkus-myfaces-showcase-1.0-SNAPSHOT.jar
[INFO] Installing <https://builds.apache.org/job/myfaces-current-master/ws/extensions/quarkus/showcase/pom.xml>
to /home/jenkins/jenkins-slave/maven-repositories/0/io/quarkus/quarkus-myfaces-showcase/1.0-SNAPSHOT/quarkus-myfaces-showcase-1.0-SNAPSHOT.pom
[INFO] 
[INFO] --- maven-resources-plugin:2.6:resources (default-resources) @ quarkus-myfaces-showcase
---
[INFO] Using 'UTF-8' encoding to copy filtered resources.
[INFO] Copying 26 resources
[INFO] 
[INFO] --- maven-compiler-plugin:3.1:compile (default-compile) @ quarkus-myfaces-showcase
---
[INFO] Nothing to compile - all classes are up to date
[INFO] 
[INFO] --- maven-resources-plugin:2.6:testResources (default-testResources) @ quarkus-myfaces-showcase
---
[INFO] Using 'UTF-8' encoding to copy filtered resources.
[INFO] skip non existing resourceDirectory <https://builds.apache.org/job/myfaces-current-master/ws/extensions/quarkus/showcase/src/test/resources>
[INFO] 
[INFO] --- maven-compiler-plugin:3.1:testCompile (default-testCompile) @ quarkus-myfaces-showcase
---
[INFO] Nothing to compile - all classes are up to date
[INFO] 
[INFO] --- maven-surefire-plugin:2.22.0:test (default-test) @ quarkus-myfaces-showcase ---
[INFO] Skipping execution of surefire because it has already been run for this configuration
[JENKINS] Recording test results
[INFO] 
[INFO] --- maven-jar-plugin:2.4:jar (default-jar) @ quarkus-myfaces-showcase ---
[INFO] 
[INFO] --- quarkus-maven-plugin:1.2.1.Final:build (default) @ quarkus-myfaces-showcase ---
[WARNING] [io.quarkus.creator.curator.Curator] These dependencies are not recommended:
	- jakarta.xml.bind:jakarta.xml.bind-api should be replaced by org.jboss.spec.javax.xml.bind:jboss-jaxb-api_2.3_spec
	- javax.validation:validation-api should be replaced by jakarta.validation:jakarta.validation-api
You might end up with two different versions of the same classes or with an artifact you shouldn't
have in your classpath.
[INFO] [io.quarkus.deployment.pkg.steps.JarResultBuildStep] Building thin jar: <https://builds.apache.org/job/myfaces-current-master/ws/extensions/quarkus/showcase/target/quarkus-myfaces-showcase-1.0-SNAPSHOT-runner.jar>
[INFO] [io.quarkus.deployment.QuarkusAugmentor] Quarkus augmentation completed in 1864ms
[INFO] 
[INFO] --- maven-install-plugin:2.4:install (default-install) @ quarkus-myfaces-showcase ---
[INFO] Installing <https://builds.apache.org/job/myfaces-current-master/ws/extensions/quarkus/showcase/target/quarkus-myfaces-showcase-1.0-SNAPSHOT.jar>
to /home/jenkins/jenkins-slave/maven-repositories/0/io/quarkus/quarkus-myfaces-showcase/1.0-SNAPSHOT/quarkus-myfaces-showcase-1.0-SNAPSHOT.jar
[INFO] Installing <https://builds.apache.org/job/myfaces-current-master/ws/extensions/quarkus/showcase/pom.xml>
to /home/jenkins/jenkins-slave/maven-repositories/0/io/quarkus/quarkus-myfaces-showcase/1.0-SNAPSHOT/quarkus-myfaces-showcase-1.0-SNAPSHOT.pom
[INFO] 
[INFO] --- maven-deploy-plugin:2.7:deploy (default-deploy) @ quarkus-myfaces-showcase ---
[INFO] ------------------------------------------------------------------------
[INFO] Reactor Summary:
[INFO] 
[INFO] Apache MyFaces Core 2.3-next - Parent 2.3-next-SNAPSHOT SUCCESS [ 20.923 s]
[INFO] Apache MyFaces Core 2.3-next - API 2.3-next-SNAPSHOT SUCCESS [ 52.133 s]
[INFO] Apache MyFaces Core 2.3-next - Test 2.3-next-SNAPSHOT SUCCESS [ 22.920 s]
[INFO] Apache MyFaces Core 2.3-next - Impl 2.3-next-SNAPSHOT SUCCESS [04:17 min]
[INFO] Apache MyFaces Core 2.3-next - OSGi Bundle 2.3-next-SNAPSHOT SUCCESS [ 27.836 s]
[INFO] Apache MyFaces Core 2.3-next - Extensions 2.3-next-SNAPSHOT SUCCESS [  9.997 s]
[INFO] Apache MyFaces Core 2.3-next - Extensions - Quarkus 2.3-next-SNAPSHOT SUCCESS [ 10.594
s]
[INFO] Apache MyFaces Core 2.3-next - Extensions - Quarkus - Runtime 2.3-next-SNAPSHOT SUCCESS
[ 25.534 s]
[INFO] Apache MyFaces Core 2.3-next - Extensions - Quarkus - Deployment 2.3-next-SNAPSHOT
SUCCESS [ 22.666 s]
[INFO] Apache MyFaces Core 2.3-next - Extensions - Quarkus - Showcase 1.0-SNAPSHOT FAILURE
[ 29.305 s]
[INFO] Apache MyFaces Core 2.3-next 2.3-next-SNAPSHOT ..... SKIPPED
[INFO] ------------------------------------------------------------------------
[INFO] BUILD FAILURE
[INFO] ------------------------------------------------------------------------
[INFO] Total time:  08:56 min
[INFO] Finished at: 2020-03-02T09:20:27Z
[INFO] ------------------------------------------------------------------------
Waiting for Jenkins to finish collecting data[ERROR] Failed to execute goal org.apache.maven.plugins:maven-deploy-plugin:2.7:deploy
(default-deploy) on project quarkus-myfaces-showcase: Deployment failed: repository element
was not specified in the POM inside distributionManagement element or in -DaltDeploymentRepository=id::layout::url
parameter -> [Help 1]
[ERROR] 
[ERROR] To see the full stack trace of the errors, re-run Maven with the -e switch.
[ERROR] Re-run Maven using the -X switch to enable full debug logging.
[ERROR] 
[ERROR] For more information about the errors and possible solutions, please read the following
articles:
[ERROR] [Help 1] http://cwiki.apache.org/confluence/display/MAVEN/MojoExecutionException
[ERROR] 
[ERROR] After correcting the problems, you can resume the build with the command
[ERROR]   mvn <goals> -rf :quarkus-myfaces-showcase

[JENKINS] Archiving <https://builds.apache.org/job/myfaces-current-master/ws/extensions/quarkus/runtime/pom.xml>
to org.apache.myfaces.core.extensions.quarkus/myfaces-quarkus-runtime/2.3-next-SNAPSHOT/myfaces-quarkus-runtime-2.3-next-SNAPSHOT.pom
[JENKINS] Archiving <https://builds.apache.org/job/myfaces-current-master/ws/extensions/quarkus/runtime/target/myfaces-quarkus-runtime-2.3-next-SNAPSHOT.jar>
to org.apache.myfaces.core.extensions.quarkus/myfaces-quarkus-runtime/2.3-next-20200302.091858-74/myfaces-quarkus-runtime-2.3-next-20200302.091858-74.jar
[JENKINS] Archiving <https://builds.apache.org/job/myfaces-current-master/ws/extensions/quarkus/runtime/target/myfaces-quarkus-runtime-2.3-next-SNAPSHOT-sources.jar>
to org.apache.myfaces.core.extensions.quarkus/myfaces-quarkus-runtime/2.3-next-20200302.091858-74/myfaces-quarkus-runtime-2.3-next-20200302.091858-74-sources.jar
[JENKINS] Archiving <https://builds.apache.org/job/myfaces-current-master/ws/api/pom.xml>
to org.apache.myfaces.core/myfaces-api/2.3-next-SNAPSHOT/myfaces-api-2.3-next-SNAPSHOT.pom
[JENKINS] Archiving <https://builds.apache.org/job/myfaces-current-master/ws/api/target/myfaces-api-2.3-next-SNAPSHOT.jar>
to org.apache.myfaces.core/myfaces-api/2.3-next-20200302.091237-74/myfaces-api-2.3-next-20200302.091237-74.jar
[JENKINS] Archiving <https://builds.apache.org/job/myfaces-current-master/ws/api/target/myfaces-api-2.3-next-SNAPSHOT-sources.jar>
to org.apache.myfaces.core/myfaces-api/2.3-next-20200302.091237-74/myfaces-api-2.3-next-20200302.091237-74-sources.jar
[JENKINS] Archiving <https://builds.apache.org/job/myfaces-current-master/ws/api/target/myfaces-api-2.3-next-SNAPSHOT-tests.jar>
to org.apache.myfaces.core/myfaces-api/2.3-next-20200302.091237-74/myfaces-api-2.3-next-20200302.091237-74-tests.jar
[JENKINS] Archiving <https://builds.apache.org/job/myfaces-current-master/ws/test/pom.xml>
to org.apache.myfaces.core/myfaces-test/2.3-next-SNAPSHOT/myfaces-test-2.3-next-SNAPSHOT.pom
[JENKINS] Archiving <https://builds.apache.org/job/myfaces-current-master/ws/test/target/myfaces-test-2.3-next-SNAPSHOT.jar>
to org.apache.myfaces.core/myfaces-test/2.3-next-20200302.091310-74/myfaces-test-2.3-next-20200302.091310-74.jar
[JENKINS] Archiving <https://builds.apache.org/job/myfaces-current-master/ws/test/target/myfaces-test-2.3-next-SNAPSHOT-sources.jar>
to org.apache.myfaces.core/myfaces-test/2.3-next-20200302.091310-74/myfaces-test-2.3-next-20200302.091310-74-sources.jar
[JENKINS] Archiving <https://builds.apache.org/job/myfaces-current-master/ws/extensions/pom.xml>
to org.apache.myfaces.core/myfaces-extensions/2.3-next-SNAPSHOT/myfaces-extensions-2.3-next-SNAPSHOT.pom
[JENKINS] Archiving <https://builds.apache.org/job/myfaces-current-master/ws/extensions/quarkus/pom.xml>
to org.apache.myfaces.core.extensions/myfaces-quarkus/2.3-next-SNAPSHOT/myfaces-quarkus-2.3-next-SNAPSHOT.pom
[JENKINS] Archiving <https://builds.apache.org/job/myfaces-current-master/ws/impl/pom.xml>
to org.apache.myfaces.core/myfaces-impl/2.3-next-SNAPSHOT/myfaces-impl-2.3-next-SNAPSHOT.pom
[JENKINS] Archiving <https://builds.apache.org/job/myfaces-current-master/ws/impl/target/myfaces-impl-2.3-next-SNAPSHOT.jar>
to org.apache.myfaces.core/myfaces-impl/2.3-next-20200302.091718-74/myfaces-impl-2.3-next-20200302.091718-74.jar
[JENKINS] Archiving <https://builds.apache.org/job/myfaces-current-master/ws/impl/target/myfaces-impl-2.3-next-SNAPSHOT-sources.jar>
to org.apache.myfaces.core/myfaces-impl/2.3-next-20200302.091718-74/myfaces-impl-2.3-next-20200302.091718-74-sources.jar
[JENKINS] Archiving <https://builds.apache.org/job/myfaces-current-master/ws/impl/target/myfaces-impl-2.3-next-SNAPSHOT-test-sources.jar>
to org.apache.myfaces.core/myfaces-impl/2.3-next-20200302.091718-74/myfaces-impl-2.3-next-20200302.091718-74-test-sources.jar
[JENKINS] Archiving <https://builds.apache.org/job/myfaces-current-master/ws/impl/target/myfaces-impl-2.3-next-SNAPSHOT-tests.jar>
to org.apache.myfaces.core/myfaces-impl/2.3-next-20200302.091718-74/myfaces-impl-2.3-next-20200302.091718-74-tests.jar
[JENKINS] Archiving <https://builds.apache.org/job/myfaces-current-master/ws/bundle/pom.xml>
to org.apache.myfaces.core/myfaces-bundle/2.3-next-SNAPSHOT/myfaces-bundle-2.3-next-SNAPSHOT.pom
[JENKINS] Archiving <https://builds.apache.org/job/myfaces-current-master/ws/bundle/target/myfaces-bundle-2.3-next-SNAPSHOT.jar>
to org.apache.myfaces.core/myfaces-bundle/2.3-next-20200302.091803-74/myfaces-bundle-2.3-next-20200302.091803-74.jar
[JENKINS] Archiving <https://builds.apache.org/job/myfaces-current-master/ws/bundle/target/myfaces-bundle-2.3-next-SNAPSHOT-sources.jar>
to org.apache.myfaces.core/myfaces-bundle/2.3-next-20200302.091803-74/myfaces-bundle-2.3-next-20200302.091803-74-sources.jar
[JENKINS] Archiving <https://builds.apache.org/job/myfaces-current-master/ws/extensions/quarkus/deployment/pom.xml>
to org.apache.myfaces.core.extensions.quarkus/myfaces-quarkus-deployment/2.3-next-SNAPSHOT/myfaces-quarkus-deployment-2.3-next-SNAPSHOT.pom
[JENKINS] Archiving <https://builds.apache.org/job/myfaces-current-master/ws/extensions/quarkus/deployment/target/myfaces-quarkus-deployment-2.3-next-SNAPSHOT.jar>
to org.apache.myfaces.core.extensions.quarkus/myfaces-quarkus-deployment/2.3-next-20200302.091925-74/myfaces-quarkus-deployment-2.3-next-20200302.091925-74.jar
[JENKINS] Archiving <https://builds.apache.org/job/myfaces-current-master/ws/extensions/quarkus/deployment/target/myfaces-quarkus-deployment-2.3-next-SNAPSHOT-sources.jar>
to org.apache.myfaces.core.extensions.quarkus/myfaces-quarkus-deployment/2.3-next-20200302.091925-74/myfaces-quarkus-deployment-2.3-next-20200302.091925-74-sources.jar
[JENKINS] Archiving <https://builds.apache.org/job/myfaces-current-master/ws/pom.xml>
to org.apache.myfaces.core/myfaces-core-module/2.3-next-SNAPSHOT/myfaces-core-module-2.3-next-SNAPSHOT.pom
[JENKINS] Archiving <https://builds.apache.org/job/myfaces-current-master/ws/extensions/quarkus/showcase/pom.xml>
to io.quarkus/quarkus-myfaces-showcase/1.0-SNAPSHOT/quarkus-myfaces-showcase-1.0-SNAPSHOT.pom
[JENKINS] Archiving <https://builds.apache.org/job/myfaces-current-master/ws/extensions/quarkus/showcase/target/quarkus-myfaces-showcase-1.0-SNAPSHOT.jar>
to io.quarkus/quarkus-myfaces-showcase/1.0-SNAPSHOT/quarkus-myfaces-showcase-1.0-SNAPSHOT.jar
[Fast Archiver] No prior successful build to compare, so performing full copy of artifacts
[JENKINS] Archiving <https://builds.apache.org/job/myfaces-current-master/ws/parent/pom.xml>
to org.apache.myfaces.core/myfaces-core-project/2.3-next-SNAPSHOT/myfaces-core-project-2.3-next-SNAPSHOT.pom
[JENKINS] Archiving <https://builds.apache.org/job/myfaces-current-master/ws/parent/target/myfaces-core-project-2.3-next-SNAPSHOT-site.xml>
to org.apache.myfaces.core/myfaces-core-project/2.3-next-20200302.091146-82/myfaces-core-project-2.3-next-20200302.091146-82-site.xml
No mail will be sent out, as 'myfaces-current-master » Apache MyFaces Core 2.3-next - Extensions
- Quarkus - Runtime #376' does not have a result yet. Please make sure you set a proper result
in case of pipeline/build scripts.
No mail will be sent out, as 'myfaces-current-master » Apache MyFaces Core 2.3-next - API
#376' does not have a result yet. Please make sure you set a proper result in case of pipeline/build
scripts.
No mail will be sent out, as 'myfaces-current-master » Apache MyFaces Core 2.3-next - Test
#376' does not have a result yet. Please make sure you set a proper result in case of pipeline/build
scripts.
No mail will be sent out, as 'myfaces-current-master » Apache MyFaces Core 2.3-next - Extensions
#376' does not have a result yet. Please make sure you set a proper result in case of pipeline/build
scripts.
No mail will be sent out, as 'myfaces-current-master » Apache MyFaces Core 2.3-next - Extensions
- Quarkus #376' does not have a result yet. Please make sure you set a proper result in case
of pipeline/build scripts.
No mail will be sent out, as 'myfaces-current-master » Apache MyFaces Core 2.3-next - Impl
#376' does not have a result yet. Please make sure you set a proper result in case of pipeline/build
scripts.
No mail will be sent out, as 'myfaces-current-master » Apache MyFaces Core 2.3-next - OSGi
Bundle #376' does not have a result yet. Please make sure you set a proper result in case
of pipeline/build scripts.
No mail will be sent out, as 'myfaces-current-master » Apache MyFaces Core 2.3-next - Extensions
- Quarkus - Deployment #376' does not have a result yet. Please make sure you set a proper
result in case of pipeline/build scripts.
No mail will be sent out, as 'myfaces-current-master » Apache MyFaces Core 2.3-next #376'
does not have a result yet. Please make sure you set a proper result in case of pipeline/build
scripts.
Not sending mail to unregistered user rmpestano@mobiquityinc.com
Sending e-mails to: commits@myfaces.apache.org grantsmith@apache.org
No mail will be sent out, as 'myfaces-current-master » Apache MyFaces Core 2.3-next - Parent
#376' does not have a result yet. Please make sure you set a proper result in case of pipeline/build
scripts.
channel stopped
Not sending mail to unregistered user rmpestano@mobiquityinc.com

Mime
View raw message