myfaces-commits mailing list archives

Site index · List index
Message view « Date » · « Thread »
Top « Date » · « Thread »
From Apache Jenkins Server <jenk...@builds.apache.org>
Subject Build failed in Jenkins: Tobago 4.x #113
Date Wed, 04 Mar 2020 13:26:39 GMT
See <https://builds.apache.org/job/Tobago%204.x/113/display/redirect?page=changes>

Changes:

[github] TOBAGO-2021: Sheet should be able to lazy load rows by scroll events


------------------------------------------
[...truncated 11.92 KB...]
[INFO] --- maven-enforcer-plugin:3.0.0-M1:enforce (enforce-maven-version) @ tobago-tool-annotation
---
[INFO] 
[INFO] --- maven-enforcer-plugin:3.0.0-M1:enforce (enforce) @ tobago-tool-annotation ---
[INFO] 
[INFO] --- maven-remote-resources-plugin:1.5:process (default) @ tobago-tool-annotation ---
[INFO] 
[INFO] --- maven-remote-resources-plugin:1.5:process (process-resource-bundles) @ tobago-tool-annotation
---
[INFO] 
[INFO] --- maven-resources-plugin:2.7:resources (default-resources) @ tobago-tool-annotation
---
[INFO] Using 'UTF-8' encoding to copy filtered resources.
[INFO] skip non existing resourceDirectory <https://builds.apache.org/job/Tobago%204.x/ws/tobago-tool/tobago-tool-annotation/src/main/resources>
[INFO] Copying 3 resources
[INFO] Copying 3 resources
[INFO] 
[INFO] --- maven-compiler-plugin:3.8.0:compile (default-compile) @ tobago-tool-annotation
---
[INFO] Compiling 18 source files to <https://builds.apache.org/job/Tobago%204.x/ws/tobago-tool/tobago-tool-annotation/target/classes>
[INFO] 
[INFO] --- maven-resources-plugin:2.7:testResources (default-testResources) @ tobago-tool-annotation
---
[INFO] Using 'UTF-8' encoding to copy filtered resources.
[INFO] skip non existing resourceDirectory <https://builds.apache.org/job/Tobago%204.x/ws/tobago-tool/tobago-tool-annotation/src/test/resources>
[INFO] Copying 3 resources
[INFO] Copying 3 resources
[INFO] 
[INFO] --- maven-compiler-plugin:3.8.0:testCompile (default-testCompile) @ tobago-tool-annotation
---
[INFO] No sources to compile
[INFO] 
[INFO] --- maven-surefire-plugin:2.22.1:test (default-test) @ tobago-tool-annotation ---
[JENKINS] Recording test results
[INFO] 
[INFO] --- maven-jar-plugin:3.0.2:jar (default-jar) @ tobago-tool-annotation ---
[INFO] Building jar: <https://builds.apache.org/job/Tobago%204.x/ws/tobago-tool/tobago-tool-annotation/target/tobago-tool-annotation-4.4.2-SNAPSHOT.jar>
[INFO] 
[INFO] --- maven-site-plugin:3.6:attach-descriptor (attach-descriptor) @ tobago-tool-annotation
---
[INFO] Skipping because packaging 'jar' is not pom.
[INFO] 
[INFO] --- maven-install-plugin:2.5.2:install (default-install) @ tobago-tool-annotation ---
[INFO] Installing <https://builds.apache.org/job/Tobago%204.x/ws/tobago-tool/tobago-tool-annotation/target/tobago-tool-annotation-4.4.2-SNAPSHOT.jar>
to /home/jenkins/jenkins-slave/maven-repositories/0/org/apache/myfaces/tobago/tobago-tool-annotation/4.4.2-SNAPSHOT/tobago-tool-annotation-4.4.2-SNAPSHOT.jar
[INFO] Installing <https://builds.apache.org/job/Tobago%204.x/ws/tobago-tool/tobago-tool-annotation/pom.xml>
to /home/jenkins/jenkins-slave/maven-repositories/0/org/apache/myfaces/tobago/tobago-tool-annotation/4.4.2-SNAPSHOT/tobago-tool-annotation-4.4.2-SNAPSHOT.pom
[INFO] 
[INFO] -------------< org.apache.myfaces.tobago:tobago-tool-apt >--------------
[INFO] Building Tobago Tool Apt 4.4.2-SNAPSHOT                           [4/17]
[INFO] --------------------------------[ jar ]---------------------------------
[INFO] 
[INFO] --- maven-clean-plugin:2.6.1:clean (default-clean) @ tobago-tool-apt ---
[INFO] 
[INFO] --- animal-sniffer-maven-plugin:1.14:check (default-cli) @ tobago-tool-apt ---
[INFO] Checking unresolved references to org.codehaus.mojo.signature:java18:1.0
[INFO] 
[INFO] --- maven-checkstyle-plugin:2.17:check (default-cli) @ tobago-tool-apt ---
[INFO] Starting audit...
Audit done.
[INFO] 
[INFO] --- maven-enforcer-plugin:3.0.0-M1:enforce (enforce-maven-version) @ tobago-tool-apt
---
[INFO] 
[INFO] --- maven-enforcer-plugin:3.0.0-M1:enforce (enforce) @ tobago-tool-apt ---
[INFO] 
[INFO] --- maven-remote-resources-plugin:1.5:process (default) @ tobago-tool-apt ---
[INFO] 
[INFO] --- maven-remote-resources-plugin:1.5:process (process-resource-bundles) @ tobago-tool-apt
---
[INFO] 
[INFO] --- maven-resources-plugin:2.7:resources (default-resources) @ tobago-tool-apt ---
[INFO] Using 'UTF-8' encoding to copy filtered resources.
[INFO] Copying 1 resource
[INFO] Copying 3 resources
[INFO] Copying 3 resources
[INFO] 
[INFO] --- maven-compiler-plugin:3.8.0:compile (default-compile) @ tobago-tool-apt ---
[INFO] Compiling 15 source files to <https://builds.apache.org/job/Tobago%204.x/ws/tobago-tool/tobago-tool-apt/target/classes>
[INFO] <https://builds.apache.org/job/Tobago%204.x/ws/tobago-tool/tobago-tool-apt/src/main/java/org/apache/myfaces/tobago/apt/processor/TaglibGenerator.java>:
Some input files use or override a deprecated API.
[INFO] <https://builds.apache.org/job/Tobago%204.x/ws/tobago-tool/tobago-tool-apt/src/main/java/org/apache/myfaces/tobago/apt/processor/TaglibGenerator.java>:
Recompile with -Xlint:deprecation for details.
[INFO] 
[INFO] --- maven-resources-plugin:2.7:testResources (default-testResources) @ tobago-tool-apt
---
[INFO] Using 'UTF-8' encoding to copy filtered resources.
[INFO] skip non existing resourceDirectory <https://builds.apache.org/job/Tobago%204.x/ws/tobago-tool/tobago-tool-apt/src/test/resources>
[INFO] Copying 3 resources
[INFO] Copying 3 resources
[INFO] 
[INFO] --- maven-compiler-plugin:3.8.0:testCompile (default-testCompile) @ tobago-tool-apt
---
[INFO] Compiling 1 source file to <https://builds.apache.org/job/Tobago%204.x/ws/tobago-tool/tobago-tool-apt/target/test-classes>
[INFO] 
[INFO] --- maven-surefire-plugin:2.22.1:test (default-test) @ tobago-tool-apt ---
[INFO] 
[INFO] -------------------------------------------------------
[INFO]  T E S T S
[INFO] -------------------------------------------------------
[INFO] 
[INFO] Results:
[INFO] 
[INFO] Tests run: 0, Failures: 0, Errors: 0, Skipped: 0
[INFO] 
[JENKINS] Recording test results
[INFO] 
[INFO] --- maven-jar-plugin:3.0.2:jar (default-jar) @ tobago-tool-apt ---
[INFO] Building jar: <https://builds.apache.org/job/Tobago%204.x/ws/tobago-tool/tobago-tool-apt/target/tobago-tool-apt-4.4.2-SNAPSHOT.jar>
[INFO] 
[INFO] --- maven-site-plugin:3.6:attach-descriptor (attach-descriptor) @ tobago-tool-apt ---
[INFO] Skipping because packaging 'jar' is not pom.
[INFO] 
[INFO] --- maven-install-plugin:2.5.2:install (default-install) @ tobago-tool-apt ---
[INFO] Installing <https://builds.apache.org/job/Tobago%204.x/ws/tobago-tool/tobago-tool-apt/target/tobago-tool-apt-4.4.2-SNAPSHOT.jar>
to /home/jenkins/jenkins-slave/maven-repositories/0/org/apache/myfaces/tobago/tobago-tool-apt/4.4.2-SNAPSHOT/tobago-tool-apt-4.4.2-SNAPSHOT.jar
[INFO] Installing <https://builds.apache.org/job/Tobago%204.x/ws/tobago-tool/tobago-tool-apt/pom.xml>
to /home/jenkins/jenkins-slave/maven-repositories/0/org/apache/myfaces/tobago/tobago-tool-apt/4.4.2-SNAPSHOT/tobago-tool-apt-4.4.2-SNAPSHOT.pom
[INFO] 
[INFO] -------------< org.apache.myfaces.tobago:tobago-tool-test >-------------
[INFO] Building Tobago Tool Test 4.4.2-SNAPSHOT                          [5/17]
[INFO] --------------------------------[ jar ]---------------------------------
[INFO] 
[INFO] --- maven-clean-plugin:2.6.1:clean (default-clean) @ tobago-tool-test ---
[INFO] 
[INFO] --- animal-sniffer-maven-plugin:1.14:check (default-cli) @ tobago-tool-test ---
[INFO] Checking unresolved references to org.codehaus.mojo.signature:java18:1.0
[INFO] 
[INFO] --- maven-checkstyle-plugin:2.17:check (default-cli) @ tobago-tool-test ---
[INFO] Starting audit...
Audit done.
[INFO] 
[INFO] --- maven-enforcer-plugin:3.0.0-M1:enforce (enforce-maven-version) @ tobago-tool-test
---
[INFO] 
[INFO] --- maven-enforcer-plugin:3.0.0-M1:enforce (enforce) @ tobago-tool-test ---
[INFO] 
[INFO] --- maven-remote-resources-plugin:1.5:process (default) @ tobago-tool-test ---
[INFO] 
[INFO] --- maven-remote-resources-plugin:1.5:process (process-resource-bundles) @ tobago-tool-test
---
[INFO] 
[INFO] --- maven-resources-plugin:2.7:resources (default-resources) @ tobago-tool-test ---
[INFO] Using 'UTF-8' encoding to copy filtered resources.
[INFO] Copying 1 resource
[INFO] Copying 3 resources
[INFO] Copying 3 resources
[INFO] 
[INFO] --- maven-compiler-plugin:3.8.0:compile (default-compile) @ tobago-tool-test ---
[INFO] No sources to compile
[INFO] 
[INFO] --- maven-resources-plugin:2.7:testResources (default-testResources) @ tobago-tool-test
---
[INFO] Using 'UTF-8' encoding to copy filtered resources.
[INFO] skip non existing resourceDirectory <https://builds.apache.org/job/Tobago%204.x/ws/tobago-tool/tobago-tool-test/src/test/resources>
[INFO] Copying 3 resources
[INFO] Copying 3 resources
[INFO] 
[INFO] --- maven-compiler-plugin:3.8.0:testCompile (default-testCompile) @ tobago-tool-test
---
[INFO] No sources to compile
[INFO] 
[INFO] --- maven-surefire-plugin:2.22.1:test (default-test) @ tobago-tool-test ---
[JENKINS] Recording test results
[INFO] 
[INFO] --- maven-jar-plugin:3.0.2:jar (default-jar) @ tobago-tool-test ---
[INFO] Building jar: <https://builds.apache.org/job/Tobago%204.x/ws/tobago-tool/tobago-tool-test/target/tobago-tool-test-4.4.2-SNAPSHOT.jar>
[INFO] 
[INFO] --- maven-site-plugin:3.6:attach-descriptor (attach-descriptor) @ tobago-tool-test
---
[INFO] Skipping because packaging 'jar' is not pom.
[INFO] 
[INFO] --- maven-install-plugin:2.5.2:install (default-install) @ tobago-tool-test ---
[INFO] Installing <https://builds.apache.org/job/Tobago%204.x/ws/tobago-tool/tobago-tool-test/target/tobago-tool-test-4.4.2-SNAPSHOT.jar>
to /home/jenkins/jenkins-slave/maven-repositories/0/org/apache/myfaces/tobago/tobago-tool-test/4.4.2-SNAPSHOT/tobago-tool-test-4.4.2-SNAPSHOT.jar
[INFO] Installing <https://builds.apache.org/job/Tobago%204.x/ws/tobago-tool/tobago-tool-test/pom.xml>
to /home/jenkins/jenkins-slave/maven-repositories/0/org/apache/myfaces/tobago/tobago-tool-test/4.4.2-SNAPSHOT/tobago-tool-test-4.4.2-SNAPSHOT.pom
[INFO] 
[INFO] ---------------< org.apache.myfaces.tobago:tobago-core >----------------
[INFO] Building Tobago Core 4.4.2-SNAPSHOT                               [6/17]
[INFO] --------------------------------[ jar ]---------------------------------
[INFO] 
[INFO] --- maven-clean-plugin:2.6.1:clean (default-clean) @ tobago-core ---
[INFO] 
[INFO] --- animal-sniffer-maven-plugin:1.14:check (default-cli) @ tobago-core ---
[INFO] Checking unresolved references to org.codehaus.mojo.signature:java18:1.0
[INFO] 
[INFO] --- maven-checkstyle-plugin:2.17:check (default-cli) @ tobago-core ---
[INFO] Starting audit...
<https://builds.apache.org/job/Tobago%204.x/ws/tobago-core/src/main/java/org/apache/myfaces/tobago/internal/renderkit/renderer/SheetRenderer.java>:310:3:
error: Method length is 254 lines (max allowed is 250).
<https://builds.apache.org/job/Tobago%204.x/ws/tobago-core/src/main/java/org/apache/myfaces/tobago/internal/renderkit/renderer/SheetRenderer.java>:356:32:
error: ',' is not followed by whitespace.
Audit done.
[INFO] There are 2 errors reported by Checkstyle 6.11.2 with tobago/checkstyle.xml ruleset.
[ERROR] src/main/java/org/apache/myfaces/tobago/internal/renderkit/renderer/SheetRenderer.java:[310,3]
(sizes) MethodLength: Method length is 254 lines (max allowed is 250).
[ERROR] src/main/java/org/apache/myfaces/tobago/internal/renderkit/renderer/SheetRenderer.java:[356,32]
(whitespace) WhitespaceAfter: ',' is not followed by whitespace.
[INFO] ------------------------------------------------------------------------
[INFO] Reactor Summary for Apache Tobago 4.4.2-SNAPSHOT:
[INFO] 
[INFO] Apache Tobago ...................................... SUCCESS [ 17.172 s]
[INFO] Tobago Tool ........................................ SUCCESS [  3.502 s]
[INFO] Tobago Tool Annotation ............................. SUCCESS [  8.896 s]
[INFO] Tobago Tool Apt .................................... SUCCESS [  8.435 s]
[INFO] Tobago Tool Test ................................... SUCCESS [  4.405 s]
[INFO] Tobago Core ........................................ FAILURE [  6.917 s]
[INFO] Tobago Themes ...................................... SKIPPED
[INFO] Tobago Theme Standard .............................. SKIPPED
[INFO] Tobago Theme Scarborough ........................... SKIPPED
[INFO] Tobago Theme Speyside .............................. SKIPPED
[INFO] Tobago Theme Roxborough ............................ SKIPPED
[INFO] Tobago Theme Charlotteville ........................ SKIPPED
[INFO] Tobago Examples .................................... SKIPPED
[INFO] Tobago Example Blank ............................... SKIPPED
[INFO] Tobago Example Demo ................................ SKIPPED
[INFO] Tobago Example Assembly ............................ SKIPPED
[INFO] Tobago Assembly .................................... SKIPPED
[INFO] ------------------------------------------------------------------------
[INFO] BUILD FAILURE
[INFO] ------------------------------------------------------------------------
[INFO] Total time:  01:24 min
[INFO] Finished at: 2020-03-04T13:36:26Z
[INFO] ------------------------------------------------------------------------
Waiting for Jenkins to finish collecting data[ERROR] Failed to execute goal org.apache.maven.plugins:maven-checkstyle-plugin:2.17:check
(default-cli) on project tobago-core: You have 2 Checkstyle violations. -> [Help 1]
[ERROR] 
[ERROR] To see the full stack trace of the errors, re-run Maven with the -e switch.
[ERROR] Re-run Maven using the -X switch to enable full debug logging.
[ERROR] 
[ERROR] For more information about the errors and possible solutions, please read the following
articles:
[ERROR] [Help 1] http://cwiki.apache.org/confluence/display/MAVEN/MojoFailureException
[ERROR] 
[ERROR] After correcting the problems, you can resume the build with the command
[ERROR]   mvn <goals> -rf :tobago-core

[JENKINS] Archiving <https://builds.apache.org/job/Tobago%204.x/ws/tobago-theme/pom.xml>
to org.apache.myfaces.tobago/tobago-theme/4.4.2-SNAPSHOT/tobago-theme-4.4.2-SNAPSHOT.pom
[JENKINS] Archiving <https://builds.apache.org/job/Tobago%204.x/ws/tobago-example/tobago-example-blank/pom.xml>
to org.apache.myfaces.tobago/tobago-example-blank/4.4.2-SNAPSHOT/tobago-example-blank-4.4.2-SNAPSHOT.pom
[JENKINS] Archiving <https://builds.apache.org/job/Tobago%204.x/ws/tobago-assembly/pom.xml>
to org.apache.myfaces.tobago/tobago-assembly/4.4.2-SNAPSHOT/tobago-assembly-4.4.2-SNAPSHOT.pom
[JENKINS] Archiving <https://builds.apache.org/job/Tobago%204.x/ws/pom.xml> to org.apache.myfaces.tobago/tobago/4.4.2-SNAPSHOT/tobago-4.4.2-SNAPSHOT.pom
[JENKINS] Archiving <https://builds.apache.org/job/Tobago%204.x/ws/target/tobago-4.4.2-SNAPSHOT-site.xml>
to org.apache.myfaces.tobago/tobago/4.4.2-SNAPSHOT/tobago-4.4.2-SNAPSHOT-site.xml
[Fast Archiver] Compressed 53.12 KB of artifacts by 60.2% relative to #112
[JENKINS] Archiving <https://builds.apache.org/job/Tobago%204.x/ws/tobago-theme/tobago-theme-standard/pom.xml>
to org.apache.myfaces.tobago/tobago-theme-standard/4.4.2-SNAPSHOT/tobago-theme-standard-4.4.2-SNAPSHOT.pom
[JENKINS] Archiving <https://builds.apache.org/job/Tobago%204.x/ws/tobago-theme/tobago-theme-scarborough/pom.xml>
to org.apache.myfaces.tobago/tobago-theme-scarborough/4.4.2-SNAPSHOT/tobago-theme-scarborough-4.4.2-SNAPSHOT.pom
[JENKINS] Archiving <https://builds.apache.org/job/Tobago%204.x/ws/tobago-example/tobago-example-assembly/pom.xml>
to org.apache.myfaces.tobago/tobago-example-assembly/4.4.2-SNAPSHOT/tobago-example-assembly-4.4.2-SNAPSHOT.pom
[JENKINS] Archiving <https://builds.apache.org/job/Tobago%204.x/ws/tobago-tool/tobago-tool-test/pom.xml>
to org.apache.myfaces.tobago/tobago-tool-test/4.4.2-SNAPSHOT/tobago-tool-test-4.4.2-SNAPSHOT.pom
[JENKINS] Archiving <https://builds.apache.org/job/Tobago%204.x/ws/tobago-tool/tobago-tool-test/target/tobago-tool-test-4.4.2-SNAPSHOT.jar>
to org.apache.myfaces.tobago/tobago-tool-test/4.4.2-SNAPSHOT/tobago-tool-test-4.4.2-SNAPSHOT.jar
[JENKINS] Archiving <https://builds.apache.org/job/Tobago%204.x/ws/tobago-theme/tobago-theme-speyside/pom.xml>
to org.apache.myfaces.tobago/tobago-theme-speyside/4.4.2-SNAPSHOT/tobago-theme-speyside-4.4.2-SNAPSHOT.pom
[JENKINS] Archiving <https://builds.apache.org/job/Tobago%204.x/ws/tobago-theme/tobago-theme-roxborough/pom.xml>
to org.apache.myfaces.tobago/tobago-theme-roxborough/4.4.2-SNAPSHOT/tobago-theme-roxborough-4.4.2-SNAPSHOT.pom
[JENKINS] Archiving <https://builds.apache.org/job/Tobago%204.x/ws/tobago-tool/tobago-tool-annotation/pom.xml>
to org.apache.myfaces.tobago/tobago-tool-annotation/4.4.2-SNAPSHOT/tobago-tool-annotation-4.4.2-SNAPSHOT.pom
[JENKINS] Archiving <https://builds.apache.org/job/Tobago%204.x/ws/tobago-tool/tobago-tool-annotation/target/tobago-tool-annotation-4.4.2-SNAPSHOT.jar>
to org.apache.myfaces.tobago/tobago-tool-annotation/4.4.2-SNAPSHOT/tobago-tool-annotation-4.4.2-SNAPSHOT.jar
[JENKINS] Archiving <https://builds.apache.org/job/Tobago%204.x/ws/tobago-example/pom.xml>
to org.apache.myfaces.tobago/tobago-example/4.4.2-SNAPSHOT/tobago-example-4.4.2-SNAPSHOT.pom
[JENKINS] Archiving <https://builds.apache.org/job/Tobago%204.x/ws/tobago-tool/pom.xml>
to org.apache.myfaces.tobago/tobago-tool/4.4.2-SNAPSHOT/tobago-tool-4.4.2-SNAPSHOT.pom
[JENKINS] Archiving <https://builds.apache.org/job/Tobago%204.x/ws/tobago-core/pom.xml>
to org.apache.myfaces.tobago/tobago-core/4.4.2-SNAPSHOT/tobago-core-4.4.2-SNAPSHOT.pom
[JENKINS] Archiving <https://builds.apache.org/job/Tobago%204.x/ws/tobago-tool/tobago-tool-apt/pom.xml>
to org.apache.myfaces.tobago/tobago-tool-apt/4.4.2-SNAPSHOT/tobago-tool-apt-4.4.2-SNAPSHOT.pom
[JENKINS] Archiving <https://builds.apache.org/job/Tobago%204.x/ws/tobago-tool/tobago-tool-apt/target/tobago-tool-apt-4.4.2-SNAPSHOT.jar>
to org.apache.myfaces.tobago/tobago-tool-apt/4.4.2-SNAPSHOT/tobago-tool-apt-4.4.2-SNAPSHOT.jar
[JENKINS] Archiving <https://builds.apache.org/job/Tobago%204.x/ws/tobago-theme/tobago-theme-charlotteville/pom.xml>
to org.apache.myfaces.tobago/tobago-theme-charlotteville/4.4.2-SNAPSHOT/tobago-theme-charlotteville-4.4.2-SNAPSHOT.pom
[JENKINS] Archiving <https://builds.apache.org/job/Tobago%204.x/ws/tobago-example/tobago-example-demo/pom.xml>
to org.apache.myfaces.tobago/tobago-example-demo/4.4.2-SNAPSHOT/tobago-example-demo-4.4.2-SNAPSHOT.pom
No mail will be sent out, as 'Tobago 4.x » Tobago Themes #113' does not have a result yet.
Please make sure you set a proper result in case of pipeline/build scripts.
No mail will be sent out, as 'Tobago 4.x » Tobago Example Blank #113' does not have a result
yet. Please make sure you set a proper result in case of pipeline/build scripts.
No mail will be sent out, as 'Tobago 4.x » Tobago Assembly #113' does not have a result
yet. Please make sure you set a proper result in case of pipeline/build scripts.
No mail will be sent out, as 'Tobago 4.x » Apache Tobago #113' does not have a result yet.
Please make sure you set a proper result in case of pipeline/build scripts.
No mail will be sent out, as 'Tobago 4.x » Tobago Theme Standard #113' does not have a
result yet. Please make sure you set a proper result in case of pipeline/build scripts.
No mail will be sent out, as 'Tobago 4.x » Tobago Theme Scarborough #113' does not have
a result yet. Please make sure you set a proper result in case of pipeline/build scripts.
No mail will be sent out, as 'Tobago 4.x » Tobago Example Assembly #113' does not have
a result yet. Please make sure you set a proper result in case of pipeline/build scripts.
No mail will be sent out, as 'Tobago 4.x » Tobago Tool Test #113' does not have a result
yet. Please make sure you set a proper result in case of pipeline/build scripts.
No mail will be sent out, as 'Tobago 4.x » Tobago Theme Speyside #113' does not have a
result yet. Please make sure you set a proper result in case of pipeline/build scripts.
No mail will be sent out, as 'Tobago 4.x » Tobago Theme Roxborough #113' does not have
a result yet. Please make sure you set a proper result in case of pipeline/build scripts.
No mail will be sent out, as 'Tobago 4.x » Tobago Tool Annotation #113' does not have a
result yet. Please make sure you set a proper result in case of pipeline/build scripts.
No mail will be sent out, as 'Tobago 4.x » Tobago Examples #113' does not have a result
yet. Please make sure you set a proper result in case of pipeline/build scripts.
No mail will be sent out, as 'Tobago 4.x » Tobago Tool #113' does not have a result yet.
Please make sure you set a proper result in case of pipeline/build scripts.
Sending e-mails to: commits@myfaces.apache.org
No mail will be sent out, as 'Tobago 4.x » Tobago Tool Apt #113' does not have a result
yet. Please make sure you set a proper result in case of pipeline/build scripts.
No mail will be sent out, as 'Tobago 4.x » Tobago Theme Charlotteville #113' does not have
a result yet. Please make sure you set a proper result in case of pipeline/build scripts.
No mail will be sent out, as 'Tobago 4.x » Tobago Example Demo #113' does not have a result
yet. Please make sure you set a proper result in case of pipeline/build scripts.
channel stopped
[JIRA] Updating issue TOBAGO-2021

Mime
View raw message