myfaces-commits mailing list archives

Site index · List index
Message view « Date » · « Thread »
Top « Date » · « Thread »
From Apache Jenkins Server <jenk...@builds.apache.org>
Subject Build failed in Jenkins: myfaces-current-master #400
Date Wed, 01 Apr 2020 18:09:39 GMT
See <https://builds.apache.org/job/myfaces-current-master/400/display/redirect?page=changes>

Changes:

[tandraschko] RAT


------------------------------------------
[...truncated 2.23 MB...]
[INFO] Downloaded from apache.snapshots.https: https://repository.apache.org/content/repositories/snapshots/org/apache/myfaces/core/myfaces-extensions/maven-metadata.xml
(404 B at 668 B/s)
[INFO] Uploading to apache.snapshots.https: https://repository.apache.org/content/repositories/snapshots/org/apache/myfaces/core/myfaces-extensions/2.3-next-SNAPSHOT/maven-metadata.xml
[INFO] Uploaded to apache.snapshots.https: https://repository.apache.org/content/repositories/snapshots/org/apache/myfaces/core/myfaces-extensions/2.3-next-SNAPSHOT/maven-metadata.xml
(628 B at 553 B/s)
[INFO] Uploading to apache.snapshots.https: https://repository.apache.org/content/repositories/snapshots/org/apache/myfaces/core/myfaces-extensions/maven-metadata.xml
[INFO] Uploaded to apache.snapshots.https: https://repository.apache.org/content/repositories/snapshots/org/apache/myfaces/core/myfaces-extensions/maven-metadata.xml
(404 B at 369 B/s)
[INFO] 
[INFO] ---------< org.apache.myfaces.core.extensions:myfaces-quarkus >---------
[INFO] Building Apache MyFaces Core 2.3-next - Extensions - Quarkus 2.3-next-SNAPSHOT [7/10]
[INFO] --------------------------------[ pom ]---------------------------------
[INFO] 
[INFO] --- maven-clean-plugin:3.1.0:clean (default-clean) @ myfaces-quarkus ---
[INFO] 
[INFO] --- maven-enforcer-plugin:1.4.1:enforce (enforce-maven-version) @ myfaces-quarkus ---
[INFO] 
[INFO] --- maven-checkstyle-plugin:2.17:check (validate) @ myfaces-quarkus ---
[INFO] Starting audit...
Audit done.
[INFO] 
[INFO] --- maven-remote-resources-plugin:1.5:process (process-resource-bundles) @ myfaces-quarkus
---
[INFO] 
[INFO] >>> maven-source-plugin:2.2.1:jar (attach-source) > generate-sources @
myfaces-quarkus >>>
[INFO] 
[INFO] --- maven-enforcer-plugin:1.4.1:enforce (enforce-maven-version) @ myfaces-quarkus ---
[INFO] 
[INFO] --- maven-checkstyle-plugin:2.17:check (validate) @ myfaces-quarkus ---
[INFO] Starting audit...
Audit done.
[WARNING] Failed to getClass for org.apache.maven.plugin.source.SourceJarMojo
[INFO] 
[INFO] <<< maven-source-plugin:2.2.1:jar (attach-source) < generate-sources @
myfaces-quarkus <<<
[INFO] 
[INFO] 
[INFO] --- maven-source-plugin:2.2.1:jar (attach-source) @ myfaces-quarkus ---
[INFO] 
[INFO] --- maven-site-plugin:3.3:attach-descriptor (attach-descriptor) @ myfaces-quarkus ---
[INFO] 
[INFO] --- maven-checkstyle-plugin:2.17:check (verify-style) @ myfaces-quarkus ---
[INFO] Starting audit...
Audit done.
[INFO] 
[INFO] --- apache-rat-plugin:0.12:check (default) @ myfaces-quarkus ---
[INFO] Enabled default license matchers.
[INFO] Will parse SCM ignores for exclusions...
[INFO] Finished adding exclusions from SCM ignore files.
[INFO] 63 implicit excludes (use -debug for more details).
[INFO] Exclude: **/*/README.md
[INFO] Exclude: **/*/MANIFEST.MF
[INFO] Exclude: .git
[INFO] Exclude: .gitignore
[INFO] Exclude: **/target/**/*
[INFO] 45 resources included (use -debug for more details)
[INFO] Rat check: Summary over all files. Unapproved: 0, unknown: 0, generated: 0, approved:
25 licenses.
[INFO] 
[INFO] --- maven-install-plugin:2.5.2:install (default-install) @ myfaces-quarkus ---
[INFO] Installing <https://builds.apache.org/job/myfaces-current-master/ws/extensions/quarkus/pom.xml>
to /home/jenkins/jenkins-slave/maven-repositories/0/org/apache/myfaces/core/extensions/myfaces-quarkus/2.3-next-SNAPSHOT/myfaces-quarkus-2.3-next-SNAPSHOT.pom
[INFO] 
[INFO] --- maven-enforcer-plugin:1.4.1:enforce (enforce-maven-version) @ myfaces-quarkus ---
[INFO] 
[INFO] --- maven-checkstyle-plugin:2.17:check (validate) @ myfaces-quarkus ---
[INFO] Starting audit...
Audit done.
[INFO] 
[INFO] --- maven-remote-resources-plugin:1.5:process (process-resource-bundles) @ myfaces-quarkus
---
[INFO] 
[INFO] >>> maven-source-plugin:2.2.1:jar (attach-source) > generate-sources @
myfaces-quarkus >>>
[INFO] 
[INFO] --- maven-enforcer-plugin:1.4.1:enforce (enforce-maven-version) @ myfaces-quarkus ---
[INFO] 
[INFO] --- maven-checkstyle-plugin:2.17:check (validate) @ myfaces-quarkus ---
[INFO] Starting audit...
Audit done.
[WARNING] Failed to getClass for org.apache.maven.plugin.source.SourceJarMojo
[INFO] 
[INFO] <<< maven-source-plugin:2.2.1:jar (attach-source) < generate-sources @
myfaces-quarkus <<<
[INFO] 
[INFO] 
[INFO] --- maven-source-plugin:2.2.1:jar (attach-source) @ myfaces-quarkus ---
[INFO] 
[INFO] --- maven-site-plugin:3.3:attach-descriptor (attach-descriptor) @ myfaces-quarkus ---
[INFO] 
[INFO] --- maven-checkstyle-plugin:2.17:check (verify-style) @ myfaces-quarkus ---
[INFO] Starting audit...
Audit done.
[INFO] 
[INFO] --- apache-rat-plugin:0.12:check (default) @ myfaces-quarkus ---
[INFO] Enabled default license matchers.
[INFO] Will parse SCM ignores for exclusions...
[INFO] Finished adding exclusions from SCM ignore files.
[INFO] 63 implicit excludes (use -debug for more details).
[INFO] Exclude: **/*/README.md
[INFO] Exclude: **/*/MANIFEST.MF
[INFO] Exclude: .git
[INFO] Exclude: .gitignore
[INFO] Exclude: **/target/**/*
[INFO] 45 resources included (use -debug for more details)
[INFO] Rat check: Summary over all files. Unapproved: 0, unknown: 0, generated: 0, approved:
25 licenses.
[INFO] 
[INFO] --- maven-install-plugin:2.5.2:install (default-install) @ myfaces-quarkus ---
[INFO] Installing <https://builds.apache.org/job/myfaces-current-master/ws/extensions/quarkus/pom.xml>
to /home/jenkins/jenkins-slave/maven-repositories/0/org/apache/myfaces/core/extensions/myfaces-quarkus/2.3-next-SNAPSHOT/myfaces-quarkus-2.3-next-SNAPSHOT.pom
[INFO] 
[INFO] --- maven-deploy-plugin:2.8.2:deploy (default-deploy) @ myfaces-quarkus ---
[INFO] Downloading from apache.snapshots.https: https://repository.apache.org/content/repositories/snapshots/org/apache/myfaces/core/extensions/myfaces-quarkus/2.3-next-SNAPSHOT/maven-metadata.xml
[INFO] Downloaded from apache.snapshots.https: https://repository.apache.org/content/repositories/snapshots/org/apache/myfaces/core/extensions/myfaces-quarkus/2.3-next-SNAPSHOT/maven-metadata.xml
(636 B at 1.0 kB/s)
[INFO] Uploading to apache.snapshots.https: https://repository.apache.org/content/repositories/snapshots/org/apache/myfaces/core/extensions/myfaces-quarkus/2.3-next-SNAPSHOT/myfaces-quarkus-2.3-next-20200401.180849-124.pom
[INFO] Uploaded to apache.snapshots.https: https://repository.apache.org/content/repositories/snapshots/org/apache/myfaces/core/extensions/myfaces-quarkus/2.3-next-SNAPSHOT/myfaces-quarkus-2.3-next-20200401.180849-124.pom
(3.1 kB at 2.6 kB/s)
[INFO] Downloading from apache.snapshots.https: https://repository.apache.org/content/repositories/snapshots/org/apache/myfaces/core/extensions/myfaces-quarkus/maven-metadata.xml
[INFO] Downloaded from apache.snapshots.https: https://repository.apache.org/content/repositories/snapshots/org/apache/myfaces/core/extensions/myfaces-quarkus/maven-metadata.xml
(412 B at 672 B/s)
[INFO] Uploading to apache.snapshots.https: https://repository.apache.org/content/repositories/snapshots/org/apache/myfaces/core/extensions/myfaces-quarkus/2.3-next-SNAPSHOT/maven-metadata.xml
[INFO] Uploaded to apache.snapshots.https: https://repository.apache.org/content/repositories/snapshots/org/apache/myfaces/core/extensions/myfaces-quarkus/2.3-next-SNAPSHOT/maven-metadata.xml
(636 B at 548 B/s)
[INFO] Uploading to apache.snapshots.https: https://repository.apache.org/content/repositories/snapshots/org/apache/myfaces/core/extensions/myfaces-quarkus/maven-metadata.xml
[INFO] Uploaded to apache.snapshots.https: https://repository.apache.org/content/repositories/snapshots/org/apache/myfaces/core/extensions/myfaces-quarkus/maven-metadata.xml
(412 B at 375 B/s)
[INFO] 
[INFO] --< org.apache.myfaces.core.extensions.quarkus:myfaces-quarkus-runtime >--
[INFO] Building Apache MyFaces Core 2.3-next - Extensions - Quarkus - Runtime 2.3-next-SNAPSHOT
[8/10]
[INFO] --------------------------------[ jar ]---------------------------------
[INFO] 
[INFO] --- maven-clean-plugin:3.1.0:clean (default-clean) @ myfaces-quarkus-runtime ---
[INFO] 
[INFO] --- maven-enforcer-plugin:1.4.1:enforce (enforce-maven-version) @ myfaces-quarkus-runtime
---
[INFO] 
[INFO] --- maven-checkstyle-plugin:2.17:check (validate) @ myfaces-quarkus-runtime ---
[INFO] Starting audit...
Audit done.
[INFO] 
[INFO] --- maven-remote-resources-plugin:1.5:process (process-resource-bundles) @ myfaces-quarkus-runtime
---
[INFO] 
[INFO] --- maven-resources-plugin:2.5:resources (default-resources) @ myfaces-quarkus-runtime
---
[debug] execute contextualize
[INFO] Using 'UTF-8' encoding to copy filtered resources.
[INFO] Copying 3 resources
[INFO] Copying 3 resources
[INFO] 
[INFO] --- maven-compiler-plugin:3.6.1:compile (default-compile) @ myfaces-quarkus-runtime
---
[INFO] Changes detected - recompiling the module!
[INFO] Compiling 18 source files to <https://builds.apache.org/job/myfaces-current-master/ws/extensions/quarkus/runtime/target/classes>
[INFO] 
[INFO] --- maven-resources-plugin:2.5:testResources (default-testResources) @ myfaces-quarkus-runtime
---
[debug] execute contextualize
[INFO] Using 'UTF-8' encoding to copy filtered resources.
[INFO] skip non existing resourceDirectory <https://builds.apache.org/job/myfaces-current-master/ws/extensions/quarkus/runtime/src/test/resources>
[INFO] Copying 3 resources
[INFO] 
[INFO] --- maven-compiler-plugin:3.6.1:testCompile (default-testCompile) @ myfaces-quarkus-runtime
---
[INFO] No sources to compile
[INFO] 
[INFO] --- maven-surefire-plugin:2.22.2:test (default-test) @ myfaces-quarkus-runtime ---
[JENKINS] Recording test results
[INFO] 
[INFO] --- maven-jar-plugin:2.3.2:jar (default-jar) @ myfaces-quarkus-runtime ---
[INFO] Building jar: <https://builds.apache.org/job/myfaces-current-master/ws/extensions/quarkus/runtime/target/myfaces-quarkus-runtime-2.3-next-SNAPSHOT.jar>
[INFO] 
[INFO] >>> maven-source-plugin:2.2.1:jar (attach-source) > generate-sources @
myfaces-quarkus-runtime >>>
[INFO] 
[INFO] --- maven-enforcer-plugin:1.4.1:enforce (enforce-maven-version) @ myfaces-quarkus-runtime
---
[INFO] 
[INFO] --- maven-checkstyle-plugin:2.17:check (validate) @ myfaces-quarkus-runtime ---
[INFO] Starting audit...
Audit done.
[WARNING] Failed to getClass for org.apache.maven.plugin.source.SourceJarMojo
[INFO] 
[INFO] <<< maven-source-plugin:2.2.1:jar (attach-source) < generate-sources @
myfaces-quarkus-runtime <<<
[INFO] 
[INFO] 
[INFO] --- maven-source-plugin:2.2.1:jar (attach-source) @ myfaces-quarkus-runtime ---
[INFO] Building jar: <https://builds.apache.org/job/myfaces-current-master/ws/extensions/quarkus/runtime/target/myfaces-quarkus-runtime-2.3-next-SNAPSHOT-sources.jar>
[INFO] 
[INFO] --- maven-site-plugin:3.3:attach-descriptor (attach-descriptor) @ myfaces-quarkus-runtime
---
[INFO] 
[INFO] --- maven-checkstyle-plugin:2.17:check (verify-style) @ myfaces-quarkus-runtime ---
[INFO] Starting audit...
Audit done.
[INFO] 
[INFO] --- apache-rat-plugin:0.12:check (default) @ myfaces-quarkus-runtime ---
[INFO] Enabled default license matchers.
[INFO] Will parse SCM ignores for exclusions...
[INFO] Finished adding exclusions from SCM ignore files.
[INFO] 61 implicit excludes (use -debug for more details).
[INFO] Exclude: **/*/README.md
[INFO] Exclude: **/*/MANIFEST.MF
[INFO] Exclude: .git
[INFO] Exclude: .gitignore
[INFO] Exclude: **/target/**/*
[INFO] 22 resources included (use -debug for more details)
[INFO] Rat check: Summary over all files. Unapproved: 2, unknown: 2, generated: 0, approved:
20 licenses.
[INFO] ------------------------------------------------------------------------
[INFO] Reactor Summary for Apache MyFaces Core 2.3-next 2.3-next-SNAPSHOT:
[INFO] 
[INFO] Apache MyFaces Core 2.3-next - Parent .............. SUCCESS [ 20.950 s]
[INFO] Apache MyFaces Core 2.3-next - API ................. SUCCESS [ 54.003 s]
[INFO] Apache MyFaces Core 2.3-next - Test ................ SUCCESS [ 23.583 s]
[INFO] Apache MyFaces Core 2.3-next - Impl ................ SUCCESS [04:35 min]
[INFO] Apache MyFaces Core 2.3-next - OSGi Bundle ......... SUCCESS [ 29.124 s]
[INFO] Apache MyFaces Core 2.3-next - Extensions .......... SUCCESS [ 10.071 s]
[INFO] Apache MyFaces Core 2.3-next - Extensions - Quarkus  SUCCESS [ 10.757 s]
[INFO] Apache MyFaces Core 2.3-next - Extensions - Quarkus - Runtime FAILURE [  6.649 s]
[INFO] Apache MyFaces Core 2.3-next - Extensions - Quarkus - Deployment SKIPPED
[INFO] Apache MyFaces Core 2.3-next ....................... SKIPPED
[INFO] ------------------------------------------------------------------------
[INFO] BUILD FAILURE
[INFO] ------------------------------------------------------------------------
[INFO] Total time:  07:59 min
[INFO] Finished at: 2020-04-01T18:09:19Z
[INFO] ------------------------------------------------------------------------
Waiting for Jenkins to finish collecting data
[ERROR] Failed to execute goal org.apache.rat:apache-rat-plugin:0.12:check (default) on project
myfaces-quarkus-runtime: Too many files with unapproved license: 2 See RAT report in: <https://builds.apache.org/job/myfaces-current-master/ws/extensions/quarkus/runtime/target/rat.txt>
-> [Help 1]
[ERROR] 
[ERROR] To see the full stack trace of the errors, re-run Maven with the -e switch.
[ERROR] Re-run Maven using the -X switch to enable full debug logging.
[ERROR] 
[ERROR] For more information about the errors and possible solutions, please read the following
articles:
[ERROR] [Help 1] http://cwiki.apache.org/confluence/display/MAVEN/MojoFailureException
[ERROR] 
[ERROR] After correcting the problems, you can resume the build with the command
[ERROR]   mvn <goals> -rf :myfaces-quarkus-runtime
[JENKINS] Archiving <https://builds.apache.org/job/myfaces-current-master/ws/extensions/quarkus/runtime/pom.xml>
to org.apache.myfaces.core.extensions.quarkus/myfaces-quarkus-runtime/2.3-next-SNAPSHOT/myfaces-quarkus-runtime-2.3-next-SNAPSHOT.pom
[JENKINS] Archiving <https://builds.apache.org/job/myfaces-current-master/ws/extensions/quarkus/runtime/target/myfaces-quarkus-runtime-2.3-next-SNAPSHOT.jar>
to org.apache.myfaces.core.extensions.quarkus/myfaces-quarkus-runtime/2.3-next-SNAPSHOT/myfaces-quarkus-runtime-2.3-next-SNAPSHOT.jar
[JENKINS] Archiving <https://builds.apache.org/job/myfaces-current-master/ws/extensions/quarkus/runtime/target/myfaces-quarkus-runtime-2.3-next-SNAPSHOT-sources.jar>
to org.apache.myfaces.core.extensions.quarkus/myfaces-quarkus-runtime/2.3-next-SNAPSHOT/myfaces-quarkus-runtime-2.3-next-SNAPSHOT-sources.jar
[JENKINS] Archiving <https://builds.apache.org/job/myfaces-current-master/ws/api/pom.xml>
to org.apache.myfaces.core/myfaces-api/2.3-next-SNAPSHOT/myfaces-api-2.3-next-SNAPSHOT.pom
[JENKINS] Archiving <https://builds.apache.org/job/myfaces-current-master/ws/api/target/myfaces-api-2.3-next-SNAPSHOT.jar>
to org.apache.myfaces.core/myfaces-api/2.3-next-20200401.180228-115/myfaces-api-2.3-next-20200401.180228-115.jar
[JENKINS] Archiving <https://builds.apache.org/job/myfaces-current-master/ws/api/target/myfaces-api-2.3-next-SNAPSHOT-sources.jar>
to org.apache.myfaces.core/myfaces-api/2.3-next-20200401.180228-115/myfaces-api-2.3-next-20200401.180228-115-sources.jar
[JENKINS] Archiving <https://builds.apache.org/job/myfaces-current-master/ws/api/target/myfaces-api-2.3-next-SNAPSHOT-tests.jar>
to org.apache.myfaces.core/myfaces-api/2.3-next-20200401.180228-115/myfaces-api-2.3-next-20200401.180228-115-tests.jar
[JENKINS] Archiving <https://builds.apache.org/job/myfaces-current-master/ws/test/pom.xml>
to org.apache.myfaces.core/myfaces-test/2.3-next-SNAPSHOT/myfaces-test-2.3-next-SNAPSHOT.pom
[JENKINS] Archiving <https://builds.apache.org/job/myfaces-current-master/ws/test/target/myfaces-test-2.3-next-SNAPSHOT.jar>
to org.apache.myfaces.core/myfaces-test/2.3-next-20200401.180302-115/myfaces-test-2.3-next-20200401.180302-115.jar
[JENKINS] Archiving <https://builds.apache.org/job/myfaces-current-master/ws/test/target/myfaces-test-2.3-next-SNAPSHOT-sources.jar>
to org.apache.myfaces.core/myfaces-test/2.3-next-20200401.180302-115/myfaces-test-2.3-next-20200401.180302-115-sources.jar
[JENKINS] Archiving <https://builds.apache.org/job/myfaces-current-master/ws/extensions/pom.xml>
to org.apache.myfaces.core/myfaces-extensions/2.3-next-SNAPSHOT/myfaces-extensions-2.3-next-SNAPSHOT.pom
[JENKINS] Archiving <https://builds.apache.org/job/myfaces-current-master/ws/extensions/quarkus/pom.xml>
to org.apache.myfaces.core.extensions/myfaces-quarkus/2.3-next-SNAPSHOT/myfaces-quarkus-2.3-next-SNAPSHOT.pom
[JENKINS] Archiving <https://builds.apache.org/job/myfaces-current-master/ws/impl/pom.xml>
to org.apache.myfaces.core/myfaces-impl/2.3-next-SNAPSHOT/myfaces-impl-2.3-next-SNAPSHOT.pom
[JENKINS] Archiving <https://builds.apache.org/job/myfaces-current-master/ws/impl/target/myfaces-impl-2.3-next-SNAPSHOT.jar>
to org.apache.myfaces.core/myfaces-impl/2.3-next-20200401.180728-115/myfaces-impl-2.3-next-20200401.180728-115.jar
[JENKINS] Archiving <https://builds.apache.org/job/myfaces-current-master/ws/impl/target/myfaces-impl-2.3-next-SNAPSHOT-sources.jar>
to org.apache.myfaces.core/myfaces-impl/2.3-next-20200401.180728-115/myfaces-impl-2.3-next-20200401.180728-115-sources.jar
[JENKINS] Archiving <https://builds.apache.org/job/myfaces-current-master/ws/impl/target/myfaces-impl-2.3-next-SNAPSHOT-test-sources.jar>
to org.apache.myfaces.core/myfaces-impl/2.3-next-20200401.180728-115/myfaces-impl-2.3-next-20200401.180728-115-test-sources.jar
[JENKINS] Archiving <https://builds.apache.org/job/myfaces-current-master/ws/impl/target/myfaces-impl-2.3-next-SNAPSHOT-tests.jar>
to org.apache.myfaces.core/myfaces-impl/2.3-next-20200401.180728-115/myfaces-impl-2.3-next-20200401.180728-115-tests.jar
[JENKINS] Archiving <https://builds.apache.org/job/myfaces-current-master/ws/bundle/pom.xml>
to org.apache.myfaces.core/myfaces-bundle/2.3-next-SNAPSHOT/myfaces-bundle-2.3-next-SNAPSHOT.pom
[JENKINS] Archiving <https://builds.apache.org/job/myfaces-current-master/ws/bundle/target/myfaces-bundle-2.3-next-SNAPSHOT.jar>
to org.apache.myfaces.core/myfaces-bundle/2.3-next-20200401.180814-115/myfaces-bundle-2.3-next-20200401.180814-115.jar
[JENKINS] Archiving <https://builds.apache.org/job/myfaces-current-master/ws/bundle/target/myfaces-bundle-2.3-next-SNAPSHOT-sources.jar>
to org.apache.myfaces.core/myfaces-bundle/2.3-next-20200401.180814-115/myfaces-bundle-2.3-next-20200401.180814-115-sources.jar
[JENKINS] Archiving <https://builds.apache.org/job/myfaces-current-master/ws/extensions/quarkus/deployment/pom.xml>
to org.apache.myfaces.core.extensions.quarkus/myfaces-quarkus-deployment/2.3-next-SNAPSHOT/myfaces-quarkus-deployment-2.3-next-SNAPSHOT.pom
[JENKINS] Archiving <https://builds.apache.org/job/myfaces-current-master/ws/pom.xml>
to org.apache.myfaces.core/myfaces-core-module/2.3-next-SNAPSHOT/myfaces-core-module-2.3-next-SNAPSHOT.pom
[JENKINS] Archiving <https://builds.apache.org/job/myfaces-current-master/ws/parent/pom.xml>
to org.apache.myfaces.core/myfaces-core-project/2.3-next-SNAPSHOT/myfaces-core-project-2.3-next-SNAPSHOT.pom
[JENKINS] Archiving <https://builds.apache.org/job/myfaces-current-master/ws/parent/target/myfaces-core-project-2.3-next-SNAPSHOT-site.xml>
to org.apache.myfaces.core/myfaces-core-project/2.3-next-20200401.180134-125/myfaces-core-project-2.3-next-20200401.180134-125-site.xml
Sending e-mails to: commits@myfaces.apache.org grantsmith@apache.org
No mail will be sent out, as 'myfaces-current-master » Apache MyFaces Core 2.3-next - API
#400' does not have a result yet. Please make sure you set a proper result in case of pipeline/build
scripts.
No mail will be sent out, as 'myfaces-current-master » Apache MyFaces Core 2.3-next - Test
#400' does not have a result yet. Please make sure you set a proper result in case of pipeline/build
scripts.
No mail will be sent out, as 'myfaces-current-master » Apache MyFaces Core 2.3-next - Extensions
#400' does not have a result yet. Please make sure you set a proper result in case of pipeline/build
scripts.
No mail will be sent out, as 'myfaces-current-master » Apache MyFaces Core 2.3-next - Extensions
- Quarkus #400' does not have a result yet. Please make sure you set a proper result in case
of pipeline/build scripts.
No mail will be sent out, as 'myfaces-current-master » Apache MyFaces Core 2.3-next - Impl
#400' does not have a result yet. Please make sure you set a proper result in case of pipeline/build
scripts.
No mail will be sent out, as 'myfaces-current-master » Apache MyFaces Core 2.3-next - OSGi
Bundle #400' does not have a result yet. Please make sure you set a proper result in case
of pipeline/build scripts.
No mail will be sent out, as 'myfaces-current-master » Apache MyFaces Core 2.3-next - Extensions
- Quarkus - Deployment #400' does not have a result yet. Please make sure you set a proper
result in case of pipeline/build scripts.
No mail will be sent out, as 'myfaces-current-master » Apache MyFaces Core 2.3-next #400'
does not have a result yet. Please make sure you set a proper result in case of pipeline/build
scripts.
No mail will be sent out, as 'myfaces-current-master » Apache MyFaces Core 2.3-next - Parent
#400' does not have a result yet. Please make sure you set a proper result in case of pipeline/build
scripts.
channel stopped

Mime
View raw message