myfaces-commits mailing list archives

Site index · List index
Message view « Date » · « Thread »
Top « Date » · « Thread »
From Apache Jenkins Server <jenk...@builds.apache.org>
Subject Build failed in Jenkins: Tobago 4.x #121
Date Thu, 02 Apr 2020 14:02:57 GMT
See <https://builds.apache.org/job/Tobago%204.x/121/display/redirect?page=changes>

Changes:

[hnoeth] add outline markup for buttons

[hnoeth] fix: aria-labelledby for dropdown menus

[hnoeth] update deltaspike in demo to 1.9.3

[github] TOBAGO-1994: TreeListbox is not working correctly * enhance Demo


------------------------------------------
[...truncated 105.70 KB...]
[INFO] --- animal-sniffer-maven-plugin:1.14:check (default-cli) @ tobago-theme-charlotteville
---
[INFO] Checking unresolved references to org.codehaus.mojo.signature:java18:1.0
[INFO] 
[INFO] --- maven-checkstyle-plugin:2.17:check (default-cli) @ tobago-theme-charlotteville
---
[INFO] Starting audit...
Audit done.
[INFO] 
[INFO] --- maven-enforcer-plugin:3.0.0-M1:enforce (enforce-maven-version) @ tobago-theme-charlotteville
---
[INFO] 
[INFO] --- maven-enforcer-plugin:3.0.0-M1:enforce (enforce) @ tobago-theme-charlotteville
---
[INFO] 
[INFO] --- maven-remote-resources-plugin:1.5:process (default) @ tobago-theme-charlotteville
---
[INFO] 
[INFO] --- maven-remote-resources-plugin:1.5:process (process-resource-bundles) @ tobago-theme-charlotteville
---
[INFO] 
[INFO] --- maven-resources-plugin:2.7:resources (default-resources) @ tobago-theme-charlotteville
---
[INFO] Using 'UTF-8' encoding to copy filtered resources.
[INFO] Copying 1 resource
[INFO] Copying 0 resource to META-INF/resources/tobago/charlotteville
[INFO] Copying 8 resources to META-INF/resources/tobago/charlotteville/tobago-bootstrap/4.5.0-SNAPSHOT
[INFO] Copying 3 resources
[INFO] Copying 3 resources
[INFO] 
[INFO] --- maven-compiler-plugin:3.8.0:compile (default-compile) @ tobago-theme-charlotteville
---
[INFO] No sources to compile
[INFO] 
[INFO] --- maven-resources-plugin:2.7:testResources (default-testResources) @ tobago-theme-charlotteville
---
[INFO] Using 'UTF-8' encoding to copy filtered resources.
[INFO] skip non existing resourceDirectory <https://builds.apache.org/job/Tobago%204.x/ws/tobago-theme/tobago-theme-charlotteville/src/test/resources>
[INFO] Copying 3 resources
[INFO] Copying 3 resources
[INFO] 
[INFO] --- maven-compiler-plugin:3.8.0:testCompile (default-testCompile) @ tobago-theme-charlotteville
---
[INFO] No sources to compile
[INFO] 
[INFO] --- maven-surefire-plugin:2.22.1:test (default-test) @ tobago-theme-charlotteville
---
[JENKINS] Recording test results
[INFO] 
[INFO] --- maven-jar-plugin:3.0.2:jar (default-jar) @ tobago-theme-charlotteville ---
[INFO] Building jar: <https://builds.apache.org/job/Tobago%204.x/ws/tobago-theme/tobago-theme-charlotteville/target/tobago-theme-charlotteville-4.5.0-SNAPSHOT.jar>
[INFO] 
[INFO] --- maven-site-plugin:3.6:attach-descriptor (attach-descriptor) @ tobago-theme-charlotteville
---
[INFO] Skipping because packaging 'jar' is not pom.
[INFO] 
[INFO] --- maven-install-plugin:2.5.2:install (default-install) @ tobago-theme-charlotteville
---
[INFO] Installing <https://builds.apache.org/job/Tobago%204.x/ws/tobago-theme/tobago-theme-charlotteville/target/tobago-theme-charlotteville-4.5.0-SNAPSHOT.jar>
to /home/jenkins/jenkins-slave/maven-repositories/1/org/apache/myfaces/tobago/tobago-theme-charlotteville/4.5.0-SNAPSHOT/tobago-theme-charlotteville-4.5.0-SNAPSHOT.jar
[INFO] Installing <https://builds.apache.org/job/Tobago%204.x/ws/tobago-theme/tobago-theme-charlotteville/pom.xml>
to /home/jenkins/jenkins-slave/maven-repositories/1/org/apache/myfaces/tobago/tobago-theme-charlotteville/4.5.0-SNAPSHOT/tobago-theme-charlotteville-4.5.0-SNAPSHOT.pom
[INFO] 
[INFO] --------------< org.apache.myfaces.tobago:tobago-example >--------------
[INFO] Building Tobago Examples 4.5.0-SNAPSHOT                          [13/17]
[INFO] --------------------------------[ pom ]---------------------------------
[INFO] 
[INFO] --- maven-clean-plugin:2.6.1:clean (default-clean) @ tobago-example ---
[INFO] Deleting <https://builds.apache.org/job/Tobago%204.x/ws/tobago-example/target>
[INFO] 
[INFO] --- animal-sniffer-maven-plugin:1.14:check (default-cli) @ tobago-example ---
[INFO] Checking unresolved references to org.codehaus.mojo.signature:java18:1.0
[INFO] 
[INFO] --- maven-checkstyle-plugin:2.17:check (default-cli) @ tobago-example ---
[INFO] Starting audit...
Audit done.
[INFO] 
[INFO] --- maven-enforcer-plugin:3.0.0-M1:enforce (enforce-maven-version) @ tobago-example
---
[INFO] 
[INFO] --- maven-enforcer-plugin:3.0.0-M1:enforce (enforce) @ tobago-example ---
[INFO] 
[INFO] --- maven-remote-resources-plugin:1.5:process (default) @ tobago-example ---
[INFO] 
[INFO] --- maven-remote-resources-plugin:1.5:process (process-resource-bundles) @ tobago-example
---
[INFO] 
[INFO] --- maven-site-plugin:3.6:attach-descriptor (attach-descriptor) @ tobago-example ---
[INFO] No site descriptor found: nothing to attach.
[INFO] 
[INFO] --- maven-install-plugin:2.5.2:install (default-install) @ tobago-example ---
[INFO] Installing <https://builds.apache.org/job/Tobago%204.x/ws/tobago-example/pom.xml>
to /home/jenkins/jenkins-slave/maven-repositories/1/org/apache/myfaces/tobago/tobago-example/4.5.0-SNAPSHOT/tobago-example-4.5.0-SNAPSHOT.pom
[INFO] 
[INFO] -----------< org.apache.myfaces.tobago:tobago-example-blank >-----------
[INFO] Building Tobago Example Blank 4.5.0-SNAPSHOT                     [14/17]
[INFO] --------------------------------[ war ]---------------------------------
[INFO] 
[INFO] --- maven-clean-plugin:2.6.1:clean (default-clean) @ tobago-example-blank ---
[INFO] Deleting <https://builds.apache.org/job/Tobago%204.x/ws/tobago-example/tobago-example-blank/target>
[INFO] 
[INFO] --- animal-sniffer-maven-plugin:1.14:check (default-cli) @ tobago-example-blank ---
[INFO] Checking unresolved references to org.codehaus.mojo.signature:java18:1.0
[INFO] 
[INFO] --- maven-checkstyle-plugin:2.17:check (default-cli) @ tobago-example-blank ---
[INFO] Starting audit...
Audit done.
[INFO] 
[INFO] --- maven-enforcer-plugin:3.0.0-M1:enforce (enforce-maven-version) @ tobago-example-blank
---
[INFO] 
[INFO] --- maven-enforcer-plugin:3.0.0-M1:enforce (enforce) @ tobago-example-blank ---
[INFO] 
[INFO] --- maven-remote-resources-plugin:1.5:process (default) @ tobago-example-blank ---
[INFO] 
[INFO] --- maven-remote-resources-plugin:1.5:process (process-resource-bundles) @ tobago-example-blank
---
[INFO] 
[INFO] --- maven-resources-plugin:2.7:resources (default-resources) @ tobago-example-blank
---
[INFO] Using 'UTF-8' encoding to copy filtered resources.
[INFO] Copying 1 resource
[INFO] Copying 3 resources
[INFO] Copying 3 resources
[INFO] 
[INFO] --- maven-compiler-plugin:3.8.0:compile (default-compile) @ tobago-example-blank ---
[INFO] Compiling 1 source file to <https://builds.apache.org/job/Tobago%204.x/ws/tobago-example/tobago-example-blank/target/classes>
[INFO] 
[INFO] --- maven-resources-plugin:2.7:testResources (default-testResources) @ tobago-example-blank
---
[INFO] Using 'UTF-8' encoding to copy filtered resources.
[INFO] skip non existing resourceDirectory <https://builds.apache.org/job/Tobago%204.x/ws/tobago-example/tobago-example-blank/src/test/resources>
[INFO] Copying 3 resources
[INFO] Copying 3 resources
[INFO] 
[INFO] --- maven-compiler-plugin:3.8.0:testCompile (default-testCompile) @ tobago-example-blank
---
[INFO] No sources to compile
[INFO] 
[INFO] --- maven-surefire-plugin:2.22.1:test (default-test) @ tobago-example-blank ---
[JENKINS] Recording test results
[INFO] 
[INFO] --- maven-war-plugin:3.1.0:war (default-war) @ tobago-example-blank ---
[INFO] Packaging webapp
[INFO] Assembling webapp [tobago-example-blank] in [<https://builds.apache.org/job/Tobago%204.x/ws/tobago-example/tobago-example-blank/target/tobago-example-blank]>
[INFO] Processing war project
[INFO] Copying webapp resources [<https://builds.apache.org/job/Tobago%204.x/ws/tobago-example/tobago-example-blank/src/main/webapp]>
[INFO] Webapp assembled in [1028 msecs]
[INFO] Building war: <https://builds.apache.org/job/Tobago%204.x/ws/tobago-example/tobago-example-blank/target/tobago-example-blank.war>
[INFO] 
[INFO] --- maven-site-plugin:3.6:attach-descriptor (attach-descriptor) @ tobago-example-blank
---
[INFO] Skipping because packaging 'war' is not pom.
[INFO] 
[INFO] --- maven-install-plugin:2.5.2:install (default-install) @ tobago-example-blank ---
[INFO] Installing <https://builds.apache.org/job/Tobago%204.x/ws/tobago-example/tobago-example-blank/target/tobago-example-blank.war>
to /home/jenkins/jenkins-slave/maven-repositories/1/org/apache/myfaces/tobago/tobago-example-blank/4.5.0-SNAPSHOT/tobago-example-blank-4.5.0-SNAPSHOT.war
[INFO] Installing <https://builds.apache.org/job/Tobago%204.x/ws/tobago-example/tobago-example-blank/pom.xml>
to /home/jenkins/jenkins-slave/maven-repositories/1/org/apache/myfaces/tobago/tobago-example-blank/4.5.0-SNAPSHOT/tobago-example-blank-4.5.0-SNAPSHOT.pom
[INFO] 
[INFO] -----------< org.apache.myfaces.tobago:tobago-example-demo >------------
[INFO] Building Tobago Example Demo 4.5.0-SNAPSHOT                      [15/17]
[INFO] --------------------------------[ war ]---------------------------------
[INFO] 
[INFO] --- maven-clean-plugin:2.6.1:clean (default-clean) @ tobago-example-demo ---
[INFO] Deleting <https://builds.apache.org/job/Tobago%204.x/ws/tobago-example/tobago-example-demo/target>
[INFO] 
[INFO] --- animal-sniffer-maven-plugin:1.14:check (default-cli) @ tobago-example-demo ---
[INFO] Checking unresolved references to org.codehaus.mojo.signature:java18:1.0
[INFO] 
[INFO] --- maven-checkstyle-plugin:2.17:check (default-cli) @ tobago-example-demo ---
[INFO] Starting audit...
<https://builds.apache.org/job/Tobago%204.x/ws/tobago-example/tobago-example-demo/src/main/java/org/apache/myfaces/tobago/example/demo/CategoryNode.java>:40:28:
error: '+' should be on a new line.
<https://builds.apache.org/job/Tobago%204.x/ws/tobago-example/tobago-example-demo/src/main/java/org/apache/myfaces/tobago/example/demo/CategoryNode.java>:41:28:
error: '+' should be on a new line.
<https://builds.apache.org/job/Tobago%204.x/ws/tobago-example/tobago-example-demo/src/main/java/org/apache/myfaces/tobago/example/demo/CategoryNode.java>:42:34:
error: '+' should be on a new line.
<https://builds.apache.org/job/Tobago%204.x/ws/tobago-example/tobago-example-demo/src/main/java/org/apache/myfaces/tobago/example/demo/CategoryNode.java>:43:34:
error: '+' should be on a new line.
Audit done.
[INFO] There are 4 errors reported by Checkstyle 6.11.2 with tobago/checkstyle.xml ruleset.
[ERROR] src/main/java/org/apache/myfaces/tobago/example/demo/CategoryNode.java:[40,28] (whitespace)
OperatorWrap: '+' should be on a new line.
[ERROR] src/main/java/org/apache/myfaces/tobago/example/demo/CategoryNode.java:[41,28] (whitespace)
OperatorWrap: '+' should be on a new line.
[ERROR] src/main/java/org/apache/myfaces/tobago/example/demo/CategoryNode.java:[42,34] (whitespace)
OperatorWrap: '+' should be on a new line.
[ERROR] src/main/java/org/apache/myfaces/tobago/example/demo/CategoryNode.java:[43,34] (whitespace)
OperatorWrap: '+' should be on a new line.
[INFO] ------------------------------------------------------------------------
[INFO] Reactor Summary for Apache Tobago 4.5.0-SNAPSHOT:
[INFO] 
[INFO] Apache Tobago ...................................... SUCCESS [  9.157 s]
[INFO] Tobago Tool ........................................ SUCCESS [  3.568 s]
[INFO] Tobago Tool Annotation ............................. SUCCESS [  7.260 s]
[INFO] Tobago Tool Apt .................................... SUCCESS [  7.560 s]
[INFO] Tobago Tool Test ................................... SUCCESS [  4.631 s]
[INFO] Tobago Core ........................................ SUCCESS [ 22.532 s]
[INFO] Tobago Themes ...................................... SUCCESS [  3.488 s]
[INFO] Tobago Theme Standard .............................. SUCCESS [ 17.612 s]
[INFO] Tobago Theme Scarborough ........................... SUCCESS [  4.663 s]
[INFO] Tobago Theme Speyside .............................. SUCCESS [  4.828 s]
[INFO] Tobago Theme Roxborough ............................ SUCCESS [  4.637 s]
[INFO] Tobago Theme Charlotteville ........................ SUCCESS [  4.788 s]
[INFO] Tobago Examples .................................... SUCCESS [  3.500 s]
[INFO] Tobago Example Blank ............................... SUCCESS [  6.363 s]
[INFO] Tobago Example Demo ................................ FAILURE [  3.804 s]
[INFO] Tobago Example Assembly ............................ SKIPPED
[INFO] Tobago Assembly .................................... SKIPPED
[INFO] ------------------------------------------------------------------------
[INFO] BUILD FAILURE
[INFO] ------------------------------------------------------------------------
[INFO] Total time:  02:52 min
[INFO] Finished at: 2020-04-02T14:04:57Z
[INFO] ------------------------------------------------------------------------
Waiting for Jenkins to finish collecting data
[ERROR] Failed to execute goal org.apache.maven.plugins:maven-checkstyle-plugin:2.17:check
(default-cli) on project tobago-example-demo: You have 4 Checkstyle violations. -> [Help
1]
[ERROR] 
[ERROR] To see the full stack trace of the errors, re-run Maven with the -e switch.
[ERROR] Re-run Maven using the -X switch to enable full debug logging.
[ERROR] 
[ERROR] For more information about the errors and possible solutions, please read the following
articles:
[ERROR] [Help 1] http://cwiki.apache.org/confluence/display/MAVEN/MojoFailureException
[ERROR] 
[ERROR] After correcting the problems, you can resume the build with the command
[ERROR]   mvn <goals> -rf :tobago-example-demo
[JENKINS] Archiving <https://builds.apache.org/job/Tobago%204.x/ws/tobago-theme/pom.xml>
to org.apache.myfaces.tobago/tobago-theme/4.5.0-SNAPSHOT/tobago-theme-4.5.0-SNAPSHOT.pom
[JENKINS] Archiving <https://builds.apache.org/job/Tobago%204.x/ws/tobago-example/tobago-example-blank/pom.xml>
to org.apache.myfaces.tobago/tobago-example-blank/4.5.0-SNAPSHOT/tobago-example-blank-4.5.0-SNAPSHOT.pom
[JENKINS] Archiving <https://builds.apache.org/job/Tobago%204.x/ws/tobago-example/tobago-example-blank/target/tobago-example-blank.war>
to org.apache.myfaces.tobago/tobago-example-blank/4.5.0-SNAPSHOT/tobago-example-blank-4.5.0-SNAPSHOT.war
[Fast Archiver] Compressed 9.34 MB of artifacts by 45.2% relative to #120
[JENKINS] Archiving <https://builds.apache.org/job/Tobago%204.x/ws/tobago-assembly/pom.xml>
to org.apache.myfaces.tobago/tobago-assembly/4.5.0-SNAPSHOT/tobago-assembly-4.5.0-SNAPSHOT.pom
[JENKINS] Archiving <https://builds.apache.org/job/Tobago%204.x/ws/pom.xml> to org.apache.myfaces.tobago/tobago/4.5.0-SNAPSHOT/tobago-4.5.0-SNAPSHOT.pom
[JENKINS] Archiving <https://builds.apache.org/job/Tobago%204.x/ws/target/tobago-4.5.0-SNAPSHOT-site.xml>
to org.apache.myfaces.tobago/tobago/4.5.0-SNAPSHOT/tobago-4.5.0-SNAPSHOT-site.xml
[Fast Archiver] Compressed 53.12 KB of artifacts by 60.2% relative to #120
[JENKINS] Archiving <https://builds.apache.org/job/Tobago%204.x/ws/tobago-theme/tobago-theme-standard/pom.xml>
to org.apache.myfaces.tobago/tobago-theme-standard/4.5.0-SNAPSHOT/tobago-theme-standard-4.5.0-SNAPSHOT.pom
[JENKINS] Archiving <https://builds.apache.org/job/Tobago%204.x/ws/tobago-theme/tobago-theme-standard/target/tobago-theme-standard-4.5.0-SNAPSHOT.jar>
to org.apache.myfaces.tobago/tobago-theme-standard/4.5.0-SNAPSHOT/tobago-theme-standard-4.5.0-SNAPSHOT.jar
[Fast Archiver] Compressed 1.80 MB of artifacts by 46.9% relative to #120
[JENKINS] Archiving <https://builds.apache.org/job/Tobago%204.x/ws/tobago-theme/tobago-theme-scarborough/pom.xml>
to org.apache.myfaces.tobago/tobago-theme-scarborough/4.5.0-SNAPSHOT/tobago-theme-scarborough-4.5.0-SNAPSHOT.pom
[JENKINS] Archiving <https://builds.apache.org/job/Tobago%204.x/ws/tobago-theme/tobago-theme-scarborough/target/tobago-theme-scarborough-4.5.0-SNAPSHOT.jar>
to org.apache.myfaces.tobago/tobago-theme-scarborough/4.5.0-SNAPSHOT/tobago-theme-scarborough-4.5.0-SNAPSHOT.jar
[Fast Archiver] Compressed 449.44 KB of artifacts by 42.7% relative to #120
[JENKINS] Archiving <https://builds.apache.org/job/Tobago%204.x/ws/tobago-example/tobago-example-assembly/pom.xml>
to org.apache.myfaces.tobago/tobago-example-assembly/4.5.0-SNAPSHOT/tobago-example-assembly-4.5.0-SNAPSHOT.pom
[JENKINS] Archiving <https://builds.apache.org/job/Tobago%204.x/ws/tobago-tool/tobago-tool-test/pom.xml>
to org.apache.myfaces.tobago/tobago-tool-test/4.5.0-SNAPSHOT/tobago-tool-test-4.5.0-SNAPSHOT.pom
[JENKINS] Archiving <https://builds.apache.org/job/Tobago%204.x/ws/tobago-tool/tobago-tool-test/target/tobago-tool-test-4.5.0-SNAPSHOT.jar>
to org.apache.myfaces.tobago/tobago-tool-test/4.5.0-SNAPSHOT/tobago-tool-test-4.5.0-SNAPSHOT.jar
[JENKINS] Archiving <https://builds.apache.org/job/Tobago%204.x/ws/tobago-theme/tobago-theme-speyside/pom.xml>
to org.apache.myfaces.tobago/tobago-theme-speyside/4.5.0-SNAPSHOT/tobago-theme-speyside-4.5.0-SNAPSHOT.pom
[JENKINS] Archiving <https://builds.apache.org/job/Tobago%204.x/ws/tobago-theme/tobago-theme-speyside/target/tobago-theme-speyside-4.5.0-SNAPSHOT.jar>
to org.apache.myfaces.tobago/tobago-theme-speyside/4.5.0-SNAPSHOT/tobago-theme-speyside-4.5.0-SNAPSHOT.jar
[Fast Archiver] Compressed 488.19 KB of artifacts by 45.9% relative to #120
[JENKINS] Archiving <https://builds.apache.org/job/Tobago%204.x/ws/tobago-theme/tobago-theme-roxborough/pom.xml>
to org.apache.myfaces.tobago/tobago-theme-roxborough/4.5.0-SNAPSHOT/tobago-theme-roxborough-4.5.0-SNAPSHOT.pom
[JENKINS] Archiving <https://builds.apache.org/job/Tobago%204.x/ws/tobago-theme/tobago-theme-roxborough/target/tobago-theme-roxborough-4.5.0-SNAPSHOT.jar>
to org.apache.myfaces.tobago/tobago-theme-roxborough/4.5.0-SNAPSHOT/tobago-theme-roxborough-4.5.0-SNAPSHOT.jar
[Fast Archiver] Compressed 572.13 KB of artifacts by 33.6% relative to #120
[JENKINS] Archiving <https://builds.apache.org/job/Tobago%204.x/ws/tobago-tool/tobago-tool-annotation/pom.xml>
to org.apache.myfaces.tobago/tobago-tool-annotation/4.5.0-SNAPSHOT/tobago-tool-annotation-4.5.0-SNAPSHOT.pom
[JENKINS] Archiving <https://builds.apache.org/job/Tobago%204.x/ws/tobago-tool/tobago-tool-annotation/target/tobago-tool-annotation-4.5.0-SNAPSHOT.jar>
to org.apache.myfaces.tobago/tobago-tool-annotation/4.5.0-SNAPSHOT/tobago-tool-annotation-4.5.0-SNAPSHOT.jar
[JENKINS] Archiving <https://builds.apache.org/job/Tobago%204.x/ws/tobago-example/pom.xml>
to org.apache.myfaces.tobago/tobago-example/4.5.0-SNAPSHOT/tobago-example-4.5.0-SNAPSHOT.pom
[JENKINS] Archiving <https://builds.apache.org/job/Tobago%204.x/ws/tobago-tool/pom.xml>
to org.apache.myfaces.tobago/tobago-tool/4.5.0-SNAPSHOT/tobago-tool-4.5.0-SNAPSHOT.pom
[JENKINS] Archiving <https://builds.apache.org/job/Tobago%204.x/ws/tobago-core/pom.xml>
to org.apache.myfaces.tobago/tobago-core/4.5.0-SNAPSHOT/tobago-core-4.5.0-SNAPSHOT.pom
[JENKINS] Archiving <https://builds.apache.org/job/Tobago%204.x/ws/tobago-core/target/tobago-core-4.5.0-SNAPSHOT.jar>
to org.apache.myfaces.tobago/tobago-core/4.5.0-SNAPSHOT/tobago-core-4.5.0-SNAPSHOT.jar
[JENKINS] Archiving <https://builds.apache.org/job/Tobago%204.x/ws/tobago-core/target/tobago-core-4.5.0-SNAPSHOT-tests.jar>
to org.apache.myfaces.tobago/tobago-core/4.5.0-SNAPSHOT/tobago-core-4.5.0-SNAPSHOT-tests.jar
[JENKINS] Archiving <https://builds.apache.org/job/Tobago%204.x/ws/tobago-core/target/tobago-core-4.5.0-SNAPSHOT-sources.jar>
to org.apache.myfaces.tobago/tobago-core/4.5.0-SNAPSHOT/tobago-core-4.5.0-SNAPSHOT-sources.jar
[JENKINS] Archiving <https://builds.apache.org/job/Tobago%204.x/ws/tobago-tool/tobago-tool-apt/pom.xml>
to org.apache.myfaces.tobago/tobago-tool-apt/4.5.0-SNAPSHOT/tobago-tool-apt-4.5.0-SNAPSHOT.pom
[JENKINS] Archiving <https://builds.apache.org/job/Tobago%204.x/ws/tobago-tool/tobago-tool-apt/target/tobago-tool-apt-4.5.0-SNAPSHOT.jar>
to org.apache.myfaces.tobago/tobago-tool-apt/4.5.0-SNAPSHOT/tobago-tool-apt-4.5.0-SNAPSHOT.jar
[JENKINS] Archiving <https://builds.apache.org/job/Tobago%204.x/ws/tobago-theme/tobago-theme-charlotteville/pom.xml>
to org.apache.myfaces.tobago/tobago-theme-charlotteville/4.5.0-SNAPSHOT/tobago-theme-charlotteville-4.5.0-SNAPSHOT.pom
[JENKINS] Archiving <https://builds.apache.org/job/Tobago%204.x/ws/tobago-theme/tobago-theme-charlotteville/target/tobago-theme-charlotteville-4.5.0-SNAPSHOT.jar>
to org.apache.myfaces.tobago/tobago-theme-charlotteville/4.5.0-SNAPSHOT/tobago-theme-charlotteville-4.5.0-SNAPSHOT.jar
[Fast Archiver] Compressed 448.38 KB of artifacts by 42.8% relative to #120
[JENKINS] Archiving <https://builds.apache.org/job/Tobago%204.x/ws/tobago-example/tobago-example-demo/pom.xml>
to org.apache.myfaces.tobago/tobago-example-demo/4.5.0-SNAPSHOT/tobago-example-demo-4.5.0-SNAPSHOT.pom
No mail will be sent out, as 'Tobago 4.x » Tobago Themes #121' does not have a result yet.
Please make sure you set a proper result in case of pipeline/build scripts.
No mail will be sent out, as 'Tobago 4.x » Tobago Example Blank #121' does not have a result
yet. Please make sure you set a proper result in case of pipeline/build scripts.
No mail will be sent out, as 'Tobago 4.x » Tobago Assembly #121' does not have a result
yet. Please make sure you set a proper result in case of pipeline/build scripts.
No mail will be sent out, as 'Tobago 4.x » Apache Tobago #121' does not have a result yet.
Please make sure you set a proper result in case of pipeline/build scripts.
No mail will be sent out, as 'Tobago 4.x » Tobago Theme Standard #121' does not have a
result yet. Please make sure you set a proper result in case of pipeline/build scripts.
No mail will be sent out, as 'Tobago 4.x » Tobago Theme Scarborough #121' does not have
a result yet. Please make sure you set a proper result in case of pipeline/build scripts.
No mail will be sent out, as 'Tobago 4.x » Tobago Example Assembly #121' does not have
a result yet. Please make sure you set a proper result in case of pipeline/build scripts.
No mail will be sent out, as 'Tobago 4.x » Tobago Tool Test #121' does not have a result
yet. Please make sure you set a proper result in case of pipeline/build scripts.
No mail will be sent out, as 'Tobago 4.x » Tobago Theme Speyside #121' does not have a
result yet. Please make sure you set a proper result in case of pipeline/build scripts.
No mail will be sent out, as 'Tobago 4.x » Tobago Theme Roxborough #121' does not have
a result yet. Please make sure you set a proper result in case of pipeline/build scripts.
No mail will be sent out, as 'Tobago 4.x » Tobago Tool Annotation #121' does not have a
result yet. Please make sure you set a proper result in case of pipeline/build scripts.
No mail will be sent out, as 'Tobago 4.x » Tobago Examples #121' does not have a result
yet. Please make sure you set a proper result in case of pipeline/build scripts.
No mail will be sent out, as 'Tobago 4.x » Tobago Tool #121' does not have a result yet.
Please make sure you set a proper result in case of pipeline/build scripts.
No mail will be sent out, as 'Tobago 4.x » Tobago Core #121' does not have a result yet.
Please make sure you set a proper result in case of pipeline/build scripts.
No mail will be sent out, as 'Tobago 4.x » Tobago Tool Apt #121' does not have a result
yet. Please make sure you set a proper result in case of pipeline/build scripts.
No mail will be sent out, as 'Tobago 4.x » Tobago Theme Charlotteville #121' does not have
a result yet. Please make sure you set a proper result in case of pipeline/build scripts.
Sending e-mails to: commits@myfaces.apache.org
channel stopped
[JIRA] Updating issue TOBAGO-1994

Mime
View raw message