myfaces-commits mailing list archives

Site index · List index
Message view « Date » · « Thread »
Top « Date » · « Thread »
From Apache Jenkins Server <jenk...@builds.apache.org>
Subject Build failed in Jenkins: myfaces-current-master #404
Date Wed, 01 Apr 2020 21:24:19 GMT
See <https://builds.apache.org/job/myfaces-current-master/404/display/redirect?page=changes>

Changes:

[tandraschko] [maven-release-plugin] prepare release 2.3-next-M2


------------------------------------------
[...truncated 1.66 KB...]
[INFO] Reactor Build Order:
[INFO] 
[INFO] Apache MyFaces Core 2.3-next - Parent                              [pom]
[INFO] Apache MyFaces Core 2.3-next - API                                 [jar]
[INFO] Apache MyFaces Core 2.3-next - Test                                [jar]
[INFO] Apache MyFaces Core 2.3-next - Impl                                [jar]
[INFO] Apache MyFaces Core 2.3-next - OSGi Bundle                      [bundle]
[INFO] Apache MyFaces Core 2.3-next - Extensions                          [pom]
[INFO] Apache MyFaces Core 2.3-next - Extensions - Quarkus                [pom]
[INFO] Apache MyFaces Core 2.3-next - Extensions - Quarkus - Runtime      [jar]
[INFO] Apache MyFaces Core 2.3-next - Extensions - Quarkus - Deployment   [jar]
[INFO] Apache MyFaces Core 2.3-next                                       [pom]
[INFO] 
[INFO] ------------< org.apache.myfaces.core:myfaces-core-project >------------
[INFO] Building Apache MyFaces Core 2.3-next - Parent 2.3-next-M2        [1/10]
[INFO] --------------------------------[ pom ]---------------------------------
[INFO] 
[INFO] --- maven-clean-plugin:3.1.0:clean (default-clean) @ myfaces-core-project ---
[INFO] Deleting <https://builds.apache.org/job/myfaces-current-master/ws/parent/target>
[INFO] 
[INFO] ----------------< org.apache.myfaces.core:myfaces-api >-----------------
[INFO] Building Apache MyFaces Core 2.3-next - API 2.3-next-M2           [2/10]
[INFO] --------------------------------[ jar ]---------------------------------
[INFO] 
[INFO] --- maven-clean-plugin:3.1.0:clean (default-clean) @ myfaces-api ---
[INFO] Deleting <https://builds.apache.org/job/myfaces-current-master/ws/api/target>
[INFO] 
[INFO] ----------------< org.apache.myfaces.core:myfaces-test >----------------
[INFO] Building Apache MyFaces Core 2.3-next - Test 2.3-next-M2          [3/10]
[INFO] --------------------------------[ jar ]---------------------------------
[INFO] 
[INFO] --- maven-clean-plugin:3.1.0:clean (default-clean) @ myfaces-test ---
[INFO] Deleting <https://builds.apache.org/job/myfaces-current-master/ws/test/target>
[INFO] 
[INFO] ----------------< org.apache.myfaces.core:myfaces-impl >----------------
[INFO] Building Apache MyFaces Core 2.3-next - Impl 2.3-next-M2          [4/10]
[INFO] --------------------------------[ jar ]---------------------------------
[INFO] 
[INFO] --- maven-clean-plugin:3.1.0:clean (default-clean) @ myfaces-impl ---
[INFO] Deleting <https://builds.apache.org/job/myfaces-current-master/ws/impl/target>
[INFO] 
[INFO] ---------------< org.apache.myfaces.core:myfaces-bundle >---------------
[INFO] Building Apache MyFaces Core 2.3-next - OSGi Bundle 2.3-next-M2   [5/10]
[INFO] -------------------------------[ bundle ]-------------------------------
[INFO] 
[INFO] --- maven-clean-plugin:3.1.0:clean (default-clean) @ myfaces-bundle ---
[INFO] Deleting <https://builds.apache.org/job/myfaces-current-master/ws/bundle/target>
[INFO] 
[INFO] -------------< org.apache.myfaces.core:myfaces-extensions >-------------
[INFO] Building Apache MyFaces Core 2.3-next - Extensions 2.3-next-M2    [6/10]
[INFO] --------------------------------[ pom ]---------------------------------
[INFO] 
[INFO] --- maven-clean-plugin:3.1.0:clean (default-clean) @ myfaces-extensions ---
[INFO] Deleting <https://builds.apache.org/job/myfaces-current-master/ws/extensions/target>
[INFO] 
[INFO] ---------< org.apache.myfaces.core.extensions:myfaces-quarkus >---------
[INFO] Building Apache MyFaces Core 2.3-next - Extensions - Quarkus 2.3-next-M2 [7/10]
[INFO] --------------------------------[ pom ]---------------------------------
[INFO] 
[INFO] --- maven-clean-plugin:3.1.0:clean (default-clean) @ myfaces-quarkus ---
[INFO] Deleting <https://builds.apache.org/job/myfaces-current-master/ws/extensions/quarkus/target>
[INFO] 
[INFO] --< org.apache.myfaces.core.extensions.quarkus:myfaces-quarkus-runtime >--
[INFO] Building Apache MyFaces Core 2.3-next - Extensions - Quarkus - Runtime 2.3-next-M2
[8/10]
[INFO] --------------------------------[ jar ]---------------------------------
[INFO] 
[INFO] --- maven-clean-plugin:3.1.0:clean (default-clean) @ myfaces-quarkus-runtime ---
[INFO] Deleting <https://builds.apache.org/job/myfaces-current-master/ws/extensions/quarkus/runtime/target>
[INFO] 
[INFO] --< org.apache.myfaces.core.extensions.quarkus:myfaces-quarkus-deployment >--
[INFO] Building Apache MyFaces Core 2.3-next - Extensions - Quarkus - Deployment 2.3-next-M2
[9/10]
[INFO] --------------------------------[ jar ]---------------------------------
[INFO] 
[INFO] --- maven-clean-plugin:3.1.0:clean (default-clean) @ myfaces-quarkus-deployment ---
[INFO] Deleting <https://builds.apache.org/job/myfaces-current-master/ws/extensions/quarkus/deployment/target>
[INFO] 
[INFO] ------------< org.apache.myfaces.core:myfaces-core-module >-------------
[INFO] Building Apache MyFaces Core 2.3-next 2.3-next-M2                [10/10]
[INFO] --------------------------------[ pom ]---------------------------------
[INFO] 
[INFO] --- maven-clean-plugin:3.1.0:clean (default-clean) @ myfaces-core-module ---
[INFO] Deleting <https://builds.apache.org/job/myfaces-current-master/ws/target>
[INFO] ------------------------------------------------------------------------
[INFO] Reactor Summary for Apache MyFaces Core 2.3-next 2.3-next-M2:
[INFO] 
[INFO] Apache MyFaces Core 2.3-next - Parent .............. SUCCESS [  0.159 s]
[INFO] Apache MyFaces Core 2.3-next - API ................. SUCCESS [  0.127 s]
[INFO] Apache MyFaces Core 2.3-next - Test ................ SUCCESS [  0.017 s]
[INFO] Apache MyFaces Core 2.3-next - Impl ................ SUCCESS [  0.163 s]
[INFO] Apache MyFaces Core 2.3-next - OSGi Bundle ......... SUCCESS [  0.037 s]
[INFO] Apache MyFaces Core 2.3-next - Extensions .......... SUCCESS [  0.004 s]
[INFO] Apache MyFaces Core 2.3-next - Extensions - Quarkus  SUCCESS [  0.005 s]
[INFO] Apache MyFaces Core 2.3-next - Extensions - Quarkus - Runtime SUCCESS [  0.010 s]
[INFO] Apache MyFaces Core 2.3-next - Extensions - Quarkus - Deployment SUCCESS [  0.009 s]
[INFO] Apache MyFaces Core 2.3-next ....................... SUCCESS [  0.005 s]
[INFO] ------------------------------------------------------------------------
[INFO] BUILD SUCCESS
[INFO] ------------------------------------------------------------------------
[INFO] Total time:  1.680 s
[INFO] Finished at: 2020-04-01T21:22:12Z
[INFO] ------------------------------------------------------------------------
Parsing POMs
Modules changed, recalculating dependency graph
Established TCP socket on 33645
maven35-agent.jar already up to date
maven35-interceptor.jar already up to date
maven3-interceptor-commons.jar already up to date
[myfaces-current-master] $ /home/jenkins/tools/java/latest1.8/bin/java -Xmx2048m -Xms128m
-XX:MaxPermSize=256m -cp /home/jenkins/jenkins-slave/maven35-agent.jar:/home/jenkins/tools/maven/latest/boot/plexus-classworlds-2.6.0.jar:/home/jenkins/tools/maven/latest/conf/logging
jenkins.maven3.agent.Maven35Main /home/jenkins/tools/maven/latest/ /home/jenkins/jenkins-slave/remoting.jar
/home/jenkins/jenkins-slave/maven35-interceptor.jar /home/jenkins/jenkins-slave/maven3-interceptor-commons.jar
33645
Java HotSpot(TM) 64-Bit Server VM warning: ignoring option MaxPermSize=256m; support was removed
in 8.0
<===[JENKINS REMOTING CAPACITY]===>   channel started
Executing Maven:  -B -f <https://builds.apache.org/job/myfaces-current-master/ws/pom.xml>
-Dmaven.repo.local=/home/jenkins/jenkins-slave/maven-repositories/0 clean install deploy
[INFO] Scanning for projects...
[INFO] ------------------------------------------------------------------------
[INFO] Reactor Build Order:
[INFO] 
[INFO] Apache MyFaces Core 2.3-next - Parent                              [pom]
[INFO] Apache MyFaces Core 2.3-next - API                                 [jar]
[INFO] Apache MyFaces Core 2.3-next - Test                                [jar]
[INFO] Apache MyFaces Core 2.3-next - Impl                                [jar]
[INFO] Apache MyFaces Core 2.3-next - OSGi Bundle                      [bundle]
[INFO] Apache MyFaces Core 2.3-next - Extensions                          [pom]
[INFO] Apache MyFaces Core 2.3-next - Extensions - Quarkus                [pom]
[INFO] Apache MyFaces Core 2.3-next - Extensions - Quarkus - Runtime      [jar]
[INFO] Apache MyFaces Core 2.3-next - Extensions - Quarkus - Deployment   [jar]
[INFO] Apache MyFaces Core 2.3-next                                       [pom]
[INFO] 
[INFO] ------------< org.apache.myfaces.core:myfaces-core-project >------------
[INFO] Building Apache MyFaces Core 2.3-next - Parent 2.3-next-M2        [1/10]
[INFO] --------------------------------[ pom ]---------------------------------
[INFO] 
[INFO] --- maven-clean-plugin:3.1.0:clean (default-clean) @ myfaces-core-project ---
[INFO] 
[INFO] --- maven-enforcer-plugin:1.4.1:enforce (enforce-maven-version) @ myfaces-core-project
---
[INFO] 
[INFO] --- maven-checkstyle-plugin:2.17:check (validate) @ myfaces-core-project ---
[INFO] Starting audit...
Audit done.
[INFO] 
[INFO] --- maven-remote-resources-plugin:1.5:process (process-resource-bundles) @ myfaces-core-project
---
[INFO] 
[INFO] >>> maven-source-plugin:2.2.1:jar (attach-source) > generate-sources @
myfaces-core-project >>>
[INFO] 
[INFO] --- maven-enforcer-plugin:1.4.1:enforce (enforce-maven-version) @ myfaces-core-project
---
[INFO] 
[INFO] --- maven-checkstyle-plugin:2.17:check (validate) @ myfaces-core-project ---
[INFO] Starting audit...
Audit done.
[WARNING] Failed to getClass for org.apache.maven.plugin.source.SourceJarMojo
[INFO] 
[INFO] <<< maven-source-plugin:2.2.1:jar (attach-source) < generate-sources @
myfaces-core-project <<<
[INFO] 
[INFO] 
[INFO] --- maven-source-plugin:2.2.1:jar (attach-source) @ myfaces-core-project ---
[INFO] 
[INFO] --- maven-site-plugin:3.3:attach-descriptor (attach-descriptor) @ myfaces-core-project
---
[INFO] 
[INFO] --- maven-checkstyle-plugin:2.17:check (verify-style) @ myfaces-core-project ---
[INFO] Starting audit...
Audit done.
[INFO] 
[INFO] --- maven-install-plugin:2.5.2:install (default-install) @ myfaces-core-project ---
[INFO] Installing <https://builds.apache.org/job/myfaces-current-master/ws/parent/pom.xml>
to /home/jenkins/jenkins-slave/maven-repositories/0/org/apache/myfaces/core/myfaces-core-project/2.3-next-M2/myfaces-core-project-2.3-next-M2.pom
[INFO] Installing <https://builds.apache.org/job/myfaces-current-master/ws/parent/target/myfaces-core-project-2.3-next-M2-site.xml>
to /home/jenkins/jenkins-slave/maven-repositories/0/org/apache/myfaces/core/myfaces-core-project/2.3-next-M2/myfaces-core-project-2.3-next-M2-site.xml
[INFO] 
[INFO] --- maven-enforcer-plugin:1.4.1:enforce (enforce-maven-version) @ myfaces-core-project
---
[INFO] 
[INFO] --- maven-checkstyle-plugin:2.17:check (validate) @ myfaces-core-project ---
[INFO] Starting audit...
Audit done.
[INFO] 
[INFO] --- maven-remote-resources-plugin:1.5:process (process-resource-bundles) @ myfaces-core-project
---
[INFO] 
[INFO] >>> maven-source-plugin:2.2.1:jar (attach-source) > generate-sources @
myfaces-core-project >>>
[INFO] 
[INFO] --- maven-enforcer-plugin:1.4.1:enforce (enforce-maven-version) @ myfaces-core-project
---
[INFO] 
[INFO] --- maven-checkstyle-plugin:2.17:check (validate) @ myfaces-core-project ---
[INFO] Starting audit...
Audit done.
[WARNING] Failed to getClass for org.apache.maven.plugin.source.SourceJarMojo
[INFO] 
[INFO] <<< maven-source-plugin:2.2.1:jar (attach-source) < generate-sources @
myfaces-core-project <<<
[INFO] 
[INFO] 
[INFO] --- maven-source-plugin:2.2.1:jar (attach-source) @ myfaces-core-project ---
[INFO] 
[INFO] --- maven-site-plugin:3.3:attach-descriptor (attach-descriptor) @ myfaces-core-project
---
[INFO] 
[INFO] --- maven-checkstyle-plugin:2.17:check (verify-style) @ myfaces-core-project ---
[INFO] Starting audit...
Audit done.
[INFO] 
[INFO] --- maven-install-plugin:2.5.2:install (default-install) @ myfaces-core-project ---
[INFO] Installing <https://builds.apache.org/job/myfaces-current-master/ws/parent/pom.xml>
to /home/jenkins/jenkins-slave/maven-repositories/0/org/apache/myfaces/core/myfaces-core-project/2.3-next-M2/myfaces-core-project-2.3-next-M2.pom
[INFO] Installing <https://builds.apache.org/job/myfaces-current-master/ws/parent/target/myfaces-core-project-2.3-next-M2-site.xml>
to /home/jenkins/jenkins-slave/maven-repositories/0/org/apache/myfaces/core/myfaces-core-project/2.3-next-M2/myfaces-core-project-2.3-next-M2-site.xml
[INFO] Installing <https://builds.apache.org/job/myfaces-current-master/ws/parent/target/myfaces-core-project-2.3-next-M2-site.xml>
to /home/jenkins/jenkins-slave/maven-repositories/0/org/apache/myfaces/core/myfaces-core-project/2.3-next-M2/myfaces-core-project-2.3-next-M2-site.xml
[INFO] 
[INFO] --- maven-deploy-plugin:2.8.2:deploy (default-deploy) @ myfaces-core-project ---
[INFO] Uploading to apache.releases.https: https://repository.apache.org/service/local/staging/deploy/maven2/org/apache/myfaces/core/myfaces-core-project/2.3-next-M2/myfaces-core-project-2.3-next-M2.pom
[INFO] ------------------------------------------------------------------------
[INFO] Reactor Summary for Apache MyFaces Core 2.3-next 2.3-next-M2:
[INFO] 
[INFO] Apache MyFaces Core 2.3-next - Parent .............. FAILURE [ 13.161 s]
[INFO] Apache MyFaces Core 2.3-next - API ................. SKIPPED
[INFO] Apache MyFaces Core 2.3-next - Test ................ SKIPPED
[INFO] Apache MyFaces Core 2.3-next - Impl ................ SKIPPED
[INFO] Apache MyFaces Core 2.3-next - OSGi Bundle ......... SKIPPED
[INFO] Apache MyFaces Core 2.3-next - Extensions .......... SKIPPED
[INFO] Apache MyFaces Core 2.3-next - Extensions - Quarkus  SKIPPED
[INFO] Apache MyFaces Core 2.3-next - Extensions - Quarkus - Runtime SKIPPED
[INFO] Apache MyFaces Core 2.3-next - Extensions - Quarkus - Deployment SKIPPED
[INFO] Apache MyFaces Core 2.3-next ....................... SKIPPED
[INFO] ------------------------------------------------------------------------
[INFO] BUILD FAILURE
[INFO] ------------------------------------------------------------------------
[INFO] Total time:  30.361 s
[INFO] Finished at: 2020-04-01T21:23:52Z
[INFO] ------------------------------------------------------------------------
Waiting for Jenkins to finish collecting data
[ERROR] Failed to execute goal org.apache.maven.plugins:maven-deploy-plugin:2.8.2:deploy (default-deploy)
on project myfaces-core-project: Failed to deploy artifacts: Could not transfer artifact org.apache.myfaces.core:myfaces-core-project:pom:2.3-next-M2
from/to apache.releases.https (https://repository.apache.org/service/local/staging/deploy/maven2):
Transfer failed for https://repository.apache.org/service/local/staging/deploy/maven2/org/apache/myfaces/core/myfaces-core-project/2.3-next-M2/myfaces-core-project-2.3-next-M2.pom
401 Unauthorized -> [Help 1]
[ERROR] 
[ERROR] To see the full stack trace of the errors, re-run Maven with the -e switch.
[ERROR] Re-run Maven using the -X switch to enable full debug logging.
[ERROR] 
[ERROR] For more information about the errors and possible solutions, please read the following
articles:
[ERROR] [Help 1] http://cwiki.apache.org/confluence/display/MAVEN/MojoExecutionException
[JENKINS] Archiving <https://builds.apache.org/job/myfaces-current-master/ws/extensions/quarkus/runtime/pom.xml>
to org.apache.myfaces.core.extensions.quarkus/myfaces-quarkus-runtime/2.3-next-M2/myfaces-quarkus-runtime-2.3-next-M2.pom
[JENKINS] Archiving <https://builds.apache.org/job/myfaces-current-master/ws/api/pom.xml>
to org.apache.myfaces.core/myfaces-api/2.3-next-M2/myfaces-api-2.3-next-M2.pom
[JENKINS] Archiving <https://builds.apache.org/job/myfaces-current-master/ws/test/pom.xml>
to org.apache.myfaces.core/myfaces-test/2.3-next-M2/myfaces-test-2.3-next-M2.pom
[JENKINS] Archiving <https://builds.apache.org/job/myfaces-current-master/ws/extensions/pom.xml>
to org.apache.myfaces.core/myfaces-extensions/2.3-next-M2/myfaces-extensions-2.3-next-M2.pom
[JENKINS] Archiving <https://builds.apache.org/job/myfaces-current-master/ws/extensions/quarkus/pom.xml>
to org.apache.myfaces.core.extensions/myfaces-quarkus/2.3-next-M2/myfaces-quarkus-2.3-next-M2.pom
[JENKINS] Archiving <https://builds.apache.org/job/myfaces-current-master/ws/impl/pom.xml>
to org.apache.myfaces.core/myfaces-impl/2.3-next-M2/myfaces-impl-2.3-next-M2.pom
[Fast Archiver] Compressed 55.23 KB of artifacts by 57.9% relative to #403
[JENKINS] Archiving <https://builds.apache.org/job/myfaces-current-master/ws/bundle/pom.xml>
to org.apache.myfaces.core/myfaces-bundle/2.3-next-M2/myfaces-bundle-2.3-next-M2.pom
[JENKINS] Archiving <https://builds.apache.org/job/myfaces-current-master/ws/extensions/quarkus/deployment/pom.xml>
to org.apache.myfaces.core.extensions.quarkus/myfaces-quarkus-deployment/2.3-next-M2/myfaces-quarkus-deployment-2.3-next-M2.pom
[JENKINS] Archiving <https://builds.apache.org/job/myfaces-current-master/ws/pom.xml>
to org.apache.myfaces.core/myfaces-core-module/2.3-next-M2/myfaces-core-module-2.3-next-M2.pom
[JENKINS] Archiving <https://builds.apache.org/job/myfaces-current-master/ws/parent/pom.xml>
to org.apache.myfaces.core/myfaces-core-project/2.3-next-M2/myfaces-core-project-2.3-next-M2.pom
[JENKINS] Archiving <https://builds.apache.org/job/myfaces-current-master/ws/parent/target/myfaces-core-project-2.3-next-M2-site.xml>
to org.apache.myfaces.core/myfaces-core-project/2.3-next-M2/myfaces-core-project-2.3-next-M2-site.xml
No mail will be sent out, as 'myfaces-current-master » Apache MyFaces Core 2.3-next - Extensions
- Quarkus - Runtime #404' does not have a result yet. Please make sure you set a proper result
in case of pipeline/build scripts.
No mail will be sent out, as 'myfaces-current-master » Apache MyFaces Core 2.3-next - API
#404' does not have a result yet. Please make sure you set a proper result in case of pipeline/build
scripts.
No mail will be sent out, as 'myfaces-current-master » Apache MyFaces Core 2.3-next - Test
#404' does not have a result yet. Please make sure you set a proper result in case of pipeline/build
scripts.
No mail will be sent out, as 'myfaces-current-master » Apache MyFaces Core 2.3-next - Extensions
#404' does not have a result yet. Please make sure you set a proper result in case of pipeline/build
scripts.
No mail will be sent out, as 'myfaces-current-master » Apache MyFaces Core 2.3-next - Extensions
- Quarkus #404' does not have a result yet. Please make sure you set a proper result in case
of pipeline/build scripts.
No mail will be sent out, as 'myfaces-current-master » Apache MyFaces Core 2.3-next - Impl
#404' does not have a result yet. Please make sure you set a proper result in case of pipeline/build
scripts.
No mail will be sent out, as 'myfaces-current-master » Apache MyFaces Core 2.3-next - OSGi
Bundle #404' does not have a result yet. Please make sure you set a proper result in case
of pipeline/build scripts.
No mail will be sent out, as 'myfaces-current-master » Apache MyFaces Core 2.3-next - Extensions
- Quarkus - Deployment #404' does not have a result yet. Please make sure you set a proper
result in case of pipeline/build scripts.
No mail will be sent out, as 'myfaces-current-master » Apache MyFaces Core 2.3-next #404'
does not have a result yet. Please make sure you set a proper result in case of pipeline/build
scripts.
Sending e-mails to: commits@myfaces.apache.org grantsmith@apache.org tandraschko@apache.org
channel stopped

Mime
View raw message