myfaces-commits mailing list archives

Site index · List index
Message view « Date » · « Thread »
Top « Date » · « Thread »
From Apache Jenkins Server <jenk...@builds.apache.org>
Subject Build failed in Jenkins: myfaces-current-master » Apache MyFaces Core 2.3-next - Extensions - Quarkus - Runtime #545
Date Thu, 09 Jul 2020 07:03:21 GMT
See <https://builds.apache.org/job/myfaces-current-master/org.apache.myfaces.core.extensions.quarkus$myfaces-quarkus/545/display/redirect>

Changes:


------------------------------------------
[INFO] 
[INFO] -----< org.apache.myfaces.core.extensions.quarkus:myfaces-quarkus >-----
[INFO] Building Apache MyFaces Core 2.3-next - Extensions - Quarkus - Runtime 2.3-next-SNAPSHOT
[8/10]
[INFO] --------------------------------[ jar ]---------------------------------
[INFO] 
[INFO] --- maven-clean-plugin:3.1.0:clean (default-clean) @ myfaces-quarkus ---
[INFO] 
[INFO] --- maven-enforcer-plugin:1.4.1:enforce (enforce-maven-version) @ myfaces-quarkus ---
[INFO] 
[INFO] --- maven-checkstyle-plugin:2.17:check (validate) @ myfaces-quarkus ---
[INFO] Starting audit...
Audit done.
[INFO] 
[INFO] --- maven-remote-resources-plugin:1.5:process (process-resource-bundles) @ myfaces-quarkus
---
[INFO] 
[INFO] --- maven-resources-plugin:2.5:resources (default-resources) @ myfaces-quarkus ---
[debug] execute contextualize
[INFO] Using 'UTF-8' encoding to copy filtered resources.
[INFO] Copying 4 resources
[INFO] Copying 3 resources
[INFO] 
[INFO] --- quarkus-bootstrap-maven-plugin:1.6.0.Final:extension-descriptor (default) @ myfaces-quarkus
---
[INFO] Downloading from Nexus: http://repository.apache.org/snapshots/org/apache/myfaces/core/extensions/quarkus/myfaces-quarkus/2.3-next-SNAPSHOT/maven-metadata.xml
[INFO] Downloaded from Nexus: http://repository.apache.org/snapshots/org/apache/myfaces/core/extensions/quarkus/myfaces-quarkus/2.3-next-SNAPSHOT/maven-metadata.xml
(1.0 kB at 1.7 kB/s)
[INFO] Downloading from Nexus: http://repository.apache.org/snapshots/org/apache/myfaces/core/extensions/quarkus/myfaces-quarkus-deployment/2.3-next-SNAPSHOT/maven-metadata.xml
[INFO] Downloaded from Nexus: http://repository.apache.org/snapshots/org/apache/myfaces/core/extensions/quarkus/myfaces-quarkus-deployment/2.3-next-SNAPSHOT/maven-metadata.xml
(1.1 kB at 3.3 kB/s)
[INFO] 
[INFO] --- maven-compiler-plugin:3.6.1:compile (default-compile) @ myfaces-quarkus ---
[INFO] Changes detected - recompiling the module!
[INFO] Compiling 19 source files to <https://builds.apache.org/job/myfaces-current-master/org.apache.myfaces.core.extensions.quarkus$myfaces-quarkus/ws/target/classes>
[INFO] -------------------------------------------------------------
[ERROR] COMPILATION ERROR : 
[INFO] -------------------------------------------------------------
[ERROR] <https://builds.apache.org/job/myfaces-current-master/org.apache.myfaces.core.extensions.quarkus$myfaces-quarkus/ws/src/main/java/org/apache/myfaces/core/extensions/quarkus/runtime/scopes/QuarkusViewTransientScopeContext.java>:[27,35]
cannot find symbol
  symbol:   class ViewTransientScopeContextImpl
  location: package org.apache.myfaces.cdi.view
[ERROR] <https://builds.apache.org/job/myfaces-current-master/org.apache.myfaces.core.extensions.quarkus$myfaces-quarkus/ws/src/main/java/org/apache/myfaces/core/extensions/quarkus/runtime/scopes/QuarkusViewTransientScopeContext.java>:[34,13]
cannot find symbol
  symbol:   class ViewTransientScopeContextImpl
  location: class org.apache.myfaces.core.extensions.quarkus.runtime.scopes.QuarkusViewTransientScopeContext
[ERROR] <https://builds.apache.org/job/myfaces-current-master/org.apache.myfaces.core.extensions.quarkus$myfaces-quarkus/ws/src/main/java/org/apache/myfaces/core/extensions/quarkus/runtime/scopes/QuarkusViewTransientScopeContext.java>:[40,12]
cannot find symbol
  symbol:   class ViewTransientScopeContextImpl
  location: class org.apache.myfaces.core.extensions.quarkus.runtime.scopes.QuarkusViewTransientScopeContext
[ERROR] <https://builds.apache.org/job/myfaces-current-master/org.apache.myfaces.core.extensions.quarkus$myfaces-quarkus/ws/src/main/java/org/apache/myfaces/core/extensions/quarkus/runtime/scopes/QuarkusFacesScopeContext.java>:[27,30]
cannot find symbol
  symbol:   class FacesScopeContextImpl
  location: package org.apache.myfaces.cdi
[ERROR] <https://builds.apache.org/job/myfaces-current-master/org.apache.myfaces.core.extensions.quarkus$myfaces-quarkus/ws/src/main/java/org/apache/myfaces/core/extensions/quarkus/runtime/scopes/QuarkusFacesScopeContext.java>:[34,13]
cannot find symbol
  symbol:   class FacesScopeContextImpl
  location: class org.apache.myfaces.core.extensions.quarkus.runtime.scopes.QuarkusFacesScopeContext
[ERROR] <https://builds.apache.org/job/myfaces-current-master/org.apache.myfaces.core.extensions.quarkus$myfaces-quarkus/ws/src/main/java/org/apache/myfaces/core/extensions/quarkus/runtime/scopes/QuarkusFacesScopeContext.java>:[40,12]
cannot find symbol
  symbol:   class FacesScopeContextImpl
  location: class org.apache.myfaces.core.extensions.quarkus.runtime.scopes.QuarkusFacesScopeContext
[ERROR] <https://builds.apache.org/job/myfaces-current-master/org.apache.myfaces.core.extensions.quarkus$myfaces-quarkus/ws/src/main/java/org/apache/myfaces/core/extensions/quarkus/runtime/scopes/QuarkusViewTransientScopeContext.java>:[44,27]
cannot find symbol
  symbol:   class ViewTransientScopeContextImpl
  location: class org.apache.myfaces.core.extensions.quarkus.runtime.scopes.QuarkusViewTransientScopeContext
[ERROR] <https://builds.apache.org/job/myfaces-current-master/org.apache.myfaces.core.extensions.quarkus$myfaces-quarkus/ws/src/main/java/org/apache/myfaces/core/extensions/quarkus/runtime/scopes/QuarkusFacesScopeContext.java>:[44,27]
cannot find symbol
  symbol:   class FacesScopeContextImpl
  location: class org.apache.myfaces.core.extensions.quarkus.runtime.scopes.QuarkusFacesScopeContext
[INFO] 8 errors 
[INFO] -------------------------------------------------------------

Mime
View raw message