myfaces-commits mailing list archives

Site index · List index
Message view « Date » · « Thread »
Top « Date » · « Thread »
From Apache Jenkins Server <jenk...@builds.apache.org>
Subject Build failed in Jenkins: myfaces-current-master #545
Date Thu, 09 Jul 2020 07:03:28 GMT
See <https://builds.apache.org/job/myfaces-current-master/545/display/redirect?page=changes>

Changes:

[tandraschko] refactored


------------------------------------------
[...truncated 2.30 MB...]
[INFO] 
[INFO] --- maven-enforcer-plugin:1.4.1:enforce (enforce-maven-version) @ myfaces-quarkus ---
[INFO] 
[INFO] --- maven-checkstyle-plugin:2.17:check (validate) @ myfaces-quarkus ---
[INFO] Starting audit...
Audit done.
[INFO] 
[INFO] --- maven-remote-resources-plugin:1.5:process (process-resource-bundles) @ myfaces-quarkus
---
[INFO] 
[INFO] >>> maven-source-plugin:2.2.1:jar (attach-source) > generate-sources @
myfaces-quarkus >>>
[INFO] 
[INFO] --- maven-enforcer-plugin:1.4.1:enforce (enforce-maven-version) @ myfaces-quarkus ---
[INFO] 
[INFO] --- maven-checkstyle-plugin:2.17:check (validate) @ myfaces-quarkus ---
[INFO] Starting audit...
Audit done.
[WARNING] Failed to getClass for org.apache.maven.plugin.source.SourceJarMojo
[INFO] 
[INFO] <<< maven-source-plugin:2.2.1:jar (attach-source) < generate-sources @
myfaces-quarkus <<<
[INFO] 
[INFO] 
[INFO] --- maven-source-plugin:2.2.1:jar (attach-source) @ myfaces-quarkus ---
[INFO] 
[INFO] --- maven-site-plugin:3.3:attach-descriptor (attach-descriptor) @ myfaces-quarkus ---
[INFO] 
[INFO] --- maven-checkstyle-plugin:2.17:check (verify-style) @ myfaces-quarkus ---
[INFO] Starting audit...
Audit done.
[INFO] 
[INFO] --- apache-rat-plugin:0.12:check (default) @ myfaces-quarkus ---
[INFO] Enabled default license matchers.
[INFO] Will parse SCM ignores for exclusions...
[INFO] Finished adding exclusions from SCM ignore files.
[INFO] 63 implicit excludes (use -debug for more details).
[INFO] Exclude: **/*/README.md
[INFO] Exclude: **/*/MANIFEST.MF
[INFO] Exclude: .git
[INFO] Exclude: .gitignore
[INFO] Exclude: **/target/**/*
[INFO] Exclude: src/main/resources/META-INF/services/**
[INFO] 47 resources included (use -debug for more details)
[INFO] Rat check: Summary over all files. Unapproved: 0, unknown: 0, generated: 0, approved:
27 licenses.
[INFO] 
[INFO] --- maven-install-plugin:2.5.2:install (default-install) @ myfaces-quarkus ---
[INFO] Installing <https://builds.apache.org/job/myfaces-current-master/ws/extensions/quarkus/pom.xml>
to /home/jenkins/jenkins-slave/maven-repositories/0/org/apache/myfaces/core/extensions/myfaces-quarkus/2.3-next-SNAPSHOT/myfaces-quarkus-2.3-next-SNAPSHOT.pom
[INFO] 
[INFO] --- maven-enforcer-plugin:1.4.1:enforce (enforce-maven-version) @ myfaces-quarkus ---
[INFO] 
[INFO] --- maven-checkstyle-plugin:2.17:check (validate) @ myfaces-quarkus ---
[INFO] Starting audit...
Audit done.
[INFO] 
[INFO] --- maven-remote-resources-plugin:1.5:process (process-resource-bundles) @ myfaces-quarkus
---
[INFO] 
[INFO] >>> maven-source-plugin:2.2.1:jar (attach-source) > generate-sources @
myfaces-quarkus >>>
[INFO] 
[INFO] --- maven-enforcer-plugin:1.4.1:enforce (enforce-maven-version) @ myfaces-quarkus ---
[INFO] 
[INFO] --- maven-checkstyle-plugin:2.17:check (validate) @ myfaces-quarkus ---
[INFO] Starting audit...
Audit done.
[WARNING] Failed to getClass for org.apache.maven.plugin.source.SourceJarMojo
[INFO] 
[INFO] <<< maven-source-plugin:2.2.1:jar (attach-source) < generate-sources @
myfaces-quarkus <<<
[INFO] 
[INFO] 
[INFO] --- maven-source-plugin:2.2.1:jar (attach-source) @ myfaces-quarkus ---
[INFO] 
[INFO] --- maven-site-plugin:3.3:attach-descriptor (attach-descriptor) @ myfaces-quarkus ---
[INFO] 
[INFO] --- maven-checkstyle-plugin:2.17:check (verify-style) @ myfaces-quarkus ---
[INFO] Starting audit...
Audit done.
[INFO] 
[INFO] --- apache-rat-plugin:0.12:check (default) @ myfaces-quarkus ---
[INFO] Enabled default license matchers.
[INFO] Will parse SCM ignores for exclusions...
[INFO] Finished adding exclusions from SCM ignore files.
[INFO] 63 implicit excludes (use -debug for more details).
[INFO] Exclude: **/*/README.md
[INFO] Exclude: **/*/MANIFEST.MF
[INFO] Exclude: .git
[INFO] Exclude: .gitignore
[INFO] Exclude: **/target/**/*
[INFO] Exclude: src/main/resources/META-INF/services/**
[INFO] 47 resources included (use -debug for more details)
[INFO] Rat check: Summary over all files. Unapproved: 0, unknown: 0, generated: 0, approved:
27 licenses.
[INFO] 
[INFO] --- maven-install-plugin:2.5.2:install (default-install) @ myfaces-quarkus ---
[INFO] Installing <https://builds.apache.org/job/myfaces-current-master/ws/extensions/quarkus/pom.xml>
to /home/jenkins/jenkins-slave/maven-repositories/0/org/apache/myfaces/core/extensions/myfaces-quarkus/2.3-next-SNAPSHOT/myfaces-quarkus-2.3-next-SNAPSHOT.pom
[INFO] 
[INFO] --- maven-deploy-plugin:2.8.2:deploy (default-deploy) @ myfaces-quarkus ---
[INFO] Downloading from apache.snapshots.https: https://repository.apache.org/content/repositories/snapshots/org/apache/myfaces/core/extensions/myfaces-quarkus/2.3-next-SNAPSHOT/maven-metadata.xml
[INFO] Downloaded from apache.snapshots.https: https://repository.apache.org/content/repositories/snapshots/org/apache/myfaces/core/extensions/myfaces-quarkus/2.3-next-SNAPSHOT/maven-metadata.xml
(636 B at 1.4 kB/s)
[INFO] Uploading to apache.snapshots.https: https://repository.apache.org/content/repositories/snapshots/org/apache/myfaces/core/extensions/myfaces-quarkus/2.3-next-SNAPSHOT/myfaces-quarkus-2.3-next-20200709.070238-361.pom
[INFO] Uploaded to apache.snapshots.https: https://repository.apache.org/content/repositories/snapshots/org/apache/myfaces/core/extensions/myfaces-quarkus/2.3-next-SNAPSHOT/myfaces-quarkus-2.3-next-20200709.070238-361.pom
(3.1 kB at 3.3 kB/s)
[INFO] Downloading from apache.snapshots.https: https://repository.apache.org/content/repositories/snapshots/org/apache/myfaces/core/extensions/myfaces-quarkus/maven-metadata.xml
[INFO] Downloaded from apache.snapshots.https: https://repository.apache.org/content/repositories/snapshots/org/apache/myfaces/core/extensions/myfaces-quarkus/maven-metadata.xml
(412 B at 1.0 kB/s)
[INFO] Uploading to apache.snapshots.https: https://repository.apache.org/content/repositories/snapshots/org/apache/myfaces/core/extensions/myfaces-quarkus/2.3-next-SNAPSHOT/maven-metadata.xml
[INFO] Uploaded to apache.snapshots.https: https://repository.apache.org/content/repositories/snapshots/org/apache/myfaces/core/extensions/myfaces-quarkus/2.3-next-SNAPSHOT/maven-metadata.xml
(636 B at 662 B/s)
[INFO] Uploading to apache.snapshots.https: https://repository.apache.org/content/repositories/snapshots/org/apache/myfaces/core/extensions/myfaces-quarkus/maven-metadata.xml
[INFO] Uploaded to apache.snapshots.https: https://repository.apache.org/content/repositories/snapshots/org/apache/myfaces/core/extensions/myfaces-quarkus/maven-metadata.xml
(412 B at 403 B/s)
[INFO] 
[INFO] -----< org.apache.myfaces.core.extensions.quarkus:myfaces-quarkus >-----
[INFO] Building Apache MyFaces Core 2.3-next - Extensions - Quarkus - Runtime 2.3-next-SNAPSHOT
[8/10]
[INFO] --------------------------------[ jar ]---------------------------------
[INFO] 
[INFO] --- maven-clean-plugin:3.1.0:clean (default-clean) @ myfaces-quarkus ---
[INFO] 
[INFO] --- maven-enforcer-plugin:1.4.1:enforce (enforce-maven-version) @ myfaces-quarkus ---
[INFO] 
[INFO] --- maven-checkstyle-plugin:2.17:check (validate) @ myfaces-quarkus ---
[INFO] Starting audit...
Audit done.
[INFO] 
[INFO] --- maven-remote-resources-plugin:1.5:process (process-resource-bundles) @ myfaces-quarkus
---
[INFO] 
[INFO] --- maven-resources-plugin:2.5:resources (default-resources) @ myfaces-quarkus ---
[debug] execute contextualize
[INFO] Using 'UTF-8' encoding to copy filtered resources.
[INFO] Copying 4 resources
[INFO] Copying 3 resources
[INFO] 
[INFO] --- quarkus-bootstrap-maven-plugin:1.6.0.Final:extension-descriptor (default) @ myfaces-quarkus
---
[INFO] Downloading from Nexus: http://repository.apache.org/snapshots/org/apache/myfaces/core/extensions/quarkus/myfaces-quarkus/2.3-next-SNAPSHOT/maven-metadata.xml
[INFO] Downloaded from Nexus: http://repository.apache.org/snapshots/org/apache/myfaces/core/extensions/quarkus/myfaces-quarkus/2.3-next-SNAPSHOT/maven-metadata.xml
(1.0 kB at 1.7 kB/s)
[INFO] Downloading from Nexus: http://repository.apache.org/snapshots/org/apache/myfaces/core/extensions/quarkus/myfaces-quarkus-deployment/2.3-next-SNAPSHOT/maven-metadata.xml
[INFO] Downloaded from Nexus: http://repository.apache.org/snapshots/org/apache/myfaces/core/extensions/quarkus/myfaces-quarkus-deployment/2.3-next-SNAPSHOT/maven-metadata.xml
(1.1 kB at 3.3 kB/s)
[INFO] 
[INFO] --- maven-compiler-plugin:3.6.1:compile (default-compile) @ myfaces-quarkus ---
[INFO] Changes detected - recompiling the module!
[INFO] Compiling 19 source files to <https://builds.apache.org/job/myfaces-current-master/ws/extensions/quarkus/runtime/target/classes>
[INFO] -------------------------------------------------------------
[ERROR] COMPILATION ERROR : 
[INFO] -------------------------------------------------------------
[ERROR] <https://builds.apache.org/job/myfaces-current-master/ws/extensions/quarkus/runtime/src/main/java/org/apache/myfaces/core/extensions/quarkus/runtime/scopes/QuarkusViewTransientScopeContext.java>:[27,35]
cannot find symbol
  symbol:   class ViewTransientScopeContextImpl
  location: package org.apache.myfaces.cdi.view
[ERROR] <https://builds.apache.org/job/myfaces-current-master/ws/extensions/quarkus/runtime/src/main/java/org/apache/myfaces/core/extensions/quarkus/runtime/scopes/QuarkusViewTransientScopeContext.java>:[34,13]
cannot find symbol
  symbol:   class ViewTransientScopeContextImpl
  location: class org.apache.myfaces.core.extensions.quarkus.runtime.scopes.QuarkusViewTransientScopeContext
[ERROR] <https://builds.apache.org/job/myfaces-current-master/ws/extensions/quarkus/runtime/src/main/java/org/apache/myfaces/core/extensions/quarkus/runtime/scopes/QuarkusViewTransientScopeContext.java>:[40,12]
cannot find symbol
  symbol:   class ViewTransientScopeContextImpl
  location: class org.apache.myfaces.core.extensions.quarkus.runtime.scopes.QuarkusViewTransientScopeContext
[ERROR] <https://builds.apache.org/job/myfaces-current-master/ws/extensions/quarkus/runtime/src/main/java/org/apache/myfaces/core/extensions/quarkus/runtime/scopes/QuarkusFacesScopeContext.java>:[27,30]
cannot find symbol
  symbol:   class FacesScopeContextImpl
  location: package org.apache.myfaces.cdi
[ERROR] <https://builds.apache.org/job/myfaces-current-master/ws/extensions/quarkus/runtime/src/main/java/org/apache/myfaces/core/extensions/quarkus/runtime/scopes/QuarkusFacesScopeContext.java>:[34,13]
cannot find symbol
  symbol:   class FacesScopeContextImpl
  location: class org.apache.myfaces.core.extensions.quarkus.runtime.scopes.QuarkusFacesScopeContext
[ERROR] <https://builds.apache.org/job/myfaces-current-master/ws/extensions/quarkus/runtime/src/main/java/org/apache/myfaces/core/extensions/quarkus/runtime/scopes/QuarkusFacesScopeContext.java>:[40,12]
cannot find symbol
  symbol:   class FacesScopeContextImpl
  location: class org.apache.myfaces.core.extensions.quarkus.runtime.scopes.QuarkusFacesScopeContext
[ERROR] <https://builds.apache.org/job/myfaces-current-master/ws/extensions/quarkus/runtime/src/main/java/org/apache/myfaces/core/extensions/quarkus/runtime/scopes/QuarkusViewTransientScopeContext.java>:[44,27]
cannot find symbol
  symbol:   class ViewTransientScopeContextImpl
  location: class org.apache.myfaces.core.extensions.quarkus.runtime.scopes.QuarkusViewTransientScopeContext
[ERROR] <https://builds.apache.org/job/myfaces-current-master/ws/extensions/quarkus/runtime/src/main/java/org/apache/myfaces/core/extensions/quarkus/runtime/scopes/QuarkusFacesScopeContext.java>:[44,27]
cannot find symbol
  symbol:   class FacesScopeContextImpl
  location: class org.apache.myfaces.core.extensions.quarkus.runtime.scopes.QuarkusFacesScopeContext
[INFO] 8 errors 
[INFO] -------------------------------------------------------------
[INFO] ------------------------------------------------------------------------
[INFO] Reactor Summary for Apache MyFaces Core 2.3-next 2.3-next-SNAPSHOT:
[INFO] 
[INFO] Apache MyFaces Core 2.3-next - Parent .............. SUCCESS [ 37.538 s]
[INFO] Apache MyFaces Core 2.3-next - API ................. SUCCESS [ 54.242 s]
[INFO] Apache MyFaces Core 2.3-next - Test ................ SUCCESS [ 21.852 s]
[INFO] Apache MyFaces Core 2.3-next - Impl ................ SUCCESS [04:45 min]
[INFO] Apache MyFaces Core 2.3-next - OSGi Bundle ......... SUCCESS [ 29.038 s]
[INFO] Apache MyFaces Core 2.3-next - Extensions .......... SUCCESS [ 10.934 s]
[INFO] Apache MyFaces Core 2.3-next - Extensions - Quarkus  SUCCESS [  9.821 s]
[INFO] Apache MyFaces Core 2.3-next - Extensions - Quarkus - Runtime FAILURE [  6.169 s]
[INFO] Apache MyFaces Core 2.3-next - Extensions - Quarkus - Deployment SKIPPED
[INFO] Apache MyFaces Core 2.3-next ....................... SKIPPED
[INFO] ------------------------------------------------------------------------
[INFO] BUILD FAILURE
[INFO] ------------------------------------------------------------------------
[INFO] Total time:  08:21 min
[INFO] Finished at: 2020-07-09T07:03:05Z
[INFO] ------------------------------------------------------------------------
Waiting for Jenkins to finish collecting data[ERROR] Failed to execute goal org.apache.maven.plugins:maven-compiler-plugin:3.6.1:compile
(default-compile) on project myfaces-quarkus: Compilation failure: Compilation failure:
[ERROR] <https://builds.apache.org/job/myfaces-current-master/ws/extensions/quarkus/runtime/src/main/java/org/apache/myfaces/core/extensions/quarkus/runtime/scopes/QuarkusViewTransientScopeContext.java>:[27,35]
cannot find symbol
[ERROR] symbol:   class ViewTransientScopeContextImpl
[ERROR] location: package org.apache.myfaces.cdi.view
[ERROR] <https://builds.apache.org/job/myfaces-current-master/ws/extensions/quarkus/runtime/src/main/java/org/apache/myfaces/core/extensions/quarkus/runtime/scopes/QuarkusViewTransientScopeContext.java>:[34,13]
cannot find symbol
[ERROR] symbol:   class ViewTransientScopeContextImpl
[ERROR] location: class org.apache.myfaces.core.extensions.quarkus.runtime.scopes.QuarkusViewTransientScopeContext
[ERROR] <https://builds.apache.org/job/myfaces-current-master/ws/extensions/quarkus/runtime/src/main/java/org/apache/myfaces/core/extensions/quarkus/runtime/scopes/QuarkusViewTransientScopeContext.java>:[40,12]
cannot find symbol
[ERROR] symbol:   class ViewTransientScopeContextImpl
[ERROR] location: class org.apache.myfaces.core.extensions.quarkus.runtime.scopes.QuarkusViewTransientScopeContext
[ERROR] <https://builds.apache.org/job/myfaces-current-master/ws/extensions/quarkus/runtime/src/main/java/org/apache/myfaces/core/extensions/quarkus/runtime/scopes/QuarkusFacesScopeContext.java>:[27,30]
cannot find symbol
[ERROR] symbol:   class FacesScopeContextImpl
[ERROR] location: package org.apache.myfaces.cdi
[ERROR] <https://builds.apache.org/job/myfaces-current-master/ws/extensions/quarkus/runtime/src/main/java/org/apache/myfaces/core/extensions/quarkus/runtime/scopes/QuarkusFacesScopeContext.java>:[34,13]
cannot find symbol
[ERROR] symbol:   class FacesScopeContextImpl
[ERROR] location: class org.apache.myfaces.core.extensions.quarkus.runtime.scopes.QuarkusFacesScopeContext
[ERROR] <https://builds.apache.org/job/myfaces-current-master/ws/extensions/quarkus/runtime/src/main/java/org/apache/myfaces/core/extensions/quarkus/runtime/scopes/QuarkusFacesScopeContext.java>:[40,12]
cannot find symbol
[ERROR] symbol:   class FacesScopeContextImpl
[ERROR] location: class org.apache.myfaces.core.extensions.quarkus.runtime.scopes.QuarkusFacesScopeContext
[ERROR] <https://builds.apache.org/job/myfaces-current-master/ws/extensions/quarkus/runtime/src/main/java/org/apache/myfaces/core/extensions/quarkus/runtime/scopes/QuarkusViewTransientScopeContext.java>:[44,27]
cannot find symbol
[ERROR] symbol:   class ViewTransientScopeContextImpl
[ERROR] location: class org.apache.myfaces.core.extensions.quarkus.runtime.scopes.QuarkusViewTransientScopeContext
[ERROR] <https://builds.apache.org/job/myfaces-current-master/ws/extensions/quarkus/runtime/src/main/java/org/apache/myfaces/core/extensions/quarkus/runtime/scopes/QuarkusFacesScopeContext.java>:[44,27]
cannot find symbol
[ERROR] symbol:   class FacesScopeContextImpl
[ERROR] location: class org.apache.myfaces.core.extensions.quarkus.runtime.scopes.QuarkusFacesScopeContext
[ERROR] -> [Help 1]
[ERROR] 
[ERROR] To see the full stack trace of the errors, re-run Maven with the -e switch.
[ERROR] Re-run Maven using the -X switch to enable full debug logging.
[ERROR] 
[ERROR] For more information about the errors and possible solutions, please read the following
articles:
[ERROR] [Help 1] http://cwiki.apache.org/confluence/display/MAVEN/MojoFailureException
[ERROR] 
[ERROR] After correcting the problems, you can resume the build with the command
[ERROR]   mvn <goals> -rf :myfaces-quarkus

[JENKINS] Archiving <https://builds.apache.org/job/myfaces-current-master/ws/api/pom.xml>
to org.apache.myfaces.core/myfaces-api/2.3-next-SNAPSHOT/myfaces-api-2.3-next-SNAPSHOT.pom
[JENKINS] Archiving <https://builds.apache.org/job/myfaces-current-master/ws/api/target/myfaces-api-2.3-next-SNAPSHOT.jar>
to org.apache.myfaces.core/myfaces-api/2.3-next-20200709.065610-342/myfaces-api-2.3-next-20200709.065610-342.jar
[JENKINS] Archiving <https://builds.apache.org/job/myfaces-current-master/ws/api/target/myfaces-api-2.3-next-SNAPSHOT-sources.jar>
to org.apache.myfaces.core/myfaces-api/2.3-next-20200709.065610-342/myfaces-api-2.3-next-20200709.065610-342-sources.jar
[JENKINS] Archiving <https://builds.apache.org/job/myfaces-current-master/ws/api/target/myfaces-api-2.3-next-SNAPSHOT-tests.jar>
to org.apache.myfaces.core/myfaces-api/2.3-next-20200709.065610-342/myfaces-api-2.3-next-20200709.065610-342-tests.jar
[JENKINS] Archiving <https://builds.apache.org/job/myfaces-current-master/ws/extensions/quarkus/runtime/pom.xml>
to org.apache.myfaces.core.extensions.quarkus/myfaces-quarkus/2.3-next-SNAPSHOT/myfaces-quarkus-2.3-next-SNAPSHOT.pom
[JENKINS] Archiving <https://builds.apache.org/job/myfaces-current-master/ws/test/pom.xml>
to org.apache.myfaces.core/myfaces-test/2.3-next-SNAPSHOT/myfaces-test-2.3-next-SNAPSHOT.pom
[JENKINS] Archiving <https://builds.apache.org/job/myfaces-current-master/ws/test/target/myfaces-test-2.3-next-SNAPSHOT.jar>
to org.apache.myfaces.core/myfaces-test/2.3-next-20200709.065642-342/myfaces-test-2.3-next-20200709.065642-342.jar
[JENKINS] Archiving <https://builds.apache.org/job/myfaces-current-master/ws/test/target/myfaces-test-2.3-next-SNAPSHOT-sources.jar>
to org.apache.myfaces.core/myfaces-test/2.3-next-20200709.065642-342/myfaces-test-2.3-next-20200709.065642-342-sources.jar
[JENKINS] Archiving <https://builds.apache.org/job/myfaces-current-master/ws/extensions/pom.xml>
to org.apache.myfaces.core/myfaces-extensions/2.3-next-SNAPSHOT/myfaces-extensions-2.3-next-SNAPSHOT.pom
[JENKINS] Archiving <https://builds.apache.org/job/myfaces-current-master/ws/extensions/quarkus/pom.xml>
to org.apache.myfaces.core.extensions/myfaces-quarkus/2.3-next-SNAPSHOT/myfaces-quarkus-2.3-next-SNAPSHOT.pom
[JENKINS] Archiving <https://builds.apache.org/job/myfaces-current-master/ws/impl/pom.xml>
to org.apache.myfaces.core/myfaces-impl/2.3-next-SNAPSHOT/myfaces-impl-2.3-next-SNAPSHOT.pom
[JENKINS] Archiving <https://builds.apache.org/job/myfaces-current-master/ws/impl/target/myfaces-impl-2.3-next-SNAPSHOT.jar>
to org.apache.myfaces.core/myfaces-impl/2.3-next-20200709.070122-341/myfaces-impl-2.3-next-20200709.070122-341.jar
[JENKINS] Archiving <https://builds.apache.org/job/myfaces-current-master/ws/impl/target/myfaces-impl-2.3-next-SNAPSHOT-sources.jar>
to org.apache.myfaces.core/myfaces-impl/2.3-next-20200709.070122-341/myfaces-impl-2.3-next-20200709.070122-341-sources.jar
[JENKINS] Archiving <https://builds.apache.org/job/myfaces-current-master/ws/impl/target/myfaces-impl-2.3-next-SNAPSHOT-test-sources.jar>
to org.apache.myfaces.core/myfaces-impl/2.3-next-20200709.070122-341/myfaces-impl-2.3-next-20200709.070122-341-test-sources.jar
[JENKINS] Archiving <https://builds.apache.org/job/myfaces-current-master/ws/impl/target/myfaces-impl-2.3-next-SNAPSHOT-tests.jar>
to org.apache.myfaces.core/myfaces-impl/2.3-next-20200709.070122-341/myfaces-impl-2.3-next-20200709.070122-341-tests.jar
[JENKINS] Archiving <https://builds.apache.org/job/myfaces-current-master/ws/bundle/pom.xml>
to org.apache.myfaces.core/myfaces-bundle/2.3-next-SNAPSHOT/myfaces-bundle-2.3-next-SNAPSHOT.pom
[JENKINS] Archiving <https://builds.apache.org/job/myfaces-current-master/ws/bundle/target/myfaces-bundle-2.3-next-SNAPSHOT.jar>
to org.apache.myfaces.core/myfaces-bundle/2.3-next-20200709.070204-341/myfaces-bundle-2.3-next-20200709.070204-341.jar
[JENKINS] Archiving <https://builds.apache.org/job/myfaces-current-master/ws/bundle/target/myfaces-bundle-2.3-next-SNAPSHOT-sources.jar>
to org.apache.myfaces.core/myfaces-bundle/2.3-next-20200709.070204-341/myfaces-bundle-2.3-next-20200709.070204-341-sources.jar
[JENKINS] Archiving <https://builds.apache.org/job/myfaces-current-master/ws/extensions/quarkus/deployment/pom.xml>
to org.apache.myfaces.core.extensions.quarkus/myfaces-quarkus-deployment/2.3-next-SNAPSHOT/myfaces-quarkus-deployment-2.3-next-SNAPSHOT.pom
[JENKINS] Archiving <https://builds.apache.org/job/myfaces-current-master/ws/pom.xml>
to org.apache.myfaces.core/myfaces-core-module/2.3-next-SNAPSHOT/myfaces-core-module-2.3-next-SNAPSHOT.pom
[JENKINS] Archiving <https://builds.apache.org/job/myfaces-current-master/ws/parent/pom.xml>
to org.apache.myfaces.core/myfaces-core-project/2.3-next-SNAPSHOT/myfaces-core-project-2.3-next-SNAPSHOT.pom
[JENKINS] Archiving <https://builds.apache.org/job/myfaces-current-master/ws/parent/target/myfaces-core-project-2.3-next-SNAPSHOT-site.xml>
to org.apache.myfaces.core/myfaces-core-project/2.3-next-20200709.065515-367/myfaces-core-project-2.3-next-20200709.065515-367-site.xml
No mail will be sent out, as 'myfaces-current-master » Apache MyFaces Core 2.3-next - API
#545' does not have a result yet. Please make sure you set a proper result in case of pipeline/build
scripts.
Sending e-mails to: commits@myfaces.apache.org grantsmith@apache.org
No mail will be sent out, as 'myfaces-current-master » Apache MyFaces Core 2.3-next - Test
#545' does not have a result yet. Please make sure you set a proper result in case of pipeline/build
scripts.
No mail will be sent out, as 'myfaces-current-master » Apache MyFaces Core 2.3-next - Extensions
#545' does not have a result yet. Please make sure you set a proper result in case of pipeline/build
scripts.
No mail will be sent out, as 'myfaces-current-master » Apache MyFaces Core 2.3-next - Extensions
- Quarkus #545' does not have a result yet. Please make sure you set a proper result in case
of pipeline/build scripts.
No mail will be sent out, as 'myfaces-current-master » Apache MyFaces Core 2.3-next - Impl
#545' does not have a result yet. Please make sure you set a proper result in case of pipeline/build
scripts.
No mail will be sent out, as 'myfaces-current-master » Apache MyFaces Core 2.3-next - OSGi
Bundle #545' does not have a result yet. Please make sure you set a proper result in case
of pipeline/build scripts.
No mail will be sent out, as 'myfaces-current-master » Apache MyFaces Core 2.3-next - Extensions
- Quarkus - Deployment #545' does not have a result yet. Please make sure you set a proper
result in case of pipeline/build scripts.
No mail will be sent out, as 'myfaces-current-master » Apache MyFaces Core 2.3-next #545'
does not have a result yet. Please make sure you set a proper result in case of pipeline/build
scripts.
No mail will be sent out, as 'myfaces-current-master » Apache MyFaces Core 2.3-next - Parent
#545' does not have a result yet. Please make sure you set a proper result in case of pipeline/build
scripts.
channel stopped

Mime
View raw message