nutch-dev mailing list archives

Site index · List index
Message view « Date » · « Thread »
Top « Date » · « Thread »
From Apache Hudson Server <hud...@hudson.zones.apache.org>
Subject Build failed in Hudson: Nutch-trunk #373
Date Wed, 27 Feb 2008 04:10:54 GMT
See http://hudson.zones.apache.org/hudson/job/Nutch-trunk/373/changes

------------------------------------------
[...truncated 4603 lines...]

copy-generated-lib:
     [copy] Copying 1 file to http://hudson.zones.apache.org/hudson/job/Nutch-trunk/ws/trunk/build/plugins/urlfilter-regex


init:
    [mkdir] Created dir: http://hudson.zones.apache.org/hudson/job/Nutch-trunk/ws/trunk/build/urlfilter-suffix

    [mkdir] Created dir: http://hudson.zones.apache.org/hudson/job/Nutch-trunk/ws/trunk/build/urlfilter-suffix/classes

    [mkdir] Created dir: http://hudson.zones.apache.org/hudson/job/Nutch-trunk/ws/trunk/build/urlfilter-suffix/test


init-plugin:

deps-jar:

compile:
     [echo] Compiling plugin: urlfilter-suffix
    [javac] Compiling 1 source file to http://hudson.zones.apache.org/hudson/job/Nutch-trunk/ws/trunk/build/urlfilter-suffix/classes

    [javac] Note: http://hudson.zones.apache.org/hudson/job/Nutch-trunk/ws/trunk/src/plugin/urlfilter-suffix/src/java/org/apache/nutch/urlfilter/suffix/SuffixURLFilter.java
 uses unchecked or unsafe operations.
    [javac] Note: Recompile with -Xlint:unchecked for details.

jar:
      [jar] Building jar: http://hudson.zones.apache.org/hudson/job/Nutch-trunk/ws/trunk/build/urlfilter-suffix/urlfilter-suffix.jar


deps-test:

deploy:
    [mkdir] Created dir: http://hudson.zones.apache.org/hudson/job/Nutch-trunk/ws/trunk/build/plugins/urlfilter-suffix

     [copy] Copying 1 file to http://hudson.zones.apache.org/hudson/job/Nutch-trunk/ws/trunk/build/plugins/urlfilter-suffix


copy-generated-lib:
     [copy] Copying 1 file to http://hudson.zones.apache.org/hudson/job/Nutch-trunk/ws/trunk/build/plugins/urlfilter-suffix


init:
    [mkdir] Created dir: http://hudson.zones.apache.org/hudson/job/Nutch-trunk/ws/trunk/build/urlfilter-validator

    [mkdir] Created dir: http://hudson.zones.apache.org/hudson/job/Nutch-trunk/ws/trunk/build/urlfilter-validator/classes

    [mkdir] Created dir: http://hudson.zones.apache.org/hudson/job/Nutch-trunk/ws/trunk/build/urlfilter-validator/test


init-plugin:

deps-jar:

compile:
     [echo] Compiling plugin: urlfilter-validator
    [javac] Compiling 1 source file to http://hudson.zones.apache.org/hudson/job/Nutch-trunk/ws/trunk/build/urlfilter-validator/classes


jar:
      [jar] Building jar: http://hudson.zones.apache.org/hudson/job/Nutch-trunk/ws/trunk/build/urlfilter-validator/urlfilter-validator.jar


deps-test:

deploy:
    [mkdir] Created dir: http://hudson.zones.apache.org/hudson/job/Nutch-trunk/ws/trunk/build/plugins/urlfilter-validator

     [copy] Copying 1 file to http://hudson.zones.apache.org/hudson/job/Nutch-trunk/ws/trunk/build/plugins/urlfilter-validator


copy-generated-lib:
     [copy] Copying 1 file to http://hudson.zones.apache.org/hudson/job/Nutch-trunk/ws/trunk/build/plugins/urlfilter-validator


init:
    [mkdir] Created dir: http://hudson.zones.apache.org/hudson/job/Nutch-trunk/ws/trunk/build/urlnormalizer-basic

    [mkdir] Created dir: http://hudson.zones.apache.org/hudson/job/Nutch-trunk/ws/trunk/build/urlnormalizer-basic/classes

    [mkdir] Created dir: http://hudson.zones.apache.org/hudson/job/Nutch-trunk/ws/trunk/build/urlnormalizer-basic/test


init-plugin:

deps-jar:

compile:
     [echo] Compiling plugin: urlnormalizer-basic
    [javac] Compiling 1 source file to http://hudson.zones.apache.org/hudson/job/Nutch-trunk/ws/trunk/build/urlnormalizer-basic/classes


jar:
      [jar] Building jar: http://hudson.zones.apache.org/hudson/job/Nutch-trunk/ws/trunk/build/urlnormalizer-basic/urlnormalizer-basic.jar


deps-test:

deploy:
    [mkdir] Created dir: http://hudson.zones.apache.org/hudson/job/Nutch-trunk/ws/trunk/build/plugins/urlnormalizer-basic

     [copy] Copying 1 file to http://hudson.zones.apache.org/hudson/job/Nutch-trunk/ws/trunk/build/plugins/urlnormalizer-basic


copy-generated-lib:
     [copy] Copying 1 file to http://hudson.zones.apache.org/hudson/job/Nutch-trunk/ws/trunk/build/plugins/urlnormalizer-basic


init:
    [mkdir] Created dir: http://hudson.zones.apache.org/hudson/job/Nutch-trunk/ws/trunk/build/urlnormalizer-pass

    [mkdir] Created dir: http://hudson.zones.apache.org/hudson/job/Nutch-trunk/ws/trunk/build/urlnormalizer-pass/classes

    [mkdir] Created dir: http://hudson.zones.apache.org/hudson/job/Nutch-trunk/ws/trunk/build/urlnormalizer-pass/test


init-plugin:

deps-jar:

compile:
     [echo] Compiling plugin: urlnormalizer-pass
    [javac] Compiling 1 source file to http://hudson.zones.apache.org/hudson/job/Nutch-trunk/ws/trunk/build/urlnormalizer-pass/classes


jar:
      [jar] Building jar: http://hudson.zones.apache.org/hudson/job/Nutch-trunk/ws/trunk/build/urlnormalizer-pass/urlnormalizer-pass.jar


deps-test:

deploy:
    [mkdir] Created dir: http://hudson.zones.apache.org/hudson/job/Nutch-trunk/ws/trunk/build/plugins/urlnormalizer-pass

     [copy] Copying 1 file to http://hudson.zones.apache.org/hudson/job/Nutch-trunk/ws/trunk/build/plugins/urlnormalizer-pass


copy-generated-lib:
     [copy] Copying 1 file to http://hudson.zones.apache.org/hudson/job/Nutch-trunk/ws/trunk/build/plugins/urlnormalizer-pass

    [mkdir] Created dir: http://hudson.zones.apache.org/hudson/job/Nutch-trunk/ws/trunk/build/urlnormalizer-regex/test/data

     [copy] Copying 4 files to http://hudson.zones.apache.org/hudson/job/Nutch-trunk/ws/trunk/build/urlnormalizer-regex/test/data


init:
    [mkdir] Created dir: http://hudson.zones.apache.org/hudson/job/Nutch-trunk/ws/trunk/build/urlnormalizer-regex/classes


init-plugin:

deps-jar:

compile:
     [echo] Compiling plugin: urlnormalizer-regex
    [javac] Compiling 1 source file to http://hudson.zones.apache.org/hudson/job/Nutch-trunk/ws/trunk/build/urlnormalizer-regex/classes

    [javac] Note: http://hudson.zones.apache.org/hudson/job/Nutch-trunk/ws/trunk/src/plugin/urlnormalizer-regex/src/java/org/apache/nutch/net/urlnormalizer/regex/RegexURLNormalizer.java
 uses unchecked or unsafe operations.
    [javac] Note: Recompile with -Xlint:unchecked for details.

jar:
      [jar] Building jar: http://hudson.zones.apache.org/hudson/job/Nutch-trunk/ws/trunk/build/urlnormalizer-regex/urlnormalizer-regex.jar


deps-test:

init:

init-plugin:

compile:

jar:
      [jar] Warning: skipping jar archive http://hudson.zones.apache.org/hudson/job/Nutch-trunk/ws/trunk/build/nutch-extensionpoints/nutch-extensionpoints.jar
 because no files were included.

deps-test:

deploy:

copy-generated-lib:

deploy:
    [mkdir] Created dir: http://hudson.zones.apache.org/hudson/job/Nutch-trunk/ws/trunk/build/plugins/urlnormalizer-regex

     [copy] Copying 1 file to http://hudson.zones.apache.org/hudson/job/Nutch-trunk/ws/trunk/build/plugins/urlnormalizer-regex


copy-generated-lib:
     [copy] Copying 1 file to http://hudson.zones.apache.org/hudson/job/Nutch-trunk/ws/trunk/build/plugins/urlnormalizer-regex


compile:

compile-core-test:
    [javac] Compiling 43 source files to http://hudson.zones.apache.org/hudson/job/Nutch-trunk/ws/trunk/build/test/classes

    [javac] Note: Some input files use unchecked or unsafe operations.
    [javac] Note: Recompile with -Xlint:unchecked for details.

test-core:
    [mkdir] Created dir: http://hudson.zones.apache.org/hudson/job/Nutch-trunk/ws/trunk/build/test/data

     [copy] Copying 90 files to http://hudson.zones.apache.org/hudson/job/Nutch-trunk/ws/trunk/build/test/data

     [copy] Copying 1 file to http://hudson.zones.apache.org/hudson/job/Nutch-trunk/ws/trunk/build/test/classes

     [copy] Copying 1 file to http://hudson.zones.apache.org/hudson/job/Nutch-trunk/ws/trunk/build/test/classes

    [junit] Running org.apache.nutch.analysis.TestAnalyzerFactory
    [junit] Tests run: 4, Failures: 0, Errors: 0, Time elapsed: 2.129 sec
    [junit] Running org.apache.nutch.analysis.TestQueryParser
    [junit] Tests run: 1, Failures: 0, Errors: 0, Time elapsed: 0.908 sec
    [junit] Running org.apache.nutch.clustering.TestOnlineClustererFactory
    [junit] Tests run: 1, Failures: 0, Errors: 0, Time elapsed: 1.144 sec
    [junit] Running org.apache.nutch.crawl.TestCrawlDbMerger
    [junit] Tests run: 1, Failures: 0, Errors: 1, Time elapsed: 2.489 sec
    [junit] Test org.apache.nutch.crawl.TestCrawlDbMerger FAILED
    [junit] Running org.apache.nutch.crawl.TestGenerator
    [junit] Tests run: 4, Failures: 0, Errors: 4, Time elapsed: 5.485 sec
    [junit] Test org.apache.nutch.crawl.TestGenerator FAILED
    [junit] Running org.apache.nutch.crawl.TestInjector
    [junit] Tests run: 1, Failures: 0, Errors: 1, Time elapsed: 0.716 sec
    [junit] Test org.apache.nutch.crawl.TestInjector FAILED
    [junit] Running org.apache.nutch.crawl.TestLinkDbMerger
    [junit] Tests run: 1, Failures: 0, Errors: 1, Time elapsed: 1.228 sec
    [junit] Test org.apache.nutch.crawl.TestLinkDbMerger FAILED
    [junit] Running org.apache.nutch.crawl.TestMapWritable
    [junit] Tests run: 5, Failures: 0, Errors: 0, Time elapsed: 64.791 sec
    [junit] Running org.apache.nutch.crawl.TestSignatureFactory
    [junit] Tests run: 1, Failures: 0, Errors: 0, Time elapsed: 0.589 sec
    [junit] Running org.apache.nutch.fetcher.TestFetcher
    [junit] Tests run: 1, Failures: 0, Errors: 1, Time elapsed: 0.958 sec
    [junit] Test org.apache.nutch.fetcher.TestFetcher FAILED
    [junit] Running org.apache.nutch.indexer.TestDeleteDuplicates
    [junit] Tests run: 4, Failures: 0, Errors: 4, Time elapsed: 1.817 sec
    [junit] Test org.apache.nutch.indexer.TestDeleteDuplicates FAILED
    [junit] Running org.apache.nutch.indexer.TestIndexingFilters
    [junit] Tests run: 1, Failures: 0, Errors: 0, Time elapsed: 3.03 sec
    [junit] Running org.apache.nutch.metadata.TestMetadata
    [junit] Tests run: 10, Failures: 0, Errors: 0, Time elapsed: 0.465 sec
    [junit] Running org.apache.nutch.metadata.TestSpellCheckedMetadata
    [junit] Tests run: 11, Failures: 0, Errors: 0, Time elapsed: 15.731 sec
    [junit] Running org.apache.nutch.net.TestURLFilters
    [junit] Tests run: 1, Failures: 0, Errors: 0, Time elapsed: 2.825 sec
    [junit] Running org.apache.nutch.net.TestURLNormalizers
    [junit] Tests run: 1, Failures: 0, Errors: 0, Time elapsed: 1.615 sec
    [junit] Running org.apache.nutch.ontology.TestOntologyFactory
    [junit] Tests run: 1, Failures: 0, Errors: 0, Time elapsed: 2.641 sec
    [junit] Running org.apache.nutch.parse.TestOutlinkExtractor
    [junit] Tests run: 4, Failures: 0, Errors: 0, Time elapsed: 0.447 sec
    [junit] Running org.apache.nutch.parse.TestParseData
    [junit] Tests run: 2, Failures: 0, Errors: 0, Time elapsed: 0.329 sec
    [junit] Running org.apache.nutch.parse.TestParseText
    [junit] Tests run: 1, Failures: 0, Errors: 0, Time elapsed: 0.476 sec
    [junit] Running org.apache.nutch.parse.TestParserFactory
    [junit] Tests run: 2, Failures: 0, Errors: 0, Time elapsed: 1.559 sec
    [junit] Running org.apache.nutch.plugin.TestPluginSystem
    [junit] Tests run: 6, Failures: 0, Errors: 0, Time elapsed: 2.937 sec
    [junit] Running org.apache.nutch.protocol.TestContent
    [junit] Tests run: 2, Failures: 0, Errors: 0, Time elapsed: 0.895 sec
    [junit] Running org.apache.nutch.protocol.TestProtocolFactory
    [junit] Tests run: 2, Failures: 0, Errors: 0, Time elapsed: 1.965 sec
    [junit] Running org.apache.nutch.searcher.TestDistributedSearch
    [junit] Tests run: 2, Failures: 0, Errors: 0, Time elapsed: 4.516 sec
    [junit] Running org.apache.nutch.searcher.TestHitDetails
    [junit] Tests run: 1, Failures: 0, Errors: 0, Time elapsed: 0.431 sec
    [junit] Running org.apache.nutch.searcher.TestOpenSearchServlet
    [junit] Tests run: 1, Failures: 0, Errors: 0, Time elapsed: 0.399 sec
    [junit] Running org.apache.nutch.searcher.TestQuery
    [junit] Tests run: 6, Failures: 0, Errors: 0, Time elapsed: 1.126 sec
    [junit] Running org.apache.nutch.searcher.TestSummarizerFactory
    [junit] Tests run: 1, Failures: 0, Errors: 0, Time elapsed: 0.972 sec
    [junit] Running org.apache.nutch.searcher.TestSummary
    [junit] Tests run: 8, Failures: 0, Errors: 0, Time elapsed: 0.446 sec
    [junit] Running org.apache.nutch.util.TestEncodingDetector
    [junit] Tests run: 1, Failures: 0, Errors: 0, Time elapsed: 1.002 sec
    [junit] Running org.apache.nutch.util.TestGZIPUtils
    [junit] Tests run: 4, Failures: 0, Errors: 0, Time elapsed: 1.794 sec
    [junit] Running org.apache.nutch.util.TestNodeWalker
    [junit] Tests run: 1, Failures: 0, Errors: 0, Time elapsed: 2.02 sec
    [junit] Running org.apache.nutch.util.TestPrefixStringMatcher
    [junit] Tests run: 1, Failures: 0, Errors: 0, Time elapsed: 0.431 sec
    [junit] Running org.apache.nutch.util.TestStringUtil
    [junit] Tests run: 2, Failures: 0, Errors: 0, Time elapsed: 0.326 sec
    [junit] Running org.apache.nutch.util.TestSuffixStringMatcher
    [junit] Tests run: 1, Failures: 0, Errors: 0, Time elapsed: 0.606 sec
    [junit] Running org.apache.nutch.util.TestURLUtil
    [junit] Tests run: 3, Failures: 0, Errors: 0, Time elapsed: 0.935 sec

BUILD FAILED
http://hudson.zones.apache.org/hudson/job/Nutch-trunk/ws/trunk/build.xml :298: Tests failed!

Total time: 3 minutes 56 seconds
ERROR: No artifacts found that match the file pattern "trunk/build/*.tar.gz". Configuration
error?
ERROR: 'trunk/build/*.tar.gz' doesn't match anything: 'trunk' exists but not 'trunk/build/*.tar.gz'
Publishing Javadoc
Recording test results


Mime
View raw message