nutch-dev mailing list archives

Site index · List index
Message view « Date » · « Thread »
Top « Date » · « Thread »
From Apache Jenkins Server <jenk...@builds.apache.org>
Subject Build failed in Jenkins: nutch-trunk-maven » Apache Nutch #69
Date Tue, 20 Dec 2011 11:05:21 GMT
See <https://builds.apache.org/job/nutch-trunk-maven/org.apache.nutch$nutch/69/changes>

Changes:

[markus] Renamed FetcherStatus to FetcherOutlinks for the new outlinks section of NUTCH-1184

[markus] NUTCH-1129 Add freegenerator, domainstats and crawldbscanner to log4j

[markus] NUTCH-1184 Fetcher to parse and follow Nth degree outlinks

------------------------------------------
<===[JENKINS REMOTING CAPACITY]===>   channel started
Executing Maven:  -B -f <https://builds.apache.org/job/nutch-trunk-maven/org.apache.nutch$nutch/ws/pom.xml>
install
[INFO] Scanning for projects...
[INFO] ------------------------------------------------------------------------
[INFO] Building Apache Nutch
[INFO]    task-segment: [install]
[INFO] ------------------------------------------------------------------------
[INFO] Setting property: classpath.resource.loader.class => 'org.codehaus.plexus.velocity.ContextClassLoaderResourceLoader'.
[INFO] Setting property: velocimacro.messages.on => 'false'.
[INFO] Setting property: resource.loader => 'classpath'.
[INFO] Setting property: resource.manager.logwhenfound => 'false'.
[INFO] [remote-resources:process {execution: default}]
[INFO] [resources:resources {execution: default-resources}]
[INFO] Using 'UTF-8' encoding to copy filtered resources.
[INFO] skip non existing resourceDirectory <https://builds.apache.org/job/nutch-trunk-maven/org.apache.nutch$nutch/ws/src/main/resources>
[INFO] Copying 3 resources
[INFO] [compiler:compile {execution: default-compile}]
[INFO] Compiling 170 source files to <https://builds.apache.org/job/nutch-trunk-maven/org.apache.nutch$nutch/ws/target/classes>
[INFO] -------------------------------------------------------------
[ERROR] COMPILATION ERROR : 
[INFO] -------------------------------------------------------------
[ERROR] <https://builds.apache.org/job/nutch-trunk-maven/org.apache.nutch$nutch/ws/src/java/org/apache/nutch/tools/CrawlDBScanner.java>:[34,45]
cannot find symbol
symbol  : class MapFileOutputFormat
location: package org.apache.hadoop.mapreduce.lib.output
[ERROR] <https://builds.apache.org/job/nutch-trunk-maven/org.apache.nutch$nutch/ws/src/java/org/apache/nutch/tools/CrawlDBScanner.java>:[123,31]
cannot find symbol
symbol  : class MapFileOutputFormat
location: class org.apache.nutch.tools.CrawlDBScanner
[INFO] 2 errors 
[INFO] -------------------------------------------------------------
[JENKINS] Archiving <https://builds.apache.org/job/nutch-trunk-maven/org.apache.nutch$nutch/ws/pom.xml>
to /home/hudson/hudson/jobs/nutch-trunk-maven/modules/org.apache.nutch$nutch/builds/2011-12-20_11-01-02/archive/org.apache.nutch/nutch/1.5-SNAPSHOT/nutch-1.5-SNAPSHOT.pom
[INFO] ------------------------------------------------------------------------
[ERROR] BUILD FAILURE
[INFO] ------------------------------------------------------------------------
[INFO] Compilation failure

<https://builds.apache.org/job/nutch-trunk-maven/org.apache.nutch$nutch/ws/src/java/org/apache/nutch/tools/CrawlDBScanner.java>:[34,45]
cannot find symbol
symbol  : class MapFileOutputFormat
location: package org.apache.hadoop.mapreduce.lib.output
<https://builds.apache.org/job/nutch-trunk-maven/org.apache.nutch$nutch/ws/src/java/org/apache/nutch/tools/CrawlDBScanner.java>:[123,31]
cannot find symbol
symbol  : class MapFileOutputFormat
location: class org.apache.nutch.tools.CrawlDBScanner

[INFO] ------------------------------------------------------------------------
[INFO] For more information, run Maven with the -e switch
[INFO] ------------------------------------------------------------------------
[INFO] Total time: 1 minute 5 seconds
[INFO] Finished at: Tue Dec 20 11:05:33 GMT+00:00 2011
[INFO] Final Memory: 33M/265M
[INFO] ------------------------------------------------------------------------


Mime
View raw message