nutch-dev mailing list archives

Site index · List index
Message view « Date » · « Thread »
Top « Date » · « Thread »
From Apache Jenkins Server <jenk...@builds.apache.org>
Subject Build failed in Jenkins: nutch-trunk-maven #68
Date Tue, 20 Dec 2011 05:01:10 GMT
See <https://builds.apache.org/job/nutch-trunk-maven/68/>

------------------------------------------
[...truncated 1010 lines...]
A         src/plugin/index-more/src/test/org/apache/nutch/indexer
A         src/plugin/index-more/src/test/org/apache/nutch/indexer/more
AU        src/plugin/index-more/src/test/org/apache/nutch/indexer/more/TestMoreIndexingFilter.java
A         src/plugin/index-more/src/java
A         src/plugin/index-more/src/java/org
A         src/plugin/index-more/src/java/org/apache
A         src/plugin/index-more/src/java/org/apache/nutch
A         src/plugin/index-more/src/java/org/apache/nutch/indexer
A         src/plugin/index-more/src/java/org/apache/nutch/indexer/more
AU        src/plugin/index-more/src/java/org/apache/nutch/indexer/more/MoreIndexingFilter.java
AU        src/plugin/index-more/src/java/org/apache/nutch/indexer/more/package.html
AU        src/plugin/index-more/plugin.xml
AU        src/plugin/index-more/build.xml
AU        src/plugin/plugin.dtd
A         src/plugin/parse-ext
A         src/plugin/parse-ext/ivy.xml
A         src/plugin/parse-ext/src
A         src/plugin/parse-ext/src/test
A         src/plugin/parse-ext/src/test/org
A         src/plugin/parse-ext/src/test/org/apache
A         src/plugin/parse-ext/src/test/org/apache/nutch
A         src/plugin/parse-ext/src/test/org/apache/nutch/parse
A         src/plugin/parse-ext/src/test/org/apache/nutch/parse/ext
AU        src/plugin/parse-ext/src/test/org/apache/nutch/parse/ext/TestExtParser.java
A         src/plugin/parse-ext/src/java
A         src/plugin/parse-ext/src/java/org
A         src/plugin/parse-ext/src/java/org/apache
A         src/plugin/parse-ext/src/java/org/apache/nutch
A         src/plugin/parse-ext/src/java/org/apache/nutch/parse
A         src/plugin/parse-ext/src/java/org/apache/nutch/parse/ext
AU        src/plugin/parse-ext/src/java/org/apache/nutch/parse/ext/ExtParser.java
AU        src/plugin/parse-ext/plugin.xml
AU        src/plugin/parse-ext/build.xml
A         src/plugin/parse-ext/command
A         src/plugin/urlnormalizer-pass
A         src/plugin/urlnormalizer-pass/ivy.xml
A         src/plugin/urlnormalizer-pass/src
A         src/plugin/urlnormalizer-pass/src/test
A         src/plugin/urlnormalizer-pass/src/test/org
A         src/plugin/urlnormalizer-pass/src/test/org/apache
A         src/plugin/urlnormalizer-pass/src/test/org/apache/nutch
A         src/plugin/urlnormalizer-pass/src/test/org/apache/nutch/net
A         src/plugin/urlnormalizer-pass/src/test/org/apache/nutch/net/urlnormalizer
A         src/plugin/urlnormalizer-pass/src/test/org/apache/nutch/net/urlnormalizer/pass
AU        src/plugin/urlnormalizer-pass/src/test/org/apache/nutch/net/urlnormalizer/pass/TestPassURLNormalizer.java
A         src/plugin/urlnormalizer-pass/src/java
A         src/plugin/urlnormalizer-pass/src/java/org
A         src/plugin/urlnormalizer-pass/src/java/org/apache
A         src/plugin/urlnormalizer-pass/src/java/org/apache/nutch
A         src/plugin/urlnormalizer-pass/src/java/org/apache/nutch/net
A         src/plugin/urlnormalizer-pass/src/java/org/apache/nutch/net/urlnormalizer
A         src/plugin/urlnormalizer-pass/src/java/org/apache/nutch/net/urlnormalizer/pass
AU        src/plugin/urlnormalizer-pass/src/java/org/apache/nutch/net/urlnormalizer/pass/PassURLNormalizer.java
AU        src/plugin/urlnormalizer-pass/plugin.xml
AU        src/plugin/urlnormalizer-pass/build.xml
A         src/plugin/parse-html
A         src/plugin/parse-html/ivy.xml
A         src/plugin/parse-html/src
A         src/plugin/parse-html/src/test
A         src/plugin/parse-html/src/test/org
A         src/plugin/parse-html/src/test/org/apache
A         src/plugin/parse-html/src/test/org/apache/nutch
A         src/plugin/parse-html/src/test/org/apache/nutch/parse
A         src/plugin/parse-html/src/test/org/apache/nutch/parse/html
A         src/plugin/parse-html/src/test/org/apache/nutch/parse/html/TestRobotsMetaProcessor.java
A         src/plugin/parse-html/src/test/org/apache/nutch/parse/html/TestDOMContentUtils.java
A         src/plugin/parse-html/src/java
A         src/plugin/parse-html/src/java/org
A         src/plugin/parse-html/src/java/org/apache
A         src/plugin/parse-html/src/java/org/apache/nutch
A         src/plugin/parse-html/src/java/org/apache/nutch/parse
A         src/plugin/parse-html/src/java/org/apache/nutch/parse/html
A         src/plugin/parse-html/src/java/org/apache/nutch/parse/html/HtmlParser.java
A         src/plugin/parse-html/src/java/org/apache/nutch/parse/html/XMLCharacterRecognizer.java
A         src/plugin/parse-html/src/java/org/apache/nutch/parse/html/DOMBuilder.java
A         src/plugin/parse-html/src/java/org/apache/nutch/parse/html/DOMContentUtils.java
A         src/plugin/parse-html/src/java/org/apache/nutch/parse/html/HTMLMetaProcessor.java
A         src/plugin/parse-html/src/java/org/apache/nutch/parse/html/package.html
AU        src/plugin/parse-html/plugin.xml
AU        src/plugin/parse-html/build.xml
A         src/plugin/urlfilter-domain
A         src/plugin/urlfilter-domain/ivy.xml
A         src/plugin/urlfilter-domain/src
A         src/plugin/urlfilter-domain/src/test
A         src/plugin/urlfilter-domain/src/test/org
A         src/plugin/urlfilter-domain/src/test/org/apache
A         src/plugin/urlfilter-domain/src/test/org/apache/nutch
A         src/plugin/urlfilter-domain/src/test/org/apache/nutch/urlfilter
A         src/plugin/urlfilter-domain/src/test/org/apache/nutch/urlfilter/domain
AU        src/plugin/urlfilter-domain/src/test/org/apache/nutch/urlfilter/domain/TestDomainURLFilter.java
A         src/plugin/urlfilter-domain/src/java
A         src/plugin/urlfilter-domain/src/java/org
A         src/plugin/urlfilter-domain/src/java/org/apache
A         src/plugin/urlfilter-domain/src/java/org/apache/nutch
A         src/plugin/urlfilter-domain/src/java/org/apache/nutch/urlfilter
A         src/plugin/urlfilter-domain/src/java/org/apache/nutch/urlfilter/domain
AU        src/plugin/urlfilter-domain/src/java/org/apache/nutch/urlfilter/domain/DomainURLFilter.java
AU        src/plugin/urlfilter-domain/src/java/org/apache/nutch/urlfilter/domain/package.html
A         src/plugin/urlfilter-domain/data
AU        src/plugin/urlfilter-domain/data/hosts.txt
AU        src/plugin/urlfilter-domain/plugin.xml
AU        src/plugin/urlfilter-domain/build.xml
A         src/plugin/protocol-httpclient
A         src/plugin/protocol-httpclient/ivy.xml
A         src/plugin/protocol-httpclient/src
A         src/plugin/protocol-httpclient/src/test
A         src/plugin/protocol-httpclient/src/test/conf
AU        src/plugin/protocol-httpclient/src/test/conf/nutch-site-test.xml
AU        src/plugin/protocol-httpclient/src/test/conf/httpclient-auth-test.xml
A         src/plugin/protocol-httpclient/src/test/org
A         src/plugin/protocol-httpclient/src/test/org/apache
A         src/plugin/protocol-httpclient/src/test/org/apache/nutch
A         src/plugin/protocol-httpclient/src/test/org/apache/nutch/protocol
A         src/plugin/protocol-httpclient/src/test/org/apache/nutch/protocol/httpclient
AU        src/plugin/protocol-httpclient/src/test/org/apache/nutch/protocol/httpclient/TestProtocolHttpClient.java
A         src/plugin/protocol-httpclient/src/java
A         src/plugin/protocol-httpclient/src/java/org
A         src/plugin/protocol-httpclient/src/java/org/apache
A         src/plugin/protocol-httpclient/src/java/org/apache/nutch
A         src/plugin/protocol-httpclient/src/java/org/apache/nutch/protocol
A         src/plugin/protocol-httpclient/src/java/org/apache/nutch/protocol/httpclient
AU        src/plugin/protocol-httpclient/src/java/org/apache/nutch/protocol/httpclient/Http.java
AU        src/plugin/protocol-httpclient/src/java/org/apache/nutch/protocol/httpclient/HttpAuthentication.java
AU        src/plugin/protocol-httpclient/src/java/org/apache/nutch/protocol/httpclient/DummySSLProtocolSocketFactory.java
AU        src/plugin/protocol-httpclient/src/java/org/apache/nutch/protocol/httpclient/HttpBasicAuthentication.java
AU        src/plugin/protocol-httpclient/src/java/org/apache/nutch/protocol/httpclient/HttpAuthenticationFactory.java
AU        src/plugin/protocol-httpclient/src/java/org/apache/nutch/protocol/httpclient/DummyX509TrustManager.java
AU        src/plugin/protocol-httpclient/src/java/org/apache/nutch/protocol/httpclient/HttpAuthenticationException.java
AU        src/plugin/protocol-httpclient/src/java/org/apache/nutch/protocol/httpclient/HttpResponse.java
AU        src/plugin/protocol-httpclient/src/java/org/apache/nutch/protocol/httpclient/package.html
A         src/plugin/protocol-httpclient/jsp
AU        src/plugin/protocol-httpclient/jsp/ntlm.jsp
AU        src/plugin/protocol-httpclient/jsp/cookies.jsp
AU        src/plugin/protocol-httpclient/jsp/noauth.jsp
AU        src/plugin/protocol-httpclient/jsp/digest.jsp
AU        src/plugin/protocol-httpclient/jsp/basic.jsp
AU        src/plugin/protocol-httpclient/plugin.xml
AU        src/plugin/protocol-httpclient/build.xml
A         src/plugin/protocol-http
A         src/plugin/protocol-http/ivy.xml
A         src/plugin/protocol-http/src
A         src/plugin/protocol-http/src/test
A         src/plugin/protocol-http/src/test/org
A         src/plugin/protocol-http/src/test/org/apache
A         src/plugin/protocol-http/src/test/org/apache/nutch
A         src/plugin/protocol-http/src/test/org/apache/nutch/protocol
A         src/plugin/protocol-http/src/test/org/apache/nutch/protocol/http
A         src/plugin/protocol-http/src/java
A         src/plugin/protocol-http/src/java/org
A         src/plugin/protocol-http/src/java/org/apache
A         src/plugin/protocol-http/src/java/org/apache/nutch
A         src/plugin/protocol-http/src/java/org/apache/nutch/protocol
A         src/plugin/protocol-http/src/java/org/apache/nutch/protocol/http
AU        src/plugin/protocol-http/src/java/org/apache/nutch/protocol/http/Http.java
AU        src/plugin/protocol-http/src/java/org/apache/nutch/protocol/http/HttpResponse.java
AU        src/plugin/protocol-http/src/java/org/apache/nutch/protocol/http/package.html
AU        src/plugin/protocol-http/plugin.xml
AU        src/plugin/protocol-http/build.xml
A         pom.xml
A         KEYS
AU        README.txt
AU        build.xml
 U        .
At revision 1221100
no change for https://svn.apache.org/repos/asf/nutch/trunk since the previous build
Parsing POMs
[trunk] $ /home/hudson/tools/java/latest1.6/bin/java -cp /home/jenkins/jenkins-slave/maven3-agent.jar:/home/hudson/tools/maven/latest/boot/plexus-classworlds-2.4.jar
org.jvnet.hudson.maven3.agent.Maven3Main /home/hudson/tools/maven/latest /home/jenkins/jenkins-slave/slave.jar
/home/jenkins/jenkins-slave/maven3-interceptor.jar 37982
<===[JENKINS REMOTING CAPACITY]===>channel started
   Executing Maven:  -B -f <https://builds.apache.org/job/nutch-trunk-maven/ws/trunk/pom.xml>
install
[INFO] Scanning for projects...
[INFO]                                                                         
[INFO] ------------------------------------------------------------------------
[INFO] Building Apache Nutch 1.5-SNAPSHOT
[INFO] ------------------------------------------------------------------------
[INFO] 
[INFO] --- maven-remote-resources-plugin:1.1:process (default) @ nutch ---
[INFO] Setting property: classpath.resource.loader.class => 'org.codehaus.plexus.velocity.ContextClassLoaderResourceLoader'.
[INFO] Setting property: velocimacro.messages.on => 'false'.
[INFO] Setting property: resource.loader => 'classpath'.
[INFO] Setting property: resource.manager.logwhenfound => 'false'.
[INFO] 
[INFO] --- maven-resources-plugin:2.4.3:resources (default-resources) @ nutch ---
[INFO] Using 'UTF-8' encoding to copy filtered resources.
[INFO] skip non existing resourceDirectory <https://builds.apache.org/job/nutch-trunk-maven/ws/trunk/src/main/resources>
[INFO] Copying 3 resources
[INFO] 
[INFO] --- maven-compiler-plugin:2.3.2:compile (default-compile) @ nutch ---
[INFO] Compiling 170 source files to <https://builds.apache.org/job/nutch-trunk-maven/ws/trunk/target/classes>
[INFO] -------------------------------------------------------------
[ERROR] COMPILATION ERROR : 
[INFO] -------------------------------------------------------------
[ERROR] <https://builds.apache.org/job/nutch-trunk-maven/ws/trunk/src/java/org/apache/nutch/tools/CrawlDBScanner.java>:[34,45]
cannot find symbol
symbol  : class MapFileOutputFormat
location: package org.apache.hadoop.mapreduce.lib.output
[ERROR] <https://builds.apache.org/job/nutch-trunk-maven/ws/trunk/src/java/org/apache/nutch/tools/CrawlDBScanner.java>:[123,31]
cannot find symbol
symbol  : class MapFileOutputFormat
location: class org.apache.nutch.tools.CrawlDBScanner
[INFO] 2 errors 
[INFO] -------------------------------------------------------------
[JENKINS] Archiving <https://builds.apache.org/job/nutch-trunk-maven/ws/trunk/pom.xml>
to /home/hudson/hudson/jobs/nutch-trunk-maven/modules/org.apache.nutch$nutch/builds/2011-12-20_05-00-33/archive/org.apache.nutch/nutch/1.5-SNAPSHOT/nutch-1.5-SNAPSHOT.pom
[INFO] ------------------------------------------------------------------------
[INFO] BUILD FAILURE
[INFO] ------------------------------------------------------------------------
[INFO] Total time: 20.379s
[INFO] Finished at: Tue Dec 20 05:01:08 UTC 2011
[INFO] Final Memory: 16M/109M
[INFO] ------------------------------------------------------------------------
Waiting for Jenkins to finish collecting data
mavenExecutionResult exceptions not empty
message : Failed to execute goal org.apache.maven.plugins:maven-compiler-plugin:2.3.2:compile
(default-compile) on project nutch: Compilation failure
cause : Compilation failure
Stack trace : 
org.apache.maven.lifecycle.LifecycleExecutionException: Failed to execute goal org.apache.maven.plugins:maven-compiler-plugin:2.3.2:compile
(default-compile) on project nutch: Compilation failure
	at org.apache.maven.lifecycle.internal.MojoExecutor.execute(MojoExecutor.java:213)
	at org.apache.maven.lifecycle.internal.MojoExecutor.execute(MojoExecutor.java:153)
	at org.apache.maven.lifecycle.internal.MojoExecutor.execute(MojoExecutor.java:145)
	at org.apache.maven.lifecycle.internal.LifecycleModuleBuilder.buildProject(LifecycleModuleBuilder.java:84)
	at org.apache.maven.lifecycle.internal.LifecycleModuleBuilder.buildProject(LifecycleModuleBuilder.java:59)
	at org.apache.maven.lifecycle.internal.LifecycleStarter.singleThreadedBuild(LifecycleStarter.java:183)
	at org.apache.maven.lifecycle.internal.LifecycleStarter.execute(LifecycleStarter.java:161)
	at org.apache.maven.DefaultMaven.doExecute(DefaultMaven.java:319)
	at org.apache.maven.DefaultMaven.execute(DefaultMaven.java:156)
	at org.jvnet.hudson.maven3.launcher.Maven3Launcher.main(Maven3Launcher.java:79)
	at sun.reflect.NativeMethodAccessorImpl.invoke0(Native Method)
	at sun.reflect.NativeMethodAccessorImpl.invoke(NativeMethodAccessorImpl.java:39)
	at sun.reflect.DelegatingMethodAccessorImpl.invoke(DelegatingMethodAccessorImpl.java:25)
	at java.lang.reflect.Method.invoke(Method.java:597)
	at org.codehaus.plexus.classworlds.launcher.Launcher.launchStandard(Launcher.java:329)
	at org.codehaus.plexus.classworlds.launcher.Launcher.launch(Launcher.java:239)
	at org.jvnet.hudson.maven3.agent.Maven3Main.launch(Maven3Main.java:158)
	at hudson.maven.Maven3Builder.call(Maven3Builder.java:122)
	at hudson.maven.Maven3Builder.call(Maven3Builder.java:74)
	at hudson.remoting.UserRequest.perform(UserRequest.java:118)
	at hudson.remoting.UserRequest.perform(UserRequest.java:48)
	at hudson.remoting.Request$2.run(Request.java:287)
	at java.util.concurrent.Executors$RunnableAdapter.call(Executors.java:441)
	at java.util.concurrent.FutureTask$Sync.innerRun(FutureTask.java:303)
	at java.util.concurrent.FutureTask.run(FutureTask.java:138)
	at java.util.concurrent.ThreadPoolExecutor$Worker.runTask(ThreadPoolExecutor.java:886)
	at java.util.concurrent.ThreadPoolExecutor$Worker.run(ThreadPoolExecutor.java:908)
	at java.lang.Thread.run(Thread.java:662)
Caused by: org.apache.maven.plugin.CompilationFailureException: Compilation failure
	at org.apache.maven.plugin.AbstractCompilerMojo.execute(AbstractCompilerMojo.java:656)
	at org.apache.maven.plugin.CompilerMojo.execute(CompilerMojo.java:128)
	at org.apache.maven.plugin.DefaultBuildPluginManager.executeMojo(DefaultBuildPluginManager.java:101)
	at org.apache.maven.lifecycle.internal.MojoExecutor.execute(MojoExecutor.java:209)
	... 27 more
Sending e-mails to: dev@nutch.apache.org
channel stopped


Mime
View raw message