nutch-dev mailing list archives

Site index · List index
Message view « Date » · « Thread »
Top « Date » · « Thread »
From Apache Jenkins Server <jenk...@builds.apache.org>
Subject Build failed in Jenkins: nutch-trunk-maven #337
Date Sun, 01 Jul 2012 05:31:50 GMT
See <https://builds.apache.org/job/nutch-trunk-maven/337/>

------------------------------------------
[...truncated 1140 lines...]
A         src/plugin/parse-html/src/test/org
A         src/plugin/parse-html/src/test/org/apache
A         src/plugin/parse-html/src/test/org/apache/nutch
A         src/plugin/parse-html/src/test/org/apache/nutch/parse
A         src/plugin/parse-html/src/test/org/apache/nutch/parse/html
A         src/plugin/parse-html/src/test/org/apache/nutch/parse/html/TestRobotsMetaProcessor.java
A         src/plugin/parse-html/src/test/org/apache/nutch/parse/html/TestDOMContentUtils.java
A         src/plugin/parse-html/src/java
A         src/plugin/parse-html/src/java/org
A         src/plugin/parse-html/src/java/org/apache
A         src/plugin/parse-html/src/java/org/apache/nutch
A         src/plugin/parse-html/src/java/org/apache/nutch/parse
A         src/plugin/parse-html/src/java/org/apache/nutch/parse/html
A         src/plugin/parse-html/src/java/org/apache/nutch/parse/html/HtmlParser.java
A         src/plugin/parse-html/src/java/org/apache/nutch/parse/html/XMLCharacterRecognizer.java
A         src/plugin/parse-html/src/java/org/apache/nutch/parse/html/DOMBuilder.java
A         src/plugin/parse-html/src/java/org/apache/nutch/parse/html/DOMContentUtils.java
A         src/plugin/parse-html/src/java/org/apache/nutch/parse/html/HTMLMetaProcessor.java
A         src/plugin/parse-html/src/java/org/apache/nutch/parse/html/package.html
AU        src/plugin/parse-html/plugin.xml
AU        src/plugin/parse-html/build.xml
A         src/plugin/protocol-httpclient
A         src/plugin/protocol-httpclient/ivy.xml
A         src/plugin/protocol-httpclient/src
A         src/plugin/protocol-httpclient/src/test
A         src/plugin/protocol-httpclient/src/test/conf
AU        src/plugin/protocol-httpclient/src/test/conf/nutch-site-test.xml
AU        src/plugin/protocol-httpclient/src/test/conf/httpclient-auth-test.xml
A         src/plugin/protocol-httpclient/src/test/org
A         src/plugin/protocol-httpclient/src/test/org/apache
A         src/plugin/protocol-httpclient/src/test/org/apache/nutch
A         src/plugin/protocol-httpclient/src/test/org/apache/nutch/protocol
A         src/plugin/protocol-httpclient/src/test/org/apache/nutch/protocol/httpclient
AU        src/plugin/protocol-httpclient/src/test/org/apache/nutch/protocol/httpclient/TestProtocolHttpClient.java
A         src/plugin/protocol-httpclient/src/java
A         src/plugin/protocol-httpclient/src/java/org
A         src/plugin/protocol-httpclient/src/java/org/apache
A         src/plugin/protocol-httpclient/src/java/org/apache/nutch
A         src/plugin/protocol-httpclient/src/java/org/apache/nutch/protocol
A         src/plugin/protocol-httpclient/src/java/org/apache/nutch/protocol/httpclient
AU        src/plugin/protocol-httpclient/src/java/org/apache/nutch/protocol/httpclient/Http.java
AU        src/plugin/protocol-httpclient/src/java/org/apache/nutch/protocol/httpclient/HttpAuthentication.java
AU        src/plugin/protocol-httpclient/src/java/org/apache/nutch/protocol/httpclient/DummySSLProtocolSocketFactory.java
AU        src/plugin/protocol-httpclient/src/java/org/apache/nutch/protocol/httpclient/HttpBasicAuthentication.java
AU        src/plugin/protocol-httpclient/src/java/org/apache/nutch/protocol/httpclient/HttpAuthenticationFactory.java
AU        src/plugin/protocol-httpclient/src/java/org/apache/nutch/protocol/httpclient/DummyX509TrustManager.java
AU        src/plugin/protocol-httpclient/src/java/org/apache/nutch/protocol/httpclient/HttpAuthenticationException.java
AU        src/plugin/protocol-httpclient/src/java/org/apache/nutch/protocol/httpclient/HttpResponse.java
AU        src/plugin/protocol-httpclient/src/java/org/apache/nutch/protocol/httpclient/package.html
A         src/plugin/protocol-httpclient/jsp
AU        src/plugin/protocol-httpclient/jsp/ntlm.jsp
AU        src/plugin/protocol-httpclient/jsp/cookies.jsp
AU        src/plugin/protocol-httpclient/jsp/noauth.jsp
AU        src/plugin/protocol-httpclient/jsp/digest.jsp
AU        src/plugin/protocol-httpclient/jsp/basic.jsp
AU        src/plugin/protocol-httpclient/plugin.xml
AU        src/plugin/protocol-httpclient/build.xml
A         src/plugin/parse-metatags
A         src/plugin/parse-metatags/sample
A         src/plugin/parse-metatags/sample/testMetatags.html
A         src/plugin/parse-metatags/ivy.xml
A         src/plugin/parse-metatags/src
A         src/plugin/parse-metatags/src/test
A         src/plugin/parse-metatags/src/test/org
A         src/plugin/parse-metatags/src/test/org/apache
A         src/plugin/parse-metatags/src/test/org/apache/nutch
A         src/plugin/parse-metatags/src/test/org/apache/nutch/parse
A         src/plugin/parse-metatags/src/test/org/apache/nutch/parse/html
A         src/plugin/parse-metatags/src/test/org/apache/nutch/parse/html/TestMetatagParser.java
A         src/plugin/parse-metatags/src/java
A         src/plugin/parse-metatags/src/java/org
A         src/plugin/parse-metatags/src/java/org/apache
A         src/plugin/parse-metatags/src/java/org/apache/nutch
A         src/plugin/parse-metatags/src/java/org/apache/nutch/parse
A         src/plugin/parse-metatags/src/java/org/apache/nutch/parse/MetaTagsParser.java
A         src/plugin/parse-metatags/README.txt
A         src/plugin/parse-metatags/plugin.xml
A         src/plugin/parse-metatags/build.xml
A         src/plugin/urlfilter-domain
A         src/plugin/urlfilter-domain/ivy.xml
A         src/plugin/urlfilter-domain/src
A         src/plugin/urlfilter-domain/src/test
A         src/plugin/urlfilter-domain/src/test/org
A         src/plugin/urlfilter-domain/src/test/org/apache
A         src/plugin/urlfilter-domain/src/test/org/apache/nutch
A         src/plugin/urlfilter-domain/src/test/org/apache/nutch/urlfilter
A         src/plugin/urlfilter-domain/src/test/org/apache/nutch/urlfilter/domain
AU        src/plugin/urlfilter-domain/src/test/org/apache/nutch/urlfilter/domain/TestDomainURLFilter.java
A         src/plugin/urlfilter-domain/src/java
A         src/plugin/urlfilter-domain/src/java/org
A         src/plugin/urlfilter-domain/src/java/org/apache
A         src/plugin/urlfilter-domain/src/java/org/apache/nutch
A         src/plugin/urlfilter-domain/src/java/org/apache/nutch/urlfilter
A         src/plugin/urlfilter-domain/src/java/org/apache/nutch/urlfilter/domain
AU        src/plugin/urlfilter-domain/src/java/org/apache/nutch/urlfilter/domain/DomainURLFilter.java
AU        src/plugin/urlfilter-domain/src/java/org/apache/nutch/urlfilter/domain/package.html
A         src/plugin/urlfilter-domain/data
AU        src/plugin/urlfilter-domain/data/hosts.txt
AU        src/plugin/urlfilter-domain/plugin.xml
AU        src/plugin/urlfilter-domain/build.xml
A         src/plugin/protocol-http
A         src/plugin/protocol-http/ivy.xml
A         src/plugin/protocol-http/src
A         src/plugin/protocol-http/src/test
A         src/plugin/protocol-http/src/test/org
A         src/plugin/protocol-http/src/test/org/apache
A         src/plugin/protocol-http/src/test/org/apache/nutch
A         src/plugin/protocol-http/src/test/org/apache/nutch/protocol
A         src/plugin/protocol-http/src/test/org/apache/nutch/protocol/http
A         src/plugin/protocol-http/src/java
A         src/plugin/protocol-http/src/java/org
A         src/plugin/protocol-http/src/java/org/apache
A         src/plugin/protocol-http/src/java/org/apache/nutch
A         src/plugin/protocol-http/src/java/org/apache/nutch/protocol
A         src/plugin/protocol-http/src/java/org/apache/nutch/protocol/http
AU        src/plugin/protocol-http/src/java/org/apache/nutch/protocol/http/Http.java
AU        src/plugin/protocol-http/src/java/org/apache/nutch/protocol/http/HttpResponse.java
AU        src/plugin/protocol-http/src/java/org/apache/nutch/protocol/http/package.html
AU        src/plugin/protocol-http/plugin.xml
AU        src/plugin/protocol-http/build.xml
A         pom.xml
A         KEYS
AU        README.txt
AU        build.xml
 U        .
At revision 1355849
no revision recorded for https://svn.apache.org/repos/asf/nutch/trunk in the previous build
Parsing POMs
[trunk] $ /home/hudson/tools/java/latest1.6/bin/java -cp /home/hudson/hudson-slave/maven3-agent.jar:/home/hudson/tools/maven/latest/boot/plexus-classworlds-2.4.jar
org.jvnet.hudson.maven3.agent.Maven3Main /home/hudson/tools/maven/latest /home/hudson/hudson-slave/slave.jar
/home/hudson/hudson-slave/maven3-interceptor.jar 43507
<===[JENKINS REMOTING CAPACITY]===>channel started
   log4j:WARN No appenders could be found for logger (org.apache.commons.beanutils.converters.BooleanConverter).
log4j:WARN Please initialize the log4j system properly.
Executing Maven:  -B -f <https://builds.apache.org/job/nutch-trunk-maven/ws/trunk/pom.xml>
-Dmaven.repo.local=/home/hudson/hudson-slave/maven-repositories/1 install
[INFO] Scanning for projects...
Projects to build: [MavenProject: org.apache.nutch:nutch:1.6-SNAPSHOT @ <https://builds.apache.org/job/nutch-trunk-maven/ws/trunk/pom.xml]>
projectStarted org.apache.nutch:nutch:1.6-SNAPSHOT
[INFO]                                                                         
[INFO] ------------------------------------------------------------------------
[INFO] Building Apache Nutch 1.6-SNAPSHOT
[INFO] ------------------------------------------------------------------------
Downloading: http://repository.apache.org/snapshots/org/apache/hadoop/hadoop-common/0.22.0-SNAPSHOT/maven-metadata.xml
[WARNING] Could not transfer metadata org.apache.hadoop:hadoop-common:0.22.0-SNAPSHOT/maven-metadata.xml
from/to Nexus (http://repository.apache.org/snapshots): Error transferring file: Server returned
HTTP response code: 503 for URL: http://repository.apache.org/snapshots/org/apache/hadoop/hadoop-common/0.22.0-SNAPSHOT/maven-metadata.xml
Downloading: http://repository.apache.org/snapshots/org/apache/hadoop/hadoop-common/0.22.0-SNAPSHOT/maven-metadata.xml
[WARNING] Could not transfer metadata org.apache.hadoop:hadoop-common:0.22.0-SNAPSHOT/maven-metadata.xml
from/to Nexus (http://repository.apache.org/snapshots): Error transferring file: Server returned
HTTP response code: 503 for URL: http://repository.apache.org/snapshots/org/apache/hadoop/hadoop-common/0.22.0-SNAPSHOT/maven-metadata.xml
Downloading: http://repository.apache.org/snapshots/org/apache/hadoop/hadoop-common/0.22.0-SNAPSHOT/hadoop-common-0.22.0-SNAPSHOT.pom
Downloading: http://repository.apache.org/snapshots/org/apache/hadoop/hadoop-common/0.22.0-SNAPSHOT/hadoop-common-0.22.0-SNAPSHOT.pom
projectFailed org.apache.nutch:nutch:1.6-SNAPSHOT
sessionEnded
[INFO] ------------------------------------------------------------------------
[INFO] BUILD FAILURE
[INFO] ------------------------------------------------------------------------
[INFO] Total time: 3.777s
[INFO] Finished at: Sun Jul 01 05:31:31 UTC 2012
[INFO] Final Memory: 5M/60M
[INFO] ------------------------------------------------------------------------
Projects to build: [MavenProject: org.apache.nutch:nutch:1.6-SNAPSHOT @ <https://builds.apache.org/job/nutch-trunk-maven/ws/trunk/pom.xml]>
[JENKINS] Archiving <https://builds.apache.org/job/nutch-trunk-maven/ws/trunk/pom.xml>
to /home/hudson/hudson/jobs/nutch-trunk-maven/modules/org.apache.nutch$nutch/builds/2012-07-01_05-31-11/archive/org.apache.nutch/nutch/1.6-SNAPSHOT/nutch-1.6-SNAPSHOT.pom
Waiting for Jenkins to finish collecting data
mavenExecutionResult exceptions not empty
message : Failed to execute goal on project nutch: Could not resolve dependencies for project
org.apache.nutch:nutch:jar:1.6-SNAPSHOT: Failed to collect dependencies for [org.apache.solr:solr-solrj:jar:3.1.0
(compile?), org.slf4j:slf4j-log4j12:jar:1.5.5 (compile?), commons-lang:commons-lang:jar:2.4
(compile?), commons-collections:commons-collections:jar:3.1 (compile?), commons-httpclient:commons-httpclient:jar:3.1
(compile?), commons-codec:commons-codec:jar:1.3 (compile?), org.apache.hadoop:hadoop-common:jar:0.22.0
(compile?), org.apache.hadoop:hadoop-mapred:jar:0.22.0 (compile?), org.apache.hadoop:hadoop-hdfs:jar:0.22.0
(compile?), com.ibm.icu:icu4j:jar:4.0.1 (compile), org.apache.tika:tika-core:jar:0.10 (compile),
org.mortbay.jetty:jetty-client:jar:6.1.22 (compile), log4j:log4j:jar:1.2.15 (compile?), xerces:xercesImpl:jar:2.9.1
(compile), xerces:xmlParserAPIs:jar:2.6.2 (compile), oro:oro:jar:2.0.8 (compile), junit:junit:jar:3.8.1
(compile?), org.apache.hadoop:hadoop-common-test:jar:0.22.0 (compile?), org.mortbay.jetty:jetty:jar:6.1.22
(compile?), org.mortbay.jetty:jetty-util:jar:6.1.22 (compile?)]
cause : Could not resolve dependencies for project org.apache.nutch:nutch:jar:1.6-SNAPSHOT:
Failed to collect dependencies for [org.apache.solr:solr-solrj:jar:3.1.0 (compile?), org.slf4j:slf4j-log4j12:jar:1.5.5
(compile?), commons-lang:commons-lang:jar:2.4 (compile?), commons-collections:commons-collections:jar:3.1
(compile?), commons-httpclient:commons-httpclient:jar:3.1 (compile?), commons-codec:commons-codec:jar:1.3
(compile?), org.apache.hadoop:hadoop-common:jar:0.22.0 (compile?), org.apache.hadoop:hadoop-mapred:jar:0.22.0
(compile?), org.apache.hadoop:hadoop-hdfs:jar:0.22.0 (compile?), com.ibm.icu:icu4j:jar:4.0.1
(compile), org.apache.tika:tika-core:jar:0.10 (compile), org.mortbay.jetty:jetty-client:jar:6.1.22
(compile), log4j:log4j:jar:1.2.15 (compile?), xerces:xercesImpl:jar:2.9.1 (compile), xerces:xmlParserAPIs:jar:2.6.2
(compile), oro:oro:jar:2.0.8 (compile), junit:junit:jar:3.8.1 (compile?), org.apache.hadoop:hadoop-common-test:jar:0.22.0
(compile?), org.mortbay.jetty:jetty:jar:6.1.22 (compile?), org.mortbay.jetty:jetty-util:jar:6.1.22
(compile?)]
Stack trace : 
org.apache.maven.lifecycle.LifecycleExecutionException: Failed to execute goal on project
nutch: Could not resolve dependencies for project org.apache.nutch:nutch:jar:1.6-SNAPSHOT:
Failed to collect dependencies for [org.apache.solr:solr-solrj:jar:3.1.0 (compile?), org.slf4j:slf4j-log4j12:jar:1.5.5
(compile?), commons-lang:commons-lang:jar:2.4 (compile?), commons-collections:commons-collections:jar:3.1
(compile?), commons-httpclient:commons-httpclient:jar:3.1 (compile?), commons-codec:commons-codec:jar:1.3
(compile?), org.apache.hadoop:hadoop-common:jar:0.22.0 (compile?), org.apache.hadoop:hadoop-mapred:jar:0.22.0
(compile?), org.apache.hadoop:hadoop-hdfs:jar:0.22.0 (compile?), com.ibm.icu:icu4j:jar:4.0.1
(compile), org.apache.tika:tika-core:jar:0.10 (compile), org.mortbay.jetty:jetty-client:jar:6.1.22
(compile), log4j:log4j:jar:1.2.15 (compile?), xerces:xercesImpl:jar:2.9.1 (compile), xerces:xmlParserAPIs:jar:2.6.2
(compile), oro:oro:jar:2.0.8 (compile), junit:junit:jar:3.8.1 (compile?), org.apache.hadoop:hadoop-common-test:jar:0.22.0
(compile?), org.mortbay.jetty:jetty:jar:6.1.22 (compile?), org.mortbay.jetty:jetty-util:jar:6.1.22
(compile?)]
	at org.apache.maven.lifecycle.internal.LifecycleDependencyResolver.getDependencies(LifecycleDependencyResolver.java:196)
	at org.apache.maven.lifecycle.internal.LifecycleDependencyResolver.resolveProjectDependencies(LifecycleDependencyResolver.java:108)
	at org.apache.maven.lifecycle.internal.MojoExecutor.ensureDependenciesAreResolved(MojoExecutor.java:258)
	at org.apache.maven.lifecycle.internal.MojoExecutor.execute(MojoExecutor.java:201)
	at org.apache.maven.lifecycle.internal.MojoExecutor.execute(MojoExecutor.java:153)
	at org.apache.maven.lifecycle.internal.MojoExecutor.execute(MojoExecutor.java:145)
	at org.apache.maven.lifecycle.internal.LifecycleModuleBuilder.buildProject(LifecycleModuleBuilder.java:84)
	at org.apache.maven.lifecycle.internal.LifecycleModuleBuilder.buildProject(LifecycleModuleBuilder.java:59)
	at org.apache.maven.lifecycle.internal.LifecycleStarter.singleThreadedBuild(LifecycleStarter.java:183)
	at org.apache.maven.lifecycle.internal.LifecycleStarter.execute(LifecycleStarter.java:161)
	at org.apache.maven.DefaultMaven.doExecute(DefaultMaven.java:319)
	at org.apache.maven.DefaultMaven.execute(DefaultMaven.java:156)
	at org.jvnet.hudson.maven3.launcher.Maven3Launcher.main(Maven3Launcher.java:79)
	at sun.reflect.NativeMethodAccessorImpl.invoke0(Native Method)
	at sun.reflect.NativeMethodAccessorImpl.invoke(NativeMethodAccessorImpl.java:39)
	at sun.reflect.DelegatingMethodAccessorImpl.invoke(DelegatingMethodAccessorImpl.java:25)
	at java.lang.reflect.Method.invoke(Method.java:597)
	at org.codehaus.plexus.classworlds.launcher.Launcher.launchStandard(Launcher.java:329)
	at org.codehaus.plexus.classworlds.launcher.Launcher.launch(Launcher.java:239)
	at org.jvnet.hudson.maven3.agent.Maven3Main.launch(Maven3Main.java:158)
	at hudson.maven.Maven3Builder.call(Maven3Builder.java:98)
	at hudson.maven.Maven3Builder.call(Maven3Builder.java:64)
	at hudson.remoting.UserRequest.perform(UserRequest.java:118)
	at hudson.remoting.UserRequest.perform(UserRequest.java:48)
	at hudson.remoting.Request$2.run(Request.java:287)
	at hudson.remoting.InterceptingExecutorService$1.call(InterceptingExecutorService.java:72)
	at java.util.concurrent.FutureTask$Sync.innerRun(FutureTask.java:303)
	at java.util.concurrent.FutureTask.run(FutureTask.java:138)
	at java.util.concurrent.ThreadPoolExecutor$Worker.runTask(ThreadPoolExecutor.java:886)
	at java.util.concurrent.ThreadPoolExecutor$Worker.run(ThreadPoolExecutor.java:908)
	at java.lang.Thread.run(Thread.java:662)
Caused by: org.apache.maven.project.DependencyResolutionException: Could not resolve dependencies
for project org.apache.nutch:nutch:jar:1.6-SNAPSHOT: Failed to collect dependencies for [org.apache.solr:solr-solrj:jar:3.1.0
(compile?), org.slf4j:slf4j-log4j12:jar:1.5.5 (compile?), commons-lang:commons-lang:jar:2.4
(compile?), commons-collections:commons-collections:jar:3.1 (compile?), commons-httpclient:commons-httpclient:jar:3.1
(compile?), commons-codec:commons-codec:jar:1.3 (compile?), org.apache.hadoop:hadoop-common:jar:0.22.0
(compile?), org.apache.hadoop:hadoop-mapred:jar:0.22.0 (compile?), org.apache.hadoop:hadoop-hdfs:jar:0.22.0
(compile?), com.ibm.icu:icu4j:jar:4.0.1 (compile), org.apache.tika:tika-core:jar:0.10 (compile),
org.mortbay.jetty:jetty-client:jar:6.1.22 (compile), log4j:log4j:jar:1.2.15 (compile?), xerces:xercesImpl:jar:2.9.1
(compile), xerces:xmlParserAPIs:jar:2.6.2 (compile), oro:oro:jar:2.0.8 (compile), junit:junit:jar:3.8.1
(compile?), org.apache.hadoop:hadoop-common-test:jar:0.22.0 (compile?), org.mortbay.jetty:jetty:jar:6.1.22
(compile?), org.mortbay.jetty:jetty-util:jar:6.1.22 (compile?)]
	at org.apache.maven.project.DefaultProjectDependenciesResolver.resolve(DefaultProjectDependenciesResolver.java:139)
	at org.apache.maven.lifecycle.internal.LifecycleDependencyResolver.getDependencies(LifecycleDependencyResolver.java:171)
	... 30 more
Caused by: org.sonatype.aether.collection.DependencyCollectionException: Failed to collect
dependencies for [org.apache.solr:solr-solrj:jar:3.1.0 (compile?), org.slf4j:slf4j-log4j12:jar:1.5.5
(compile?), commons-lang:commons-lang:jar:2.4 (compile?), commons-collections:commons-collections:jar:3.1
(compile?), commons-httpclient:commons-httpclient:jar:3.1 (compile?), commons-codec:commons-codec:jar:1.3
(compile?), org.apache.hadoop:hadoop-common:jar:0.22.0 (compile?), org.apache.hadoop:hadoop-mapred:jar:0.22.0
(compile?), org.apache.hadoop:hadoop-hdfs:jar:0.22.0 (compile?), com.ibm.icu:icu4j:jar:4.0.1
(compile), org.apache.tika:tika-core:jar:0.10 (compile), org.mortbay.jetty:jetty-client:jar:6.1.22
(compile), log4j:log4j:jar:1.2.15 (compile?), xerces:xercesImpl:jar:2.9.1 (compile), xerces:xmlParserAPIs:jar:2.6.2
(compile), oro:oro:jar:2.0.8 (compile), junit:junit:jar:3.8.1 (compile?), org.apache.hadoop:hadoop-common-test:jar:0.22.0
(compile?), org.mortbay.jetty:jetty:jar:6.1.22 (compile?), org.mortbay.jetty:jetty-util:jar:6.1.22
(compile?)]
	at org.sonatype.aether.impl.internal.DefaultDependencyCollector.collectDependencies(DefaultDependencyCollector.java:262)
	at org.sonatype.aether.impl.internal.DefaultRepositorySystem.collectDependencies(DefaultRepositorySystem.java:345)
	at org.apache.maven.project.DefaultProjectDependenciesResolver.resolve(DefaultProjectDependenciesResolver.java:131)
	... 31 more
Caused by: org.sonatype.aether.resolution.ArtifactDescriptorException: Failed to read artifact
descriptor for org.apache.hadoop:hadoop-common:jar:0.22.0-SNAPSHOT
	at org.apache.maven.repository.internal.DefaultArtifactDescriptorReader.loadPom(DefaultArtifactDescriptorReader.java:282)
	at org.apache.maven.repository.internal.DefaultArtifactDescriptorReader.readArtifactDescriptor(DefaultArtifactDescriptorReader.java:172)
	at org.sonatype.aether.impl.internal.DefaultDependencyCollector.process(DefaultDependencyCollector.java:419)
	at org.sonatype.aether.impl.internal.DefaultDependencyCollector.process(DefaultDependencyCollector.java:533)
	at org.sonatype.aether.impl.internal.DefaultDependencyCollector.collectDependencies(DefaultDependencyCollector.java:243)
	... 33 more
Caused by: org.sonatype.aether.resolution.ArtifactResolutionException: Could not transfer
artifact org.apache.hadoop:hadoop-common:pom:0.22.0-SNAPSHOT from/to Nexus (http://repository.apache.org/snapshots):
Error transferring file: Server returned HTTP response code: 503 for URL: http://repository.apache.org/snapshots/org/apache/hadoop/hadoop-common/0.22.0-SNAPSHOT/hadoop-common-0.22.0-SNAPSHOT.pom
	at org.sonatype.aether.impl.internal.DefaultArtifactResolver.resolve(DefaultArtifactResolver.java:541)
	at org.sonatype.aether.impl.internal.DefaultArtifactResolver.resolveArtifacts(DefaultArtifactResolver.java:220)
	at org.sonatype.aether.impl.internal.DefaultArtifactResolver.resolveArtifact(DefaultArtifactResolver.java:197)
	at org.apache.maven.repository.internal.DefaultArtifactDescriptorReader.loadPom(DefaultArtifactDescriptorReader.java:267)
	... 37 more
Caused by: org.sonatype.aether.transfer.ArtifactTransferException: Could not transfer artifact
org.apache.hadoop:hadoop-common:pom:0.22.0-SNAPSHOT from/to Nexus (http://repository.apache.org/snapshots):
Error transferring file: Server returned HTTP response code: 503 for URL: http://repository.apache.org/snapshots/org/apache/hadoop/hadoop-common/0.22.0-SNAPSHOT/hadoop-common-0.22.0-SNAPSHOT.pom
	at org.sonatype.aether.connector.wagon.WagonRepositoryConnector$4.wrap(WagonRepositoryConnector.java:949)
	at org.sonatype.aether.connector.wagon.WagonRepositoryConnector$4.wrap(WagonRepositoryConnector.java:940)
	at org.sonatype.aether.connector.wagon.WagonRepositoryConnector$GetTask.flush(WagonRepositoryConnector.java:695)
	at org.sonatype.aether.connector.wagon.WagonRepositoryConnector$GetTask.flush(WagonRepositoryConnector.java:689)
	at org.sonatype.aether.connector.wagon.WagonRepositoryConnector.get(WagonRepositoryConnector.java:445)
	at org.sonatype.aether.impl.internal.DefaultArtifactResolver.resolve(DefaultArtifactResolver.java:460)
	... 40 more
Caused by: org.apache.maven.wagon.TransferFailedException: Error transferring file: Server
returned HTTP response code: 503 for URL: http://repository.apache.org/snapshots/org/apache/hadoop/hadoop-common/0.22.0-SNAPSHOT/hadoop-common-0.22.0-SNAPSHOT.pom
	at org.apache.maven.wagon.providers.http.LightweightHttpWagon.fillInputData(LightweightHttpWagon.java:143)
	at org.apache.maven.wagon.StreamWagon.getInputStream(StreamWagon.java:116)
	at org.apache.maven.wagon.StreamWagon.getIfNewer(StreamWagon.java:88)
	at org.apache.maven.wagon.StreamWagon.get(StreamWagon.java:61)
	at org.sonatype.aether.connector.wagon.WagonRepositoryConnector$GetTask.run(WagonRepositoryConnector.java:608)
	at org.sonatype.aether.util.concurrency.RunnableErrorForwarder$1.run(RunnableErrorForwarder.java:64)
	... 3 more
Caused by: java.io.IOException: Server returned HTTP response code: 503 for URL: http://repository.apache.org/snapshots/org/apache/hadoop/hadoop-common/0.22.0-SNAPSHOT/hadoop-common-0.22.0-SNAPSHOT.pom
	at sun.reflect.NativeConstructorAccessorImpl.newInstance0(Native Method)
	at sun.reflect.NativeConstructorAccessorImpl.newInstance(NativeConstructorAccessorImpl.java:39)
	at sun.reflect.DelegatingConstructorAccessorImpl.newInstance(DelegatingConstructorAccessorImpl.java:27)
	at java.lang.reflect.Constructor.newInstance(Constructor.java:513)
	at sun.net.www.protocol.http.HttpURLConnection$6.run(HttpURLConnection.java:1491)
	at java.security.AccessController.doPrivileged(Native Method)
	at sun.net.www.protocol.http.HttpURLConnection.getChainedException(HttpURLConnection.java:1485)
	at sun.net.www.protocol.http.HttpURLConnection.getInputStream(HttpURLConnection.java:1139)
	at org.apache.maven.wagon.providers.http.LightweightHttpWagon.fillInputData(LightweightHttpWagon.java:122)
	... 8 more
Caused by: java.io.IOException: Server returned HTTP response code: 503 for URL: http://repository.apache.org/snapshots/org/apache/hadoop/hadoop-common/0.22.0-SNAPSHOT/hadoop-common-0.22.0-SNAPSHOT.pom
	at sun.net.www.protocol.http.HttpURLConnection.getInputStream(HttpURLConnection.java:1436)
	at java.net.HttpURLConnection.getResponseCode(HttpURLConnection.java:379)
	at org.apache.maven.wagon.providers.http.LightweightHttpWagon.fillInputData(LightweightHttpWagon.java:115)
	... 8 more
channel stopped

Mime
View raw message