nutch-dev mailing list archives

Site index · List index
Message view « Date » · « Thread »
Top « Date » · « Thread »
From Apache Jenkins Server <jenk...@builds.apache.org>
Subject Build failed in Jenkins: Nutch-trunk-Windows #4
Date Thu, 17 Jan 2013 23:22:39 GMT
See <https://builds.apache.org/job/Nutch-trunk-Windows/4/changes>

Changes:

[markus] missed removal of FetcherOutput in MapWritable

[markus] Implement read/write in NutchField

[markus] Remove FetcherOutput.java

[markus] Add UPDATE action to NutchIndexAction

[snagel] NUTCH-1500 bin/crawl fails on step solrindex with wrong path to segment

[lewismc] NUTCH-1274 Fix [cast] javac warnings

------------------------------------------
[...truncated 3973 lines...]
    [javac]   where E is a type-variable:
    [javac]     E extends Object declared in interface Iterator
    [javac] <https://builds.apache.org/job/Nutch-trunk-Windows/ws/trunk\src\test\org\apache\nutch\crawl\TestCrawlDbMerger.java>:123:
warning: [deprecation] delete(Path) in FileSystem has been deprecated
    [javac]     fs.delete(testDir);
    [javac]       ^
    [javac] <https://builds.apache.org/job/Nutch-trunk-Windows/ws/trunk\src\test\org\apache\nutch\crawl\TestCrawlDbMerger.java>:126:
warning: [rawtypes] found raw type: TreeSet
    [javac]   private void createCrawlDb(Configuration config, FileSystem fs, Path crawldb,
TreeSet init, CrawlDatum cd) throws Exception {
    [javac]                                                                              
  ^
    [javac]   missing type arguments for generic class TreeSet<E>
    [javac]   where E is a type-variable:
    [javac]     E extends Object declared in class TreeSet
    [javac] <https://builds.apache.org/job/Nutch-trunk-Windows/ws/trunk\src\test\org\apache\nutch\crawl\TestCrawlDbMerger.java>:130:
warning: [rawtypes] found raw type: Iterator
    [javac]     Iterator it = init.iterator();
    [javac]     ^
    [javac]   missing type arguments for generic class Iterator<E>
    [javac]   where E is a type-variable:
    [javac]     E extends Object declared in interface Iterator
    [javac] <https://builds.apache.org/job/Nutch-trunk-Windows/ws/trunk\src\test\org\apache\nutch\crawl\TestLinkDbMerger.java>:71:
warning: [rawtypes] found raw type: TreeMap
    [javac]   TreeMap init1 = new TreeMap();
    [javac]   ^
    [javac]   missing type arguments for generic class TreeMap<K,V>
    [javac]   where K,V are type-variables:
    [javac]     K extends Object declared in class TreeMap
    [javac]     V extends Object declared in class TreeMap
    [javac] <https://builds.apache.org/job/Nutch-trunk-Windows/ws/trunk\src\test\org\apache\nutch\crawl\TestLinkDbMerger.java>:71:
warning: [rawtypes] found raw type: TreeMap
    [javac]   TreeMap init1 = new TreeMap();
    [javac]                       ^
    [javac]   missing type arguments for generic class TreeMap<K,V>
    [javac]   where K,V are type-variables:
    [javac]     K extends Object declared in class TreeMap
    [javac]     V extends Object declared in class TreeMap
    [javac] <https://builds.apache.org/job/Nutch-trunk-Windows/ws/trunk\src\test\org\apache\nutch\crawl\TestLinkDbMerger.java>:72:
warning: [rawtypes] found raw type: TreeMap
    [javac]   TreeMap init2 = new TreeMap();
    [javac]   ^
    [javac]   missing type arguments for generic class TreeMap<K,V>
    [javac]   where K,V are type-variables:
    [javac]     K extends Object declared in class TreeMap
    [javac]     V extends Object declared in class TreeMap
    [javac] <https://builds.apache.org/job/Nutch-trunk-Windows/ws/trunk\src\test\org\apache\nutch\crawl\TestLinkDbMerger.java>:72:
warning: [rawtypes] found raw type: TreeMap
    [javac]   TreeMap init2 = new TreeMap();
    [javac]                       ^
    [javac]   missing type arguments for generic class TreeMap<K,V>
    [javac]   where K,V are type-variables:
    [javac]     K extends Object declared in class TreeMap
    [javac]     V extends Object declared in class TreeMap
    [javac] <https://builds.apache.org/job/Nutch-trunk-Windows/ws/trunk\src\test\org\apache\nutch\crawl\TestLinkDbMerger.java>:73:
warning: [rawtypes] found raw type: HashMap
    [javac]   HashMap expected = new HashMap();
    [javac]   ^
    [javac]   missing type arguments for generic class HashMap<K,V>
    [javac]   where K,V are type-variables:
    [javac]     K extends Object declared in class HashMap
    [javac]     V extends Object declared in class HashMap
    [javac] <https://builds.apache.org/job/Nutch-trunk-Windows/ws/trunk\src\test\org\apache\nutch\crawl\TestLinkDbMerger.java>:73:
warning: [rawtypes] found raw type: HashMap
    [javac]   HashMap expected = new HashMap();
    [javac]                          ^
    [javac]   missing type arguments for generic class HashMap<K,V>
    [javac]   where K,V are type-variables:
    [javac]     K extends Object declared in class HashMap
    [javac]     V extends Object declared in class HashMap
    [javac] <https://builds.apache.org/job/Nutch-trunk-Windows/ws/trunk\src\test\org\apache\nutch\crawl\TestLinkDbMerger.java>:80:
warning: [unchecked] unchecked call to put(K,V) as a member of the raw type TreeMap
    [javac]     init1.put(url10, urls10);
    [javac]              ^
    [javac]   where K,V are type-variables:
    [javac]     K extends Object declared in class TreeMap
    [javac]     V extends Object declared in class TreeMap
    [javac] <https://builds.apache.org/job/Nutch-trunk-Windows/ws/trunk\src\test\org\apache\nutch\crawl\TestLinkDbMerger.java>:81:
warning: [unchecked] unchecked call to put(K,V) as a member of the raw type TreeMap
    [javac]     init1.put(url11, urls11);
    [javac]              ^
    [javac]   where K,V are type-variables:
    [javac]     K extends Object declared in class TreeMap
    [javac]     V extends Object declared in class TreeMap
    [javac] <https://builds.apache.org/job/Nutch-trunk-Windows/ws/trunk\src\test\org\apache\nutch\crawl\TestLinkDbMerger.java>:82:
warning: [unchecked] unchecked call to put(K,V) as a member of the raw type TreeMap
    [javac]     init2.put(url20, urls20);
    [javac]              ^
    [javac]   where K,V are type-variables:
    [javac]     K extends Object declared in class TreeMap
    [javac]     V extends Object declared in class TreeMap
    [javac] <https://builds.apache.org/job/Nutch-trunk-Windows/ws/trunk\src\test\org\apache\nutch\crawl\TestLinkDbMerger.java>:83:
warning: [unchecked] unchecked call to put(K,V) as a member of the raw type TreeMap
    [javac]     init2.put(url21, urls21);
    [javac]              ^
    [javac]   where K,V are type-variables:
    [javac]     K extends Object declared in class TreeMap
    [javac]     V extends Object declared in class TreeMap
    [javac] <https://builds.apache.org/job/Nutch-trunk-Windows/ws/trunk\src\test\org\apache\nutch\crawl\TestLinkDbMerger.java>:84:
warning: [unchecked] unchecked call to put(K,V) as a member of the raw type HashMap
    [javac]     expected.put(url10, urls10_expected);
    [javac]                 ^
    [javac]   where K,V are type-variables:
    [javac]     K extends Object declared in class HashMap
    [javac]     V extends Object declared in class HashMap
    [javac] <https://builds.apache.org/job/Nutch-trunk-Windows/ws/trunk\src\test\org\apache\nutch\crawl\TestLinkDbMerger.java>:85:
warning: [unchecked] unchecked call to put(K,V) as a member of the raw type HashMap
    [javac]     expected.put(url11, urls11_expected);
    [javac]                 ^
    [javac]   where K,V are type-variables:
    [javac]     K extends Object declared in class HashMap
    [javac]     V extends Object declared in class HashMap
    [javac] <https://builds.apache.org/job/Nutch-trunk-Windows/ws/trunk\src\test\org\apache\nutch\crawl\TestLinkDbMerger.java>:86:
warning: [unchecked] unchecked call to put(K,V) as a member of the raw type HashMap
    [javac]     expected.put(url20, urls20_expected);
    [javac]                 ^
    [javac]   where K,V are type-variables:
    [javac]     K extends Object declared in class HashMap
    [javac]     V extends Object declared in class HashMap
    [javac] <https://builds.apache.org/job/Nutch-trunk-Windows/ws/trunk\src\test\org\apache\nutch\crawl\TestLinkDbMerger.java>:87:
warning: [unchecked] unchecked call to put(K,V) as a member of the raw type HashMap
    [javac]     expected.put(url21, urls21_expected);
    [javac]                 ^
    [javac]   where K,V are type-variables:
    [javac]     K extends Object declared in class HashMap
    [javac]     V extends Object declared in class HashMap
    [javac] <https://builds.apache.org/job/Nutch-trunk-Windows/ws/trunk\src\test\org\apache\nutch\crawl\TestLinkDbMerger.java>:119:
warning: [rawtypes] found raw type: Iterator
    [javac]     Iterator it = expected.keySet().iterator();
    [javac]     ^
    [javac]   missing type arguments for generic class Iterator<E>
    [javac]   where E is a type-variable:
    [javac]     E extends Object declared in interface Iterator
    [javac] <https://builds.apache.org/job/Nutch-trunk-Windows/ws/trunk\src\test\org\apache\nutch\crawl\TestLinkDbMerger.java>:127:
warning: [rawtypes] found raw type: ArrayList
    [javac]       ArrayList links = new ArrayList();
    [javac]       ^
    [javac]   missing type arguments for generic class ArrayList<E>
    [javac]   where E is a type-variable:
    [javac]     E extends Object declared in class ArrayList
    [javac] <https://builds.apache.org/job/Nutch-trunk-Windows/ws/trunk\src\test\org\apache\nutch\crawl\TestLinkDbMerger.java>:127:
warning: [rawtypes] found raw type: ArrayList
    [javac]       ArrayList links = new ArrayList();
    [javac]                             ^
    [javac]   missing type arguments for generic class ArrayList<E>
    [javac]   where E is a type-variable:
    [javac]     E extends Object declared in class ArrayList
    [javac] <https://builds.apache.org/job/Nutch-trunk-Windows/ws/trunk\src\test\org\apache\nutch\crawl\TestLinkDbMerger.java>:128:
warning: [rawtypes] found raw type: Iterator
    [javac]       Iterator it2 = inlinks.iterator();
    [javac]       ^
    [javac]   missing type arguments for generic class Iterator<E>
    [javac]   where E is a type-variable:
    [javac]     E extends Object declared in interface Iterator
    [javac] <https://builds.apache.org/job/Nutch-trunk-Windows/ws/trunk\src\test\org\apache\nutch\crawl\TestLinkDbMerger.java>:131:
warning: [unchecked] unchecked call to add(E) as a member of the raw type ArrayList
    [javac]         links.add(in.getFromUrl());
    [javac]                  ^
    [javac]   where E is a type-variable:
    [javac]     E extends Object declared in class ArrayList
    [javac] <https://builds.apache.org/job/Nutch-trunk-Windows/ws/trunk\src\test\org\apache\nutch\crawl\TestLinkDbMerger.java>:142:
warning: [rawtypes] found raw type: TreeMap
    [javac]   private void createLinkDb(Configuration config, FileSystem fs, Path linkdb,
TreeMap init) throws Exception {
    [javac]                                                                              
^
    [javac]   missing type arguments for generic class TreeMap<K,V>
    [javac]   where K,V are type-variables:
    [javac]     K extends Object declared in class TreeMap
    [javac]     V extends Object declared in class TreeMap
    [javac] <https://builds.apache.org/job/Nutch-trunk-Windows/ws/trunk\src\test\org\apache\nutch\crawl\TestLinkDbMerger.java>:146:
warning: [rawtypes] found raw type: Iterator
    [javac]     Iterator it = init.keySet().iterator();
    [javac]     ^
    [javac]   missing type arguments for generic class Iterator<E>
    [javac]   where E is a type-variable:
    [javac]     E extends Object declared in interface Iterator
    [javac] <https://builds.apache.org/job/Nutch-trunk-Windows/ws/trunk\src\test\org\apache\nutch\plugin\TestPluginSystem.java>:44:
warning: [rawtypes] found raw type: LinkedList
    [javac]     private LinkedList fFolders = new LinkedList();
    [javac]             ^
    [javac]   missing type arguments for generic class LinkedList<E>
    [javac]   where E is a type-variable:
    [javac]     E extends Object declared in class LinkedList
    [javac] <https://builds.apache.org/job/Nutch-trunk-Windows/ws/trunk\src\test\org\apache\nutch\plugin\TestPluginSystem.java>:44:
warning: [rawtypes] found raw type: LinkedList
    [javac]     private LinkedList fFolders = new LinkedList();
    [javac]                                       ^
    [javac]   missing type arguments for generic class LinkedList<E>
    [javac]   where E is a type-variable:
    [javac]     E extends Object declared in class LinkedList
    [javac] <https://builds.apache.org/job/Nutch-trunk-Windows/ws/trunk\src\test\org\apache\nutch\plugin\TestPluginSystem.java>:212:
warning: [unchecked] unchecked call to add(E) as a member of the raw type LinkedList
    [javac]                 fFolders.add(file);
    [javac]                             ^
    [javac]   where E is a type-variable:
    [javac]     E extends Object declared in class LinkedList
    [javac] <https://builds.apache.org/job/Nutch-trunk-Windows/ws/trunk\src\test\org\apache\nutch\segment\TestSegmentMerger.java>:45:
warning: [deprecation] getDefaultBlockSize() in FileSystem has been deprecated
    [javac]     long blkSize = fs.getDefaultBlockSize();
    [javac]                      ^
    [javac] 46 warnings

test-core:
    [mkdir] Created dir: <https://builds.apache.org/job/Nutch-trunk-Windows/ws/trunk\build\test\data>
     [copy] Copying 90 files to <https://builds.apache.org/job/Nutch-trunk-Windows/ws/trunk\build\test\data>
     [copy] Copying 1 file to <https://builds.apache.org/job/Nutch-trunk-Windows/ws/trunk\build\test\classes>
     [copy] Copying 1 file to <https://builds.apache.org/job/Nutch-trunk-Windows/ws/trunk\build\test\classes>
     [copy] Copying 1 file to <https://builds.apache.org/job/Nutch-trunk-Windows/ws/trunk\build\test\classes>
     [copy] Copying 1 file to <https://builds.apache.org/job/Nutch-trunk-Windows/ws/trunk\build\test\classes>
     [copy] Copying 1 file to <https://builds.apache.org/job/Nutch-trunk-Windows/ws/trunk\build\test\classes>
    [junit] WARNING: multiple versions of ant detected in path for junit 
    [junit]          jar:file:/F:/hudson/tools/ant/latest/lib/ant.jar!/org/apache/tools/ant/Project.class
    [junit]      and jar:<https://builds.apache.org/job/Nutch-trunk-Windows/ws/trunk/build/lib/ant-1.6.5.jar!/org/apache/tools/ant/Project.class>
    [junit] Running org.apache.nutch.crawl.TestCrawlDbMerger
    [junit] Tests run: 1, Failures: 0, Errors: 1, Time elapsed: 2.975 sec
    [junit] Test org.apache.nutch.crawl.TestCrawlDbMerger FAILED
    [junit] Running org.apache.nutch.crawl.TestGenerator
    [junit] Tests run: 4, Failures: 0, Errors: 4, Time elapsed: 1.176 sec
    [junit] Test org.apache.nutch.crawl.TestGenerator FAILED
    [junit] Running org.apache.nutch.crawl.TestInjector
    [junit] Tests run: 1, Failures: 0, Errors: 1, Time elapsed: 0.701 sec
    [junit] Test org.apache.nutch.crawl.TestInjector FAILED
    [junit] Running org.apache.nutch.crawl.TestLinkDbMerger
    [junit] Tests run: 1, Failures: 0, Errors: 1, Time elapsed: 1.002 sec
    [junit] Test org.apache.nutch.crawl.TestLinkDbMerger FAILED
    [junit] Running org.apache.nutch.crawl.TestSignatureFactory
    [junit] Tests run: 1, Failures: 0, Errors: 0, Time elapsed: 0.339 sec
    [junit] Running org.apache.nutch.fetcher.TestFetcher
    [junit] Tests run: 2, Failures: 0, Errors: 1, Time elapsed: 1.226 sec
    [junit] Test org.apache.nutch.fetcher.TestFetcher FAILED
    [junit] Running org.apache.nutch.indexer.TestIndexingFilters
    [junit] Tests run: 1, Failures: 0, Errors: 0, Time elapsed: 1.669 sec
    [junit] Running org.apache.nutch.metadata.TestMetadata
    [junit] Tests run: 10, Failures: 0, Errors: 0, Time elapsed: 0.145 sec
    [junit] Running org.apache.nutch.metadata.TestSpellCheckedMetadata
    [junit] Tests run: 11, Failures: 0, Errors: 0, Time elapsed: 2.484 sec
    [junit] Running org.apache.nutch.net.TestURLFilters
    [junit] Tests run: 1, Failures: 0, Errors: 0, Time elapsed: 1.581 sec
    [junit] Running org.apache.nutch.net.TestURLNormalizers
    [junit] Tests run: 1, Failures: 0, Errors: 0, Time elapsed: 0.835 sec
    [junit] Running org.apache.nutch.parse.TestOutlinkExtractor
    [junit] Tests run: 4, Failures: 0, Errors: 0, Time elapsed: 0.049 sec
    [junit] Running org.apache.nutch.parse.TestParseData
    [junit] Tests run: 2, Failures: 0, Errors: 0, Time elapsed: 0.032 sec
    [junit] Running org.apache.nutch.parse.TestParseText
    [junit] Tests run: 1, Failures: 0, Errors: 0, Time elapsed: 0.129 sec
    [junit] Running org.apache.nutch.parse.TestParserFactory
    [junit] Tests run: 2, Failures: 0, Errors: 0, Time elapsed: 2.48 sec
    [junit] Running org.apache.nutch.plugin.TestPluginSystem
    [junit] Tests run: 7, Failures: 0, Errors: 0, Time elapsed: 1.989 sec
    [junit] Running org.apache.nutch.protocol.TestContent
    [junit] Tests run: 2, Failures: 0, Errors: 0, Time elapsed: 0.583 sec
    [junit] Running org.apache.nutch.protocol.TestProtocolFactory
    [junit] Tests run: 2, Failures: 0, Errors: 0, Time elapsed: 0.965 sec
    [junit] Running org.apache.nutch.segment.TestSegmentMerger
    [junit] Tests run: 1, Failures: 0, Errors: 1, Time elapsed: 42.694 sec
    [junit] Test org.apache.nutch.segment.TestSegmentMerger FAILED
    [junit] Running org.apache.nutch.util.TestEncodingDetector
    [junit] Tests run: 1, Failures: 0, Errors: 0, Time elapsed: 0.881 sec
    [junit] Running org.apache.nutch.util.TestGZIPUtils
    [junit] Tests run: 4, Failures: 0, Errors: 0, Time elapsed: 0.523 sec
    [junit] Running org.apache.nutch.util.TestNodeWalker
    [junit] Tests run: 1, Failures: 0, Errors: 0, Time elapsed: 0.296 sec
    [junit] Running org.apache.nutch.util.TestPrefixStringMatcher
    [junit] Tests run: 1, Failures: 0, Errors: 0, Time elapsed: 0.096 sec
    [junit] Running org.apache.nutch.util.TestStringUtil
    [junit] Tests run: 2, Failures: 0, Errors: 0, Time elapsed: 0.007 sec
    [junit] Running org.apache.nutch.util.TestSuffixStringMatcher
    [junit] Tests run: 1, Failures: 0, Errors: 0, Time elapsed: 0.085 sec
    [junit] Running org.apache.nutch.util.TestURLUtil
    [junit] Tests run: 5, Failures: 0, Errors: 0, Time elapsed: 0.456 sec

BUILD FAILED
<https://builds.apache.org/job/Nutch-trunk-Windows/ws/trunk\build.xml>:427: Tests failed!

Total time: 2 minutes 7 seconds
Build step 'Invoke Ant' marked build as failure
Publishing Javadoc
Updating NUTCH-1274
Updating NUTCH-1500

Mime
View raw message