nutch-dev mailing list archives

Site index · List index
Message view « Date » · « Thread »
Top « Date » · « Thread »
From Apache Jenkins Server <jenk...@builds.apache.org>
Subject Build failed in Jenkins: Nutch-nutchgora #456
Date Mon, 07 Jan 2013 04:21:21 GMT
See <https://builds.apache.org/job/Nutch-nutchgora/456/>

------------------------------------------
[...truncated 2786 lines...]
copy-generated-lib:
     [copy] Copying 1 file to /zonestorage/hudson_solaris/home/hudson/hudson-slave/workspace/Nutch-nutchgora/2.x/build/plugins/urlfilter-suffix

init:
    [mkdir] Created dir: /zonestorage/hudson_solaris/home/hudson/hudson-slave/workspace/Nutch-nutchgora/2.x/build/urlfilter-validator
    [mkdir] Created dir: /zonestorage/hudson_solaris/home/hudson/hudson-slave/workspace/Nutch-nutchgora/2.x/build/urlfilter-validator/classes
    [mkdir] Created dir: /zonestorage/hudson_solaris/home/hudson/hudson-slave/workspace/Nutch-nutchgora/2.x/build/urlfilter-validator/test
    [mkdir] Created dir: /zonestorage/hudson_solaris/home/hudson/hudson-slave/workspace/Nutch-nutchgora/2.x/build/plugins/urlfilter-validator

init-plugin:

deps-jar:

clean-lib:

resolve-default:
[ivy:resolve] :: loading settings :: file = /zonestorage/hudson_solaris/home/hudson/hudson-slave/workspace/Nutch-nutchgora/2.x/ivy/ivysettings.xml

compile:
     [echo] Compiling plugin: urlfilter-validator
    [javac] /zonestorage/hudson_solaris/home/hudson/hudson-slave/workspace/Nutch-nutchgora/2.x/src/plugin/build-plugin.xml:117:
warning: 'includeantruntime' was not set, defaulting to build.sysclasspath=last; set to false
for repeatable builds
    [javac] Compiling 1 source file to /zonestorage/hudson_solaris/home/hudson/hudson-slave/workspace/Nutch-nutchgora/2.x/build/urlfilter-validator/classes

jar:
      [jar] Building jar: /zonestorage/hudson_solaris/home/hudson/hudson-slave/workspace/Nutch-nutchgora/2.x/build/urlfilter-validator/urlfilter-validator.jar

deps-test:

deploy:
     [copy] Copying 1 file to /zonestorage/hudson_solaris/home/hudson/hudson-slave/workspace/Nutch-nutchgora/2.x/build/plugins/urlfilter-validator

copy-generated-lib:
     [copy] Copying 1 file to /zonestorage/hudson_solaris/home/hudson/hudson-slave/workspace/Nutch-nutchgora/2.x/build/plugins/urlfilter-validator

init:
    [mkdir] Created dir: /zonestorage/hudson_solaris/home/hudson/hudson-slave/workspace/Nutch-nutchgora/2.x/build/urlnormalizer-basic
    [mkdir] Created dir: /zonestorage/hudson_solaris/home/hudson/hudson-slave/workspace/Nutch-nutchgora/2.x/build/urlnormalizer-basic/classes
    [mkdir] Created dir: /zonestorage/hudson_solaris/home/hudson/hudson-slave/workspace/Nutch-nutchgora/2.x/build/urlnormalizer-basic/test
    [mkdir] Created dir: /zonestorage/hudson_solaris/home/hudson/hudson-slave/workspace/Nutch-nutchgora/2.x/build/plugins/urlnormalizer-basic

init-plugin:

deps-jar:

clean-lib:

resolve-default:
[ivy:resolve] :: loading settings :: file = /zonestorage/hudson_solaris/home/hudson/hudson-slave/workspace/Nutch-nutchgora/2.x/ivy/ivysettings.xml

compile:
     [echo] Compiling plugin: urlnormalizer-basic
    [javac] /zonestorage/hudson_solaris/home/hudson/hudson-slave/workspace/Nutch-nutchgora/2.x/src/plugin/build-plugin.xml:117:
warning: 'includeantruntime' was not set, defaulting to build.sysclasspath=last; set to false
for repeatable builds
    [javac] Compiling 1 source file to /zonestorage/hudson_solaris/home/hudson/hudson-slave/workspace/Nutch-nutchgora/2.x/build/urlnormalizer-basic/classes

jar:
      [jar] Building jar: /zonestorage/hudson_solaris/home/hudson/hudson-slave/workspace/Nutch-nutchgora/2.x/build/urlnormalizer-basic/urlnormalizer-basic.jar

deps-test:

deploy:
     [copy] Copying 1 file to /zonestorage/hudson_solaris/home/hudson/hudson-slave/workspace/Nutch-nutchgora/2.x/build/plugins/urlnormalizer-basic

copy-generated-lib:
     [copy] Copying 1 file to /zonestorage/hudson_solaris/home/hudson/hudson-slave/workspace/Nutch-nutchgora/2.x/build/plugins/urlnormalizer-basic

init:
    [mkdir] Created dir: /zonestorage/hudson_solaris/home/hudson/hudson-slave/workspace/Nutch-nutchgora/2.x/build/urlnormalizer-pass
    [mkdir] Created dir: /zonestorage/hudson_solaris/home/hudson/hudson-slave/workspace/Nutch-nutchgora/2.x/build/urlnormalizer-pass/classes
    [mkdir] Created dir: /zonestorage/hudson_solaris/home/hudson/hudson-slave/workspace/Nutch-nutchgora/2.x/build/urlnormalizer-pass/test
    [mkdir] Created dir: /zonestorage/hudson_solaris/home/hudson/hudson-slave/workspace/Nutch-nutchgora/2.x/build/plugins/urlnormalizer-pass

init-plugin:

deps-jar:

clean-lib:

resolve-default:
[ivy:resolve] :: loading settings :: file = /zonestorage/hudson_solaris/home/hudson/hudson-slave/workspace/Nutch-nutchgora/2.x/ivy/ivysettings.xml

compile:
     [echo] Compiling plugin: urlnormalizer-pass
    [javac] /zonestorage/hudson_solaris/home/hudson/hudson-slave/workspace/Nutch-nutchgora/2.x/src/plugin/build-plugin.xml:117:
warning: 'includeantruntime' was not set, defaulting to build.sysclasspath=last; set to false
for repeatable builds
    [javac] Compiling 1 source file to /zonestorage/hudson_solaris/home/hudson/hudson-slave/workspace/Nutch-nutchgora/2.x/build/urlnormalizer-pass/classes

jar:
      [jar] Building jar: /zonestorage/hudson_solaris/home/hudson/hudson-slave/workspace/Nutch-nutchgora/2.x/build/urlnormalizer-pass/urlnormalizer-pass.jar

deps-test:

deploy:
     [copy] Copying 1 file to /zonestorage/hudson_solaris/home/hudson/hudson-slave/workspace/Nutch-nutchgora/2.x/build/plugins/urlnormalizer-pass

copy-generated-lib:
     [copy] Copying 1 file to /zonestorage/hudson_solaris/home/hudson/hudson-slave/workspace/Nutch-nutchgora/2.x/build/plugins/urlnormalizer-pass
    [mkdir] Created dir: /zonestorage/hudson_solaris/home/hudson/hudson-slave/workspace/Nutch-nutchgora/2.x/build/urlnormalizer-regex/test/data
     [copy] Copying 4 files to /zonestorage/hudson_solaris/home/hudson/hudson-slave/workspace/Nutch-nutchgora/2.x/build/urlnormalizer-regex/test/data

init:
    [mkdir] Created dir: /zonestorage/hudson_solaris/home/hudson/hudson-slave/workspace/Nutch-nutchgora/2.x/build/urlnormalizer-regex/classes
    [mkdir] Created dir: /zonestorage/hudson_solaris/home/hudson/hudson-slave/workspace/Nutch-nutchgora/2.x/build/plugins/urlnormalizer-regex

init-plugin:

deps-jar:

clean-lib:

resolve-default:
[ivy:resolve] :: loading settings :: file = /zonestorage/hudson_solaris/home/hudson/hudson-slave/workspace/Nutch-nutchgora/2.x/ivy/ivysettings.xml

compile:
     [echo] Compiling plugin: urlnormalizer-regex
    [javac] /zonestorage/hudson_solaris/home/hudson/hudson-slave/workspace/Nutch-nutchgora/2.x/src/plugin/build-plugin.xml:117:
warning: 'includeantruntime' was not set, defaulting to build.sysclasspath=last; set to false
for repeatable builds
    [javac] Compiling 1 source file to /zonestorage/hudson_solaris/home/hudson/hudson-slave/workspace/Nutch-nutchgora/2.x/build/urlnormalizer-regex/classes

jar:
      [jar] Building jar: /zonestorage/hudson_solaris/home/hudson/hudson-slave/workspace/Nutch-nutchgora/2.x/build/urlnormalizer-regex/urlnormalizer-regex.jar

deps-test:

init:

init-plugin:

clean-lib:

resolve-default:
[ivy:resolve] :: loading settings :: file = /zonestorage/hudson_solaris/home/hudson/hudson-slave/workspace/Nutch-nutchgora/2.x/ivy/ivysettings.xml

compile:

jar:

deps-test:

deploy:

copy-generated-lib:

deploy:
     [copy] Copying 1 file to /zonestorage/hudson_solaris/home/hudson/hudson-slave/workspace/Nutch-nutchgora/2.x/build/plugins/urlnormalizer-regex

copy-generated-lib:
     [copy] Copying 1 file to /zonestorage/hudson_solaris/home/hudson/hudson-slave/workspace/Nutch-nutchgora/2.x/build/plugins/urlnormalizer-regex

compile:

job:
      [jar] Building jar: /zonestorage/hudson_solaris/home/hudson/hudson-slave/workspace/Nutch-nutchgora/2.x/build/apache-nutch-2.2-SNAPSHOT.job

resolve-test:
  [taskdef] Could not load definitions from resource org/sonar/ant/antlib.xml. It could not
be found.

copy-libs:

compile-core-test:
    [javac] /zonestorage/hudson_solaris/home/hudson/hudson-slave/workspace/Nutch-nutchgora/2.x/build.xml:334:
warning: 'includeantruntime' was not set, defaulting to build.sysclasspath=last; set to false
for repeatable builds
    [javac] Compiling 33 source files to /zonestorage/hudson_solaris/home/hudson/hudson-slave/workspace/Nutch-nutchgora/2.x/build/test/classes
    [javac] warning: [path] bad path element "/zonestorage/hudson_solaris/home/hudson/hudson-slave/workspace/Nutch-nutchgora/2.x/build/lib/jaxb-api.jar":
no such file or directory
    [javac] warning: [path] bad path element "/zonestorage/hudson_solaris/home/hudson/hudson-slave/workspace/Nutch-nutchgora/2.x/build/lib/activation.jar":
no such file or directory
    [javac] warning: [path] bad path element "/zonestorage/hudson_solaris/home/hudson/hudson-slave/workspace/Nutch-nutchgora/2.x/build/lib/jsr173_1.0_api.jar":
no such file or directory
    [javac] warning: [path] bad path element "/zonestorage/hudson_solaris/home/hudson/hudson-slave/workspace/Nutch-nutchgora/2.x/build/lib/jaxb1-impl.jar":
no such file or directory
    [javac] warning: [path] Unexpected extension for archive file: /zonestorage/hudson_solaris/home/hudson/hudson-slave/workspace/Nutch-nutchgora/2.x/build/apache-nutch-2.2-SNAPSHOT.job
    [javac] /zonestorage/hudson_solaris/home/hudson/hudson-slave/workspace/Nutch-nutchgora/2.x/src/test/org/apache/nutch/parse/TestParserFactory.java:52:
warning: [cast] redundant cast to org.apache.nutch.plugin.Extension
    [javac]     Extension ext = (Extension)parserFactory.getExtensions("text/html").get(0);
    [javac]                     ^
    [javac] /zonestorage/hudson_solaris/home/hudson/hudson-slave/workspace/Nutch-nutchgora/2.x/src/test/org/apache/nutch/parse/TestParserFactory.java:54:
warning: [cast] redundant cast to org.apache.nutch.plugin.Extension
    [javac]     ext = (Extension) parserFactory.getExtensions("text/html; charset=ISO-8859-1").get(0);
    [javac]           ^
    [javac] /zonestorage/hudson_solaris/home/hudson/hudson-slave/workspace/Nutch-nutchgora/2.x/src/test/org/apache/nutch/parse/TestParserFactory.java:56:
warning: [cast] redundant cast to org.apache.nutch.plugin.Extension
    [javac]     ext = (Extension)parserFactory.getExtensions("foo/bar").get(0);
    [javac]           ^
    [javac] /zonestorage/hudson_solaris/home/hudson/hudson-slave/workspace/Nutch-nutchgora/2.x/src/test/org/apache/nutch/plugin/TestPluginSystem.java:213:
warning: [unchecked] unchecked call to add(E) as a member of the raw type java.util.LinkedList
    [javac]                 fFolders.add(file);
    [javac]                             ^
    [javac] 9 warnings

test-core:
    [mkdir] Created dir: /zonestorage/hudson_solaris/home/hudson/hudson-slave/workspace/Nutch-nutchgora/2.x/build/test/data
     [copy] Copying 90 files to /zonestorage/hudson_solaris/home/hudson/hudson-slave/workspace/Nutch-nutchgora/2.x/build/test/data
     [copy] Copying 1 file to /zonestorage/hudson_solaris/home/hudson/hudson-slave/workspace/Nutch-nutchgora/2.x/build/test/classes
     [copy] Copying 1 file to /zonestorage/hudson_solaris/home/hudson/hudson-slave/workspace/Nutch-nutchgora/2.x/build/test/classes
     [copy] Copying 1 file to /zonestorage/hudson_solaris/home/hudson/hudson-slave/workspace/Nutch-nutchgora/2.x/build/test/classes
     [copy] Copying 1 file to /zonestorage/hudson_solaris/home/hudson/hudson-slave/workspace/Nutch-nutchgora/2.x/build/test/classes
     [copy] Copying 1 file to /zonestorage/hudson_solaris/home/hudson/hudson-slave/workspace/Nutch-nutchgora/2.x/build/test/classes
     [copy] Copying 1 file to /zonestorage/hudson_solaris/home/hudson/hudson-slave/workspace/Nutch-nutchgora/2.x/build/test/classes
    [junit] Running org.apache.nutch.api.TestAPI
    [junit] Tests run: 1, Failures: 0, Errors: 0, Time elapsed: 0.184 sec
    [junit] Running org.apache.nutch.crawl.TestGenerator
    [junit] Tests run: 4, Failures: 0, Errors: 4, Time elapsed: 22.813 sec
    [junit] Test org.apache.nutch.crawl.TestGenerator FAILED
    [junit] Running org.apache.nutch.crawl.TestInjector
    [junit] Tests run: 1, Failures: 0, Errors: 1, Time elapsed: 11.048 sec
    [junit] Test org.apache.nutch.crawl.TestInjector FAILED
    [junit] Running org.apache.nutch.crawl.TestSignatureFactory
    [junit] Tests run: 1, Failures: 0, Errors: 0, Time elapsed: 1.17 sec
    [junit] Running org.apache.nutch.crawl.TestURLPartitioner
    [junit] Tests run: 7, Failures: 0, Errors: 0, Time elapsed: 8.731 sec
    [junit] Running org.apache.nutch.crawl.TestUrlWithScore
    [junit] Tests run: 4, Failures: 0, Errors: 0, Time elapsed: 0.173 sec
    [junit] Running org.apache.nutch.fetcher.TestFetcher
    [junit] Tests run: 2, Failures: 0, Errors: 1, Time elapsed: 6.773 sec
    [junit] Test org.apache.nutch.fetcher.TestFetcher FAILED
    [junit] Running org.apache.nutch.indexer.TestIndexingFilters
    [junit] Tests run: 1, Failures: 0, Errors: 0, Time elapsed: 4.372 sec
    [junit] Running org.apache.nutch.metadata.TestMetadata
    [junit] Tests run: 10, Failures: 0, Errors: 0, Time elapsed: 0.127 sec
    [junit] Running org.apache.nutch.metadata.TestSpellCheckedMetadata
    [junit] Tests run: 11, Failures: 0, Errors: 0, Time elapsed: 3.847 sec
    [junit] Running org.apache.nutch.net.TestURLFilters
    [junit] Tests run: 1, Failures: 0, Errors: 0, Time elapsed: 11.638 sec
    [junit] Running org.apache.nutch.net.TestURLNormalizers
    [junit] Tests run: 1, Failures: 0, Errors: 0, Time elapsed: 7.164 sec
    [junit] Running org.apache.nutch.parse.TestOutlinkExtractor
    [junit] Tests run: 4, Failures: 0, Errors: 0, Time elapsed: 0.827 sec
    [junit] Running org.apache.nutch.parse.TestParserFactory
    [junit] Tests run: 2, Failures: 0, Errors: 0, Time elapsed: 13.619 sec
    [junit] Running org.apache.nutch.plugin.TestPluginSystem
    [junit] Tests run: 7, Failures: 0, Errors: 0, Time elapsed: 20.136 sec
    [junit] Running org.apache.nutch.protocol.TestContent
    [junit] Tests run: 2, Failures: 0, Errors: 0, Time elapsed: 12.016 sec
    [junit] Running org.apache.nutch.protocol.TestProtocolFactory
    [junit] Tests run: 2, Failures: 0, Errors: 0, Time elapsed: 9.421 sec
    [junit] Running org.apache.nutch.storage.TestGoraStorage
    [junit] Tests run: 3, Failures: 0, Errors: 0, Time elapsed: 221.344 sec
    [junit] Running org.apache.nutch.util.TestEncodingDetector
    [junit] Tests run: 1, Failures: 0, Errors: 0, Time elapsed: 4.024 sec
    [junit] Running org.apache.nutch.util.TestGZIPUtils
    [junit] Tests run: 4, Failures: 0, Errors: 0, Time elapsed: 1.086 sec
    [junit] Running org.apache.nutch.util.TestNodeWalker
    [junit] Tests run: 1, Failures: 0, Errors: 0, Time elapsed: 0.816 sec
    [junit] Running org.apache.nutch.util.TestPrefixStringMatcher
    [junit] Tests run: 1, Failures: 0, Errors: 0, Time elapsed: 1.91 sec
    [junit] Running org.apache.nutch.util.TestStringUtil
    [junit] Tests run: 2, Failures: 0, Errors: 0, Time elapsed: 0.007 sec
    [junit] Running org.apache.nutch.util.TestSuffixStringMatcher
    [junit] Tests run: 1, Failures: 0, Errors: 0, Time elapsed: 0.063 sec
    [junit] Running org.apache.nutch.util.TestTableUtil
    [junit] Tests run: 2, Failures: 0, Errors: 0, Time elapsed: 0.301 sec
    [junit] Running org.apache.nutch.util.TestURLUtil
    [junit] Tests run: 4, Failures: 0, Errors: 0, Time elapsed: 1.531 sec

BUILD FAILED
/zonestorage/hudson_solaris/home/hudson/hudson-slave/workspace/Nutch-nutchgora/2.x/build.xml:423:
Tests failed!

Total time: 12 minutes 15 seconds
Build step 'Invoke Ant' marked build as failure
Publishing Javadoc

Mime
View raw message