nutch-dev mailing list archives

Site index · List index
Message view « Date » · « Thread »
Top « Date » · « Thread »
From Apache Jenkins Server <jenk...@builds.apache.org>
Subject Build failed in Jenkins: Nutch-trunk #2067
Date Fri, 04 Jan 2013 04:10:32 GMT
See <https://builds.apache.org/job/Nutch-trunk/2067/>

------------------------------------------
[...truncated 2152 lines...]

deps-test:

deploy:

copy-generated-lib:

init:
    [mkdir] Created dir: /zonestorage/hudson_solaris/home/hudson/hudson-slave/workspace/Nutch-trunk/trunk/build/protocol-ftp
    [mkdir] Created dir: /zonestorage/hudson_solaris/home/hudson/hudson-slave/workspace/Nutch-trunk/trunk/build/protocol-ftp/classes
    [mkdir] Created dir: /zonestorage/hudson_solaris/home/hudson/hudson-slave/workspace/Nutch-trunk/trunk/build/protocol-ftp/test
    [mkdir] Created dir: /zonestorage/hudson_solaris/home/hudson/hudson-slave/workspace/Nutch-trunk/trunk/build/plugins/protocol-ftp

init-plugin:

deps-jar:

clean-lib:

resolve-default:
[ivy:resolve] :: loading settings :: file = /zonestorage/hudson_solaris/home/hudson/hudson-slave/workspace/Nutch-trunk/trunk/ivy/ivysettings.xml

compile:
     [echo] Compiling plugin: protocol-ftp
    [javac] /zonestorage/hudson_solaris/home/hudson/hudson-slave/workspace/Nutch-trunk/trunk/src/plugin/build-plugin.xml:117:
warning: 'includeantruntime' was not set, defaulting to build.sysclasspath=last; set to false
for repeatable builds
    [javac] Compiling 10 source files to /zonestorage/hudson_solaris/home/hudson/hudson-slave/workspace/Nutch-trunk/trunk/build/protocol-ftp/classes
    [javac] Note: /zonestorage/hudson_solaris/home/hudson/hudson-slave/workspace/Nutch-trunk/trunk/src/plugin/protocol-ftp/src/java/org/apache/nutch/protocol/ftp/Client.java
uses unchecked or unsafe operations.
    [javac] Note: Recompile with -Xlint:unchecked for details.

jar:
      [jar] Building jar: /zonestorage/hudson_solaris/home/hudson/hudson-slave/workspace/Nutch-trunk/trunk/build/protocol-ftp/protocol-ftp.jar

deps-test:

deploy:
     [copy] Copying 1 file to /zonestorage/hudson_solaris/home/hudson/hudson-slave/workspace/Nutch-trunk/trunk/build/plugins/protocol-ftp

copy-generated-lib:
     [copy] Copying 1 file to /zonestorage/hudson_solaris/home/hudson/hudson-slave/workspace/Nutch-trunk/trunk/build/plugins/protocol-ftp

init:
    [mkdir] Created dir: /zonestorage/hudson_solaris/home/hudson/hudson-slave/workspace/Nutch-trunk/trunk/build/protocol-http
    [mkdir] Created dir: /zonestorage/hudson_solaris/home/hudson/hudson-slave/workspace/Nutch-trunk/trunk/build/protocol-http/classes
    [mkdir] Created dir: /zonestorage/hudson_solaris/home/hudson/hudson-slave/workspace/Nutch-trunk/trunk/build/protocol-http/test
    [mkdir] Created dir: /zonestorage/hudson_solaris/home/hudson/hudson-slave/workspace/Nutch-trunk/trunk/build/plugins/protocol-http

init-plugin:

deps-jar:

init:

init-plugin:

deps-jar:

clean-lib:

resolve-default:
[ivy:resolve] :: loading settings :: file = /zonestorage/hudson_solaris/home/hudson/hudson-slave/workspace/Nutch-trunk/trunk/ivy/ivysettings.xml

compile:
     [echo] Compiling plugin: lib-http
    [javac] /zonestorage/hudson_solaris/home/hudson/hudson-slave/workspace/Nutch-trunk/trunk/src/plugin/build-plugin.xml:117:
warning: 'includeantruntime' was not set, defaulting to build.sysclasspath=last; set to false
for repeatable builds

jar:

clean-lib:

resolve-default:
[ivy:resolve] :: loading settings :: file = /zonestorage/hudson_solaris/home/hudson/hudson-slave/workspace/Nutch-trunk/trunk/ivy/ivysettings.xml

compile:
     [echo] Compiling plugin: protocol-http
    [javac] /zonestorage/hudson_solaris/home/hudson/hudson-slave/workspace/Nutch-trunk/trunk/src/plugin/build-plugin.xml:117:
warning: 'includeantruntime' was not set, defaulting to build.sysclasspath=last; set to false
for repeatable builds
    [javac] Compiling 2 source files to /zonestorage/hudson_solaris/home/hudson/hudson-slave/workspace/Nutch-trunk/trunk/build/protocol-http/classes

jar:
      [jar] Building jar: /zonestorage/hudson_solaris/home/hudson/hudson-slave/workspace/Nutch-trunk/trunk/build/protocol-http/protocol-http.jar

deps-test:

init:

init-plugin:

deps-jar:

clean-lib:

resolve-default:
[ivy:resolve] :: loading settings :: file = /zonestorage/hudson_solaris/home/hudson/hudson-slave/workspace/Nutch-trunk/trunk/ivy/ivysettings.xml

compile:
     [echo] Compiling plugin: lib-http
    [javac] /zonestorage/hudson_solaris/home/hudson/hudson-slave/workspace/Nutch-trunk/trunk/src/plugin/build-plugin.xml:117:
warning: 'includeantruntime' was not set, defaulting to build.sysclasspath=last; set to false
for repeatable builds

jar:

deps-test:

deploy:

copy-generated-lib:

init:

init-plugin:

clean-lib:

resolve-default:
[ivy:resolve] :: loading settings :: file = /zonestorage/hudson_solaris/home/hudson/hudson-slave/workspace/Nutch-trunk/trunk/ivy/ivysettings.xml

compile:

jar:

deps-test:

deploy:

copy-generated-lib:

deploy:
     [copy] Copying 1 file to /zonestorage/hudson_solaris/home/hudson/hudson-slave/workspace/Nutch-trunk/trunk/build/plugins/protocol-http

copy-generated-lib:
     [copy] Copying 1 file to /zonestorage/hudson_solaris/home/hudson/hudson-slave/workspace/Nutch-trunk/trunk/build/plugins/protocol-http
    [mkdir] Created dir: /zonestorage/hudson_solaris/home/hudson/hudson-slave/workspace/Nutch-trunk/trunk/build/protocol-httpclient/test/data
     [copy] Copying 5 files to /zonestorage/hudson_solaris/home/hudson/hudson-slave/workspace/Nutch-trunk/trunk/build/protocol-httpclient/test/data

init:
    [mkdir] Created dir: /zonestorage/hudson_solaris/home/hudson/hudson-slave/workspace/Nutch-trunk/trunk/build/protocol-httpclient/classes
    [mkdir] Created dir: /zonestorage/hudson_solaris/home/hudson/hudson-slave/workspace/Nutch-trunk/trunk/build/plugins/protocol-httpclient

init-plugin:

deps-jar:

init:

init-plugin:

deps-jar:

clean-lib:

resolve-default:
[ivy:resolve] :: loading settings :: file = /zonestorage/hudson_solaris/home/hudson/hudson-slave/workspace/Nutch-trunk/trunk/ivy/ivysettings.xml

compile:
     [echo] Compiling plugin: lib-http
    [javac] /zonestorage/hudson_solaris/home/hudson/hudson-slave/workspace/Nutch-trunk/trunk/src/plugin/build-plugin.xml:117:
warning: 'includeantruntime' was not set, defaulting to build.sysclasspath=last; set to false
for repeatable builds

jar:

clean-lib:

resolve-default:
[ivy:resolve] :: loading settings :: file = /zonestorage/hudson_solaris/home/hudson/hudson-slave/workspace/Nutch-trunk/trunk/ivy/ivysettings.xml

compile:
     [echo] Compiling plugin: protocol-httpclient
    [javac] /zonestorage/hudson_solaris/home/hudson/hudson-slave/workspace/Nutch-trunk/trunk/src/plugin/build-plugin.xml:117:
warning: 'includeantruntime' was not set, defaulting to build.sysclasspath=last; set to false
for repeatable builds
    [javac] Compiling 8 source files to /zonestorage/hudson_solaris/home/hudson/hudson-slave/workspace/Nutch-trunk/trunk/build/protocol-httpclient/classes
    [javac] /zonestorage/hudson_solaris/home/hudson/hudson-slave/workspace/Nutch-trunk/trunk/src/plugin/protocol-httpclient/src/java/org/apache/nutch/protocol/httpclient/Http.java:161:
warning: [deprecation] Protocol(java.lang.String,org.apache.commons.httpclient.protocol.SecureProtocolSocketFactory,int)
in org.apache.commons.httpclient.protocol.Protocol has been deprecated
    [javac]     Protocol https = new Protocol("https",
    [javac]                      ^
    [javac] Note: Some input files use unchecked or unsafe operations.
    [javac] Note: Recompile with -Xlint:unchecked for details.
    [javac] 1 warning

jar:
      [jar] Building jar: /zonestorage/hudson_solaris/home/hudson/hudson-slave/workspace/Nutch-trunk/trunk/build/protocol-httpclient/protocol-httpclient.jar

deps-test:
     [copy] Copying 2 files to /zonestorage/hudson_solaris/home/hudson/hudson-slave/workspace/Nutch-trunk/trunk/build/protocol-httpclient/test
     [copy] Copied 6 empty directories to 5 empty directories under /zonestorage/hudson_solaris/home/hudson/hudson-slave/workspace/Nutch-trunk/trunk/build/protocol-httpclient/test

deploy:
     [copy] Copying 1 file to /zonestorage/hudson_solaris/home/hudson/hudson-slave/workspace/Nutch-trunk/trunk/build/plugins/protocol-httpclient

copy-generated-lib:
     [copy] Copying 1 file to /zonestorage/hudson_solaris/home/hudson/hudson-slave/workspace/Nutch-trunk/trunk/build/plugins/protocol-httpclient
     [copy] Copying 1 file to /zonestorage/hudson_solaris/home/hudson/hudson-slave/workspace/Nutch-trunk/trunk/build/plugins/parse-ext

BUILD FAILED
/zonestorage/hudson_solaris/home/hudson/hudson-slave/workspace/Nutch-trunk/trunk/build.xml:103:
The following error occurred while executing this line:
/zonestorage/hudson_solaris/home/hudson/hudson-slave/workspace/Nutch-trunk/trunk/src/plugin/build.xml:48:
The following error occurred while executing this line:
/zonestorage/hudson_solaris/home/hudson/hudson-slave/workspace/Nutch-trunk/trunk/src/plugin/parse-ext/build.xml:30:
Execute failed: java.io.IOException: Cannot run program "chmod" (in directory "/zonestorage/hudson_solaris/home/hudson/hudson-slave/workspace/Nutch-trunk/trunk/src/plugin/parse-ext"):
error=12, Not enough space
	at java.lang.ProcessBuilder.start(ProcessBuilder.java:460)
	at java.lang.Runtime.exec(Runtime.java:593)
	at org.apache.tools.ant.taskdefs.Execute$Java13CommandLauncher.exec(Execute.java:862)
	at org.apache.tools.ant.taskdefs.Execute.launch(Execute.java:481)
	at org.apache.tools.ant.taskdefs.Execute.execute(Execute.java:495)
	at org.apache.tools.ant.taskdefs.ExecTask.runExecute(ExecTask.java:631)
	at org.apache.tools.ant.taskdefs.ExecuteOn.runParallel(ExecuteOn.java:716)
	at org.apache.tools.ant.taskdefs.ExecuteOn.runExec(ExecuteOn.java:479)
	at org.apache.tools.ant.taskdefs.ExecTask.execute(ExecTask.java:498)
	at org.apache.tools.ant.taskdefs.Chmod.execute(Chmod.java:181)
	at org.apache.tools.ant.UnknownElement.execute(UnknownElement.java:291)
	at sun.reflect.GeneratedMethodAccessor4.invoke(Unknown Source)
	at sun.reflect.DelegatingMethodAccessorImpl.invoke(DelegatingMethodAccessorImpl.java:25)
	at java.lang.reflect.Method.invoke(Method.java:597)
	at org.apache.tools.ant.dispatch.DispatchUtils.execute(DispatchUtils.java:106)
	at org.apache.tools.ant.Task.perform(Task.java:348)
	at org.apache.tools.ant.Target.execute(Target.java:390)
	at org.apache.tools.ant.helper.ProjectHelper2.parse(ProjectHelper2.java:180)
	at org.apache.tools.ant.ProjectHelper.configureProject(ProjectHelper.java:82)
	at org.apache.tools.ant.taskdefs.Ant.execute(Ant.java:393)
	at org.apache.tools.ant.UnknownElement.execute(UnknownElement.java:291)
	at sun.reflect.GeneratedMethodAccessor4.invoke(Unknown Source)
	at sun.reflect.DelegatingMethodAccessorImpl.invoke(DelegatingMethodAccessorImpl.java:25)
	at java.lang.reflect.Method.invoke(Method.java:597)
	at org.apache.tools.ant.dispatch.DispatchUtils.execute(DispatchUtils.java:106)
	at org.apache.tools.ant.Task.perform(Task.java:348)
	at org.apache.tools.ant.Target.execute(Target.java:390)
	at org.apache.tools.ant.Target.performTasks(Target.java:411)
	at org.apache.tools.ant.Project.executeSortedTargets(Project.java:1399)
	at org.apache.tools.ant.helper.SingleCheckExecutor.executeTargets(SingleCheckExecutor.java:38)
	at org.apache.tools.ant.Project.executeTargets(Project.java:1251)
	at org.apache.tools.ant.taskdefs.Ant.execute(Ant.java:442)
	at org.apache.tools.ant.UnknownElement.execute(UnknownElement.java:291)
	at sun.reflect.GeneratedMethodAccessor4.invoke(Unknown Source)
	at sun.reflect.DelegatingMethodAccessorImpl.invoke(DelegatingMethodAccessorImpl.java:25)
	at java.lang.reflect.Method.invoke(Method.java:597)
	at org.apache.tools.ant.dispatch.DispatchUtils.execute(DispatchUtils.java:106)
	at org.apache.tools.ant.Task.perform(Task.java:348)
	at org.apache.tools.ant.Target.execute(Target.java:390)
	at org.apache.tools.ant.Target.performTasks(Target.java:411)
	at org.apache.tools.ant.Project.executeSortedTargets(Project.java:1399)
	at org.apache.tools.ant.Project.executeTarget(Project.java:1368)
	at org.apache.tools.ant.helper.DefaultExecutor.executeTargets(DefaultExecutor.java:41)
	at org.apache.tools.ant.Project.executeTargets(Project.java:1251)
	at org.apache.tools.ant.Main.runBuild(Main.java:809)
	at org.apache.tools.ant.Main.startAnt(Main.java:217)
	at org.apache.tools.ant.launch.Launcher.run(Launcher.java:280)
	at org.apache.tools.ant.launch.Launcher.main(Launcher.java:109)
Caused by: java.io.IOException: error=12, Not enough space
	at java.lang.UNIXProcess.forkAndExec(Native Method)
	at java.lang.UNIXProcess.<init>(UNIXProcess.java:53)
	at java.lang.ProcessImpl.start(ProcessImpl.java:65)
	at java.lang.ProcessBuilder.start(ProcessBuilder.java:453)
	... 47 more

Total time: 39 seconds
Build step 'Invoke Ant' marked build as failure
Publishing Javadoc

Mime
View raw message