nutch-dev mailing list archives

Site index · List index
Message view « Date » · « Thread »
Top « Date » · « Thread »
From Apache Jenkins Server <jenk...@builds.apache.org>
Subject Build failed in Jenkins: Nutch-2.x-Windows #1
Date Thu, 10 Jan 2013 03:09:34 GMT
See <https://builds.apache.org/job/Nutch-2.x-Windows/1/>

------------------------------------------
[...truncated 3524 lines...]

clean-lib:

resolve-default:
[ivy:resolve] :: loading settings :: file = <https://builds.apache.org/job/Nutch-2.x-Windows/ws/2.x\ivy\ivysettings.xml>

compile:
     [echo] Compiling plugin: urlnormalizer-basic
    [javac] <https://builds.apache.org/job/Nutch-2.x-Windows/ws/2.x\src\plugin\build-plugin.xml>:117:
warning: 'includeantruntime' was not set, defaulting to build.sysclasspath=last; set to false
for repeatable builds
    [javac] Compiling 1 source file to <https://builds.apache.org/job/Nutch-2.x-Windows/ws/2.x\build\urlnormalizer-basic\classes>
    [javac] warning: [options] bootstrap class path not set in conjunction with -source 1.6
    [javac] 1 warning

jar:
      [jar] Building jar: <https://builds.apache.org/job/Nutch-2.x-Windows/ws/2.x\build\urlnormalizer-basic\urlnormalizer-basic.jar>

deps-test:

deploy:
     [copy] Copying 1 file to <https://builds.apache.org/job/Nutch-2.x-Windows/ws/2.x\build\plugins\urlnormalizer-basic>

copy-generated-lib:
     [copy] Copying 1 file to <https://builds.apache.org/job/Nutch-2.x-Windows/ws/2.x\build\plugins\urlnormalizer-basic>

init:
    [mkdir] Created dir: <https://builds.apache.org/job/Nutch-2.x-Windows/ws/2.x\build\urlnormalizer-pass>
    [mkdir] Created dir: <https://builds.apache.org/job/Nutch-2.x-Windows/ws/2.x\build\urlnormalizer-pass\classes>
    [mkdir] Created dir: <https://builds.apache.org/job/Nutch-2.x-Windows/ws/2.x\build\urlnormalizer-pass\test>
    [mkdir] Created dir: <https://builds.apache.org/job/Nutch-2.x-Windows/ws/2.x\build\plugins\urlnormalizer-pass>

init-plugin:

deps-jar:

clean-lib:

resolve-default:
[ivy:resolve] :: loading settings :: file = <https://builds.apache.org/job/Nutch-2.x-Windows/ws/2.x\ivy\ivysettings.xml>

compile:
     [echo] Compiling plugin: urlnormalizer-pass
    [javac] <https://builds.apache.org/job/Nutch-2.x-Windows/ws/2.x\src\plugin\build-plugin.xml>:117:
warning: 'includeantruntime' was not set, defaulting to build.sysclasspath=last; set to false
for repeatable builds
    [javac] Compiling 1 source file to <https://builds.apache.org/job/Nutch-2.x-Windows/ws/2.x\build\urlnormalizer-pass\classes>
    [javac] warning: [options] bootstrap class path not set in conjunction with -source 1.6
    [javac] 1 warning

jar:
      [jar] Building jar: <https://builds.apache.org/job/Nutch-2.x-Windows/ws/2.x\build\urlnormalizer-pass\urlnormalizer-pass.jar>

deps-test:

deploy:
     [copy] Copying 1 file to <https://builds.apache.org/job/Nutch-2.x-Windows/ws/2.x\build\plugins\urlnormalizer-pass>

copy-generated-lib:
     [copy] Copying 1 file to <https://builds.apache.org/job/Nutch-2.x-Windows/ws/2.x\build\plugins\urlnormalizer-pass>
    [mkdir] Created dir: <https://builds.apache.org/job/Nutch-2.x-Windows/ws/2.x\build\urlnormalizer-regex\test\data>
     [copy] Copying 4 files to <https://builds.apache.org/job/Nutch-2.x-Windows/ws/2.x\build\urlnormalizer-regex\test\data>

init:
    [mkdir] Created dir: <https://builds.apache.org/job/Nutch-2.x-Windows/ws/2.x\build\urlnormalizer-regex\classes>
    [mkdir] Created dir: <https://builds.apache.org/job/Nutch-2.x-Windows/ws/2.x\build\plugins\urlnormalizer-regex>

init-plugin:

deps-jar:

clean-lib:

resolve-default:
[ivy:resolve] :: loading settings :: file = <https://builds.apache.org/job/Nutch-2.x-Windows/ws/2.x\ivy\ivysettings.xml>

compile:
     [echo] Compiling plugin: urlnormalizer-regex
    [javac] <https://builds.apache.org/job/Nutch-2.x-Windows/ws/2.x\src\plugin\build-plugin.xml>:117:
warning: 'includeantruntime' was not set, defaulting to build.sysclasspath=last; set to false
for repeatable builds
    [javac] Compiling 1 source file to <https://builds.apache.org/job/Nutch-2.x-Windows/ws/2.x\build\urlnormalizer-regex\classes>
    [javac] warning: [options] bootstrap class path not set in conjunction with -source 1.6
    [javac] 1 warning

jar:
      [jar] Building jar: <https://builds.apache.org/job/Nutch-2.x-Windows/ws/2.x\build\urlnormalizer-regex\urlnormalizer-regex.jar>

deps-test:

init:

init-plugin:

clean-lib:

resolve-default:
[ivy:resolve] :: loading settings :: file = <https://builds.apache.org/job/Nutch-2.x-Windows/ws/2.x\ivy\ivysettings.xml>

compile:

jar:

deps-test:

deploy:

copy-generated-lib:

deploy:
     [copy] Copying 1 file to <https://builds.apache.org/job/Nutch-2.x-Windows/ws/2.x\build\plugins\urlnormalizer-regex>

copy-generated-lib:
     [copy] Copying 1 file to <https://builds.apache.org/job/Nutch-2.x-Windows/ws/2.x\build\plugins\urlnormalizer-regex>

compile:

job:
      [jar] Building jar: <https://builds.apache.org/job/Nutch-2.x-Windows/ws/2.x\build\apache-nutch-2.2-SNAPSHOT.job>

resolve-test:
[ivy:resolve] downloading http://repo1.maven.org/maven2/org/apache/hadoop/hadoop-test/1.1.1/hadoop-test-1.1.1.jar
...
[ivy:resolve] ...............................................................................................................................
(2701kB)
[ivy:resolve] .. (0kB)
[ivy:resolve] 	[SUCCESSFUL ] org.apache.hadoop#hadoop-test;1.1.1!hadoop-test.jar (548ms)
[ivy:resolve] downloading http://repo1.maven.org/maven2/org/apache/ftpserver/ftplet-api/1.0.0/ftplet-api-1.0.0.jar
...
[ivy:resolve] .. (22kB)
[ivy:resolve] .. (0kB)
[ivy:resolve] 	[SUCCESSFUL ] org.apache.ftpserver#ftplet-api;1.0.0!ftplet-api.jar(bundle)
(35ms)
[ivy:resolve] downloading http://repo1.maven.org/maven2/org/apache/mina/mina-core/2.0.0-M5/mina-core-2.0.0-M5.jar
...
[ivy:resolve] ....................................... (622kB)
[ivy:resolve] .. (0kB)
[ivy:resolve] 	[SUCCESSFUL ] org.apache.mina#mina-core;2.0.0-M5!mina-core.jar(bundle) (160ms)
[ivy:resolve] downloading http://repo1.maven.org/maven2/org/apache/ftpserver/ftpserver-core/1.0.0/ftpserver-core-1.0.0.jar
...
[ivy:resolve] ............. (264kB)
[ivy:resolve] .. (0kB)
[ivy:resolve] 	[SUCCESSFUL ] org.apache.ftpserver#ftpserver-core;1.0.0!ftpserver-core.jar(bundle)
(96ms)
[ivy:resolve] downloading http://repo1.maven.org/maven2/org/apache/ftpserver/ftpserver-deprecated/1.0.0-M2/ftpserver-deprecated-1.0.0-M2.jar
...
[ivy:resolve] ... (31kB)
[ivy:resolve] .. (0kB)
[ivy:resolve] 	[SUCCESSFUL ] org.apache.ftpserver#ftpserver-deprecated;1.0.0-M2!ftpserver-deprecated.jar
(34ms)
  [taskdef] Could not load definitions from resource org/sonar/ant/antlib.xml. It could not
be found.

copy-libs:

compile-core-test:
    [javac] <https://builds.apache.org/job/Nutch-2.x-Windows/ws/2.x\build.xml>:334:
warning: 'includeantruntime' was not set, defaulting to build.sysclasspath=last; set to false
for repeatable builds
    [javac] Compiling 33 source files to <https://builds.apache.org/job/Nutch-2.x-Windows/ws/2.x\build\test\classes>
    [javac] warning: [path] bad path element "<https://builds.apache.org/job/Nutch-2.x-Windows/ws/2.x\build\lib\jaxb-api.jar">:
no such file or directory
    [javac] warning: [path] bad path element "<https://builds.apache.org/job/Nutch-2.x-Windows/ws/2.x\build\lib\activation.jar">:
no such file or directory
    [javac] warning: [path] bad path element "<https://builds.apache.org/job/Nutch-2.x-Windows/ws/2.x\build\lib\jsr173_1.0_api.jar">:
no such file or directory
    [javac] warning: [path] bad path element "<https://builds.apache.org/job/Nutch-2.x-Windows/ws/2.x\build\lib\jaxb1-impl.jar">:
no such file or directory
    [javac] warning: [path] Unexpected extension for archive file: <https://builds.apache.org/job/Nutch-2.x-Windows/ws/2.x\build\apache-nutch-2.2-SNAPSHOT.job>
    [javac] warning: [options] bootstrap class path not set in conjunction with -source 1.6
    [javac] <https://builds.apache.org/job/Nutch-2.x-Windows/ws/2.x\src\test\org\apache\nutch\parse\TestParserFactory.java>:52:
warning: [cast] redundant cast to Extension
    [javac]     Extension ext = (Extension)parserFactory.getExtensions("text/html").get(0);
    [javac]                     ^
    [javac] <https://builds.apache.org/job/Nutch-2.x-Windows/ws/2.x\src\test\org\apache\nutch\parse\TestParserFactory.java>:54:
warning: [cast] redundant cast to Extension
    [javac]     ext = (Extension) parserFactory.getExtensions("text/html; charset=ISO-8859-1").get(0);
    [javac]           ^
    [javac] <https://builds.apache.org/job/Nutch-2.x-Windows/ws/2.x\src\test\org\apache\nutch\parse\TestParserFactory.java>:56:
warning: [cast] redundant cast to Extension
    [javac]     ext = (Extension)parserFactory.getExtensions("foo/bar").get(0);
    [javac]           ^
    [javac] <https://builds.apache.org/job/Nutch-2.x-Windows/ws/2.x\src\test\org\apache\nutch\plugin\TestPluginSystem.java>:45:
warning: [rawtypes] found raw type: LinkedList
    [javac]     private LinkedList fFolders = new LinkedList();
    [javac]             ^
    [javac]   missing type arguments for generic class LinkedList<E>
    [javac]   where E is a type-variable:
    [javac]     E extends Object declared in class LinkedList
    [javac] <https://builds.apache.org/job/Nutch-2.x-Windows/ws/2.x\src\test\org\apache\nutch\plugin\TestPluginSystem.java>:45:
warning: [rawtypes] found raw type: LinkedList
    [javac]     private LinkedList fFolders = new LinkedList();
    [javac]                                       ^
    [javac]   missing type arguments for generic class LinkedList<E>
    [javac]   where E is a type-variable:
    [javac]     E extends Object declared in class LinkedList
    [javac] <https://builds.apache.org/job/Nutch-2.x-Windows/ws/2.x\src\test\org\apache\nutch\plugin\TestPluginSystem.java>:213:
warning: [unchecked] unchecked call to add(E) as a member of the raw type LinkedList
    [javac]                 fFolders.add(file);
    [javac]                             ^
    [javac]   where E is a type-variable:
    [javac]     E extends Object declared in class LinkedList
    [javac] 12 warnings

test-core:
    [mkdir] Created dir: <https://builds.apache.org/job/Nutch-2.x-Windows/ws/2.x\build\test\data>
     [copy] Copying 90 files to <https://builds.apache.org/job/Nutch-2.x-Windows/ws/2.x\build\test\data>
     [copy] Copying 1 file to <https://builds.apache.org/job/Nutch-2.x-Windows/ws/2.x\build\test\classes>
     [copy] Copying 1 file to <https://builds.apache.org/job/Nutch-2.x-Windows/ws/2.x\build\test\classes>
     [copy] Copying 1 file to <https://builds.apache.org/job/Nutch-2.x-Windows/ws/2.x\build\test\classes>
     [copy] Copying 1 file to <https://builds.apache.org/job/Nutch-2.x-Windows/ws/2.x\build\test\classes>
     [copy] Copying 1 file to <https://builds.apache.org/job/Nutch-2.x-Windows/ws/2.x\build\test\classes>
     [copy] Copying 1 file to <https://builds.apache.org/job/Nutch-2.x-Windows/ws/2.x\build\test\classes>
    [junit] Running org.apache.nutch.api.TestAPI
    [junit] Tests run: 1, Failures: 0, Errors: 0, Time elapsed: 0.061 sec
    [junit] Running org.apache.nutch.crawl.TestGenerator
    [junit] Tests run: 4, Failures: 0, Errors: 4, Time elapsed: 7.382 sec
    [junit] Test org.apache.nutch.crawl.TestGenerator FAILED
    [junit] Running org.apache.nutch.crawl.TestInjector
    [junit] Tests run: 1, Failures: 0, Errors: 1, Time elapsed: 4.462 sec
    [junit] Test org.apache.nutch.crawl.TestInjector FAILED
    [junit] Running org.apache.nutch.crawl.TestSignatureFactory
    [junit] Tests run: 1, Failures: 0, Errors: 0, Time elapsed: 1.71 sec
    [junit] Running org.apache.nutch.crawl.TestURLPartitioner
    [junit] Tests run: 7, Failures: 0, Errors: 0, Time elapsed: 4.759 sec
    [junit] Running org.apache.nutch.crawl.TestUrlWithScore
    [junit] Tests run: 4, Failures: 0, Errors: 0, Time elapsed: 0.278 sec
    [junit] Running org.apache.nutch.fetcher.TestFetcher
    [junit] Tests run: 2, Failures: 0, Errors: 1, Time elapsed: 6.76 sec
    [junit] Test org.apache.nutch.fetcher.TestFetcher FAILED
    [junit] Running org.apache.nutch.indexer.TestIndexingFilters
    [junit] Tests run: 1, Failures: 0, Errors: 0, Time elapsed: 2.786 sec
    [junit] Running org.apache.nutch.metadata.TestMetadata
    [junit] Tests run: 10, Failures: 0, Errors: 0, Time elapsed: 0.21 sec
    [junit] Running org.apache.nutch.metadata.TestSpellCheckedMetadata
    [junit] Tests run: 11, Failures: 0, Errors: 0, Time elapsed: 2.863 sec
    [junit] Running org.apache.nutch.net.TestURLFilters
    [junit] Tests run: 1, Failures: 0, Errors: 0, Time elapsed: 1.427 sec
    [junit] Running org.apache.nutch.net.TestURLNormalizers
    [junit] Tests run: 1, Failures: 0, Errors: 0, Time elapsed: 0.647 sec
    [junit] Running org.apache.nutch.parse.TestOutlinkExtractor
    [junit] Tests run: 4, Failures: 0, Errors: 0, Time elapsed: 0.085 sec
    [junit] Running org.apache.nutch.parse.TestParserFactory
    [junit] Tests run: 2, Failures: 0, Errors: 0, Time elapsed: 2.909 sec
    [junit] Running org.apache.nutch.plugin.TestPluginSystem
    [junit] Tests run: 7, Failures: 0, Errors: 0, Time elapsed: 1.568 sec
    [junit] Running org.apache.nutch.protocol.TestContent
    [junit] Tests run: 2, Failures: 0, Errors: 0, Time elapsed: 0.58 sec
    [junit] Running org.apache.nutch.protocol.TestProtocolFactory
    [junit] Tests run: 2, Failures: 0, Errors: 0, Time elapsed: 1.189 sec
    [junit] Running org.apache.nutch.storage.TestGoraStorage
    [junit] Tests run: 3, Failures: 1, Errors: 0, Time elapsed: 177.561 sec
    [junit] Tests run: 3, Failures: 1, Errors: 0, Time elapsed: 177.561 sec
    [junit] Test org.apache.nutch.storage.TestGoraStorage FAILED
    [junit] Running org.apache.nutch.util.TestEncodingDetector
    [junit] Tests run: 1, Failures: 0, Errors: 0, Time elapsed: 1.08 sec
    [junit] Running org.apache.nutch.util.TestGZIPUtils
    [junit] Tests run: 4, Failures: 0, Errors: 0, Time elapsed: 0.877 sec
    [junit] Running org.apache.nutch.util.TestNodeWalker
    [junit] Tests run: 1, Failures: 0, Errors: 0, Time elapsed: 0.422 sec
    [junit] Running org.apache.nutch.util.TestPrefixStringMatcher
    [junit] Tests run: 1, Failures: 0, Errors: 0, Time elapsed: 0.118 sec
    [junit] Running org.apache.nutch.util.TestStringUtil
    [junit] Tests run: 2, Failures: 0, Errors: 0, Time elapsed: 0.023 sec
    [junit] Running org.apache.nutch.util.TestSuffixStringMatcher
    [junit] Tests run: 1, Failures: 0, Errors: 0, Time elapsed: 0.089 sec
    [junit] Running org.apache.nutch.util.TestTableUtil
    [junit] Tests run: 2, Failures: 0, Errors: 0, Time elapsed: 0.131 sec
    [junit] Running org.apache.nutch.util.TestURLUtil
    [junit] Tests run: 4, Failures: 0, Errors: 0, Time elapsed: 0.768 sec

BUILD FAILED
<https://builds.apache.org/job/Nutch-2.x-Windows/ws/2.x\build.xml>:423: Tests failed!

Total time: 7 minutes 13 seconds
Build step 'Invoke Ant' marked build as failure
Publishing Javadoc

Mime
View raw message