nutch-dev mailing list archives

Site index · List index
Message view « Date » · « Thread »
Top « Date » · « Thread »
From Apache Jenkins Server <jenk...@builds.apache.org>
Subject Build failed in Jenkins: Nutch-trunk #2107
Date Fri, 01 Feb 2013 04:10:55 GMT
See <https://builds.apache.org/job/Nutch-trunk/2107/>

------------------------------------------
[...truncated 3444 lines...]
resolve-default:
[ivy:resolve] :: loading settings :: file = /zonestorage/hudson_solaris/home/hudson/hudson-slave/workspace/Nutch-trunk/trunk/ivy/ivysettings.xml

compile:
     [echo] Compiling plugin: lib-regex-filter
    [javac] /zonestorage/hudson_solaris/home/hudson/hudson-slave/workspace/Nutch-trunk/trunk/src/plugin/build-plugin.xml:117:
warning: 'includeantruntime' was not set, defaulting to build.sysclasspath=last; set to false
for repeatable builds

jar:

deps-test:

deploy:

copy-generated-lib:

deploy:
     [copy] Copying 1 file to /zonestorage/hudson_solaris/home/hudson/hudson-slave/workspace/Nutch-trunk/trunk/build/plugins/urlfilter-automaton

copy-generated-lib:
     [copy] Copying 1 file to /zonestorage/hudson_solaris/home/hudson/hudson-slave/workspace/Nutch-trunk/trunk/build/plugins/urlfilter-automaton
    [mkdir] Created dir: /zonestorage/hudson_solaris/home/hudson/hudson-slave/workspace/Nutch-trunk/trunk/build/urlfilter-domain/test/data
     [copy] Copying 1 file to /zonestorage/hudson_solaris/home/hudson/hudson-slave/workspace/Nutch-trunk/trunk/build/urlfilter-domain/test/data

init:
    [mkdir] Created dir: /zonestorage/hudson_solaris/home/hudson/hudson-slave/workspace/Nutch-trunk/trunk/build/urlfilter-domain/classes
    [mkdir] Created dir: /zonestorage/hudson_solaris/home/hudson/hudson-slave/workspace/Nutch-trunk/trunk/build/plugins/urlfilter-domain

init-plugin:

deps-jar:

clean-lib:

resolve-default:
[ivy:resolve] :: loading settings :: file = /zonestorage/hudson_solaris/home/hudson/hudson-slave/workspace/Nutch-trunk/trunk/ivy/ivysettings.xml

compile:
     [echo] Compiling plugin: urlfilter-domain
    [javac] /zonestorage/hudson_solaris/home/hudson/hudson-slave/workspace/Nutch-trunk/trunk/src/plugin/build-plugin.xml:117:
warning: 'includeantruntime' was not set, defaulting to build.sysclasspath=last; set to false
for repeatable builds
    [javac] Compiling 1 source file to /zonestorage/hudson_solaris/home/hudson/hudson-slave/workspace/Nutch-trunk/trunk/build/urlfilter-domain/classes
    [javac] warning: [options] bootstrap class path not set in conjunction with -source 1.6
    [javac] 1 warning

jar:
      [jar] Building jar: /zonestorage/hudson_solaris/home/hudson/hudson-slave/workspace/Nutch-trunk/trunk/build/urlfilter-domain/urlfilter-domain.jar

deps-test:

deploy:
     [copy] Copying 1 file to /zonestorage/hudson_solaris/home/hudson/hudson-slave/workspace/Nutch-trunk/trunk/build/plugins/urlfilter-domain

copy-generated-lib:
     [copy] Copying 1 file to /zonestorage/hudson_solaris/home/hudson/hudson-slave/workspace/Nutch-trunk/trunk/build/plugins/urlfilter-domain
    [mkdir] Created dir: /zonestorage/hudson_solaris/home/hudson/hudson-slave/workspace/Nutch-trunk/trunk/build/urlfilter-domainblacklist/test/data
     [copy] Copying 1 file to /zonestorage/hudson_solaris/home/hudson/hudson-slave/workspace/Nutch-trunk/trunk/build/urlfilter-domainblacklist/test/data

init:
    [mkdir] Created dir: /zonestorage/hudson_solaris/home/hudson/hudson-slave/workspace/Nutch-trunk/trunk/build/urlfilter-domainblacklist/classes
    [mkdir] Created dir: /zonestorage/hudson_solaris/home/hudson/hudson-slave/workspace/Nutch-trunk/trunk/build/plugins/urlfilter-domainblacklist

init-plugin:

deps-jar:

clean-lib:

resolve-default:
[ivy:resolve] :: loading settings :: file = /zonestorage/hudson_solaris/home/hudson/hudson-slave/workspace/Nutch-trunk/trunk/ivy/ivysettings.xml

compile:
     [echo] Compiling plugin: urlfilter-domainblacklist
    [javac] /zonestorage/hudson_solaris/home/hudson/hudson-slave/workspace/Nutch-trunk/trunk/src/plugin/build-plugin.xml:117:
warning: 'includeantruntime' was not set, defaulting to build.sysclasspath=last; set to false
for repeatable builds
    [javac] Compiling 1 source file to /zonestorage/hudson_solaris/home/hudson/hudson-slave/workspace/Nutch-trunk/trunk/build/urlfilter-domainblacklist/classes
    [javac] warning: [options] bootstrap class path not set in conjunction with -source 1.6
    [javac] 1 warning

jar:
      [jar] Building jar: /zonestorage/hudson_solaris/home/hudson/hudson-slave/workspace/Nutch-trunk/trunk/build/urlfilter-domainblacklist/urlfilter-domainblacklist.jar

deps-test:

deploy:
     [copy] Copying 1 file to /zonestorage/hudson_solaris/home/hudson/hudson-slave/workspace/Nutch-trunk/trunk/build/plugins/urlfilter-domainblacklist

copy-generated-lib:
     [copy] Copying 1 file to /zonestorage/hudson_solaris/home/hudson/hudson-slave/workspace/Nutch-trunk/trunk/build/plugins/urlfilter-domainblacklist

init:
    [mkdir] Created dir: /zonestorage/hudson_solaris/home/hudson/hudson-slave/workspace/Nutch-trunk/trunk/build/urlfilter-prefix
    [mkdir] Created dir: /zonestorage/hudson_solaris/home/hudson/hudson-slave/workspace/Nutch-trunk/trunk/build/urlfilter-prefix/classes
    [mkdir] Created dir: /zonestorage/hudson_solaris/home/hudson/hudson-slave/workspace/Nutch-trunk/trunk/build/urlfilter-prefix/test
    [mkdir] Created dir: /zonestorage/hudson_solaris/home/hudson/hudson-slave/workspace/Nutch-trunk/trunk/build/plugins/urlfilter-prefix

init-plugin:

deps-jar:

clean-lib:

resolve-default:
[ivy:resolve] :: loading settings :: file = /zonestorage/hudson_solaris/home/hudson/hudson-slave/workspace/Nutch-trunk/trunk/ivy/ivysettings.xml

compile:
     [echo] Compiling plugin: urlfilter-prefix
    [javac] /zonestorage/hudson_solaris/home/hudson/hudson-slave/workspace/Nutch-trunk/trunk/src/plugin/build-plugin.xml:117:
warning: 'includeantruntime' was not set, defaulting to build.sysclasspath=last; set to false
for repeatable builds
    [javac] Compiling 1 source file to /zonestorage/hudson_solaris/home/hudson/hudson-slave/workspace/Nutch-trunk/trunk/build/urlfilter-prefix/classes
    [javac] warning: [options] bootstrap class path not set in conjunction with -source 1.6
    [javac] Note: /zonestorage/hudson_solaris/home/hudson/hudson-slave/workspace/Nutch-trunk/trunk/src/plugin/urlfilter-prefix/src/java/org/apache/nutch/urlfilter/prefix/PrefixURLFilter.java
uses unchecked or unsafe operations.
    [javac] Note: Recompile with -Xlint:unchecked for details.
    [javac] 1 warning

jar:
      [jar] Building jar: /zonestorage/hudson_solaris/home/hudson/hudson-slave/workspace/Nutch-trunk/trunk/build/urlfilter-prefix/urlfilter-prefix.jar

deps-test:

deploy:
     [copy] Copying 1 file to /zonestorage/hudson_solaris/home/hudson/hudson-slave/workspace/Nutch-trunk/trunk/build/plugins/urlfilter-prefix

copy-generated-lib:
     [copy] Copying 1 file to /zonestorage/hudson_solaris/home/hudson/hudson-slave/workspace/Nutch-trunk/trunk/build/plugins/urlfilter-prefix
    [mkdir] Created dir: /zonestorage/hudson_solaris/home/hudson/hudson-slave/workspace/Nutch-trunk/trunk/build/urlfilter-regex/test/data
     [copy] Copying 6 files to /zonestorage/hudson_solaris/home/hudson/hudson-slave/workspace/Nutch-trunk/trunk/build/urlfilter-regex/test/data

init:
    [mkdir] Created dir: /zonestorage/hudson_solaris/home/hudson/hudson-slave/workspace/Nutch-trunk/trunk/build/urlfilter-regex/classes
    [mkdir] Created dir: /zonestorage/hudson_solaris/home/hudson/hudson-slave/workspace/Nutch-trunk/trunk/build/plugins/urlfilter-regex

init-plugin:

deps-jar:

init:

init-plugin:

deps-jar:

clean-lib:

resolve-default:
[ivy:resolve] :: loading settings :: file = /zonestorage/hudson_solaris/home/hudson/hudson-slave/workspace/Nutch-trunk/trunk/ivy/ivysettings.xml

compile:
     [echo] Compiling plugin: lib-regex-filter
    [javac] /zonestorage/hudson_solaris/home/hudson/hudson-slave/workspace/Nutch-trunk/trunk/src/plugin/build-plugin.xml:117:
warning: 'includeantruntime' was not set, defaulting to build.sysclasspath=last; set to false
for repeatable builds

jar:

init:

init-plugin:

deps-jar:

clean-lib:

resolve-default:
[ivy:resolve] :: loading settings :: file = /zonestorage/hudson_solaris/home/hudson/hudson-slave/workspace/Nutch-trunk/trunk/ivy/ivysettings.xml

BUILD FAILED
/zonestorage/hudson_solaris/home/hudson/hudson-slave/workspace/Nutch-trunk/trunk/build.xml:103:
The following error occurred while executing this line:
/zonestorage/hudson_solaris/home/hudson/hudson-slave/workspace/Nutch-trunk/trunk/src/plugin/build.xml:64:
The following error occurred while executing this line:
/zonestorage/hudson_solaris/home/hudson/hudson-slave/workspace/Nutch-trunk/trunk/src/plugin/urlfilter-regex/build.xml:25:
The following error occurred while executing this line:
/zonestorage/hudson_solaris/home/hudson/hudson-slave/workspace/Nutch-trunk/trunk/src/plugin/build-plugin.xml:214:
impossible to ivy retrieve: java.lang.RuntimeException: problem during retrieve of org.apache.nutch#lib-regex-filter:
java.text.ParseException: failed to parse report: /export/home/hudson/.ivy2/cache/org.apache.nutch-lib-regex-filter-default.xml:
Premature end of file.
	at org.apache.ivy.core.retrieve.RetrieveEngine.retrieve(RetrieveEngine.java:206)
	at org.apache.ivy.Ivy.retrieve(Ivy.java:540)
	at org.apache.ivy.ant.IvyRetrieve.doExecute(IvyRetrieve.java:67)
	at org.apache.ivy.ant.IvyTask.execute(IvyTask.java:277)
	at org.apache.tools.ant.UnknownElement.execute(UnknownElement.java:291)
	at sun.reflect.GeneratedMethodAccessor4.invoke(Unknown Source)
	at sun.reflect.DelegatingMethodAccessorImpl.invoke(DelegatingMethodAccessorImpl.java:43)
	at java.lang.reflect.Method.invoke(Method.java:601)
	at org.apache.tools.ant.dispatch.DispatchUtils.execute(DispatchUtils.java:106)
	at org.apache.tools.ant.Task.perform(Task.java:348)
	at org.apache.tools.ant.Target.execute(Target.java:390)
	at org.apache.tools.ant.Target.performTasks(Target.java:411)
	at org.apache.tools.ant.Project.executeSortedTargets(Project.java:1399)
	at org.apache.tools.ant.helper.SingleCheckExecutor.executeTargets(SingleCheckExecutor.java:38)
	at org.apache.tools.ant.Project.executeTargets(Project.java:1251)
	at org.apache.tools.ant.taskdefs.Ant.execute(Ant.java:442)
	at org.apache.tools.ant.UnknownElement.execute(UnknownElement.java:291)
	at sun.reflect.GeneratedMethodAccessor4.invoke(Unknown Source)
	at sun.reflect.DelegatingMethodAccessorImpl.invoke(DelegatingMethodAccessorImpl.java:43)
	at java.lang.reflect.Method.invoke(Method.java:601)
	at org.apache.tools.ant.dispatch.DispatchUtils.execute(DispatchUtils.java:106)
	at org.apache.tools.ant.Task.perform(Task.java:348)
	at org.apache.tools.ant.Target.execute(Target.java:390)
	at org.apache.tools.ant.Target.performTasks(Target.java:411)
	at org.apache.tools.ant.Project.executeSortedTargets(Project.java:1399)
	at org.apache.tools.ant.helper.SingleCheckExecutor.executeTargets(SingleCheckExecutor.java:38)
	at org.apache.tools.ant.Project.executeTargets(Project.java:1251)
	at org.apache.tools.ant.taskdefs.Ant.execute(Ant.java:442)
	at org.apache.tools.ant.UnknownElement.execute(UnknownElement.java:291)
	at sun.reflect.GeneratedMethodAccessor4.invoke(Unknown Source)
	at sun.reflect.DelegatingMethodAccessorImpl.invoke(DelegatingMethodAccessorImpl.java:43)
	at java.lang.reflect.Method.invoke(Method.java:601)
	at org.apache.tools.ant.dispatch.DispatchUtils.execute(DispatchUtils.java:106)
	at org.apache.tools.ant.Task.perform(Task.java:348)
	at org.apache.tools.ant.Target.execute(Target.java:390)
	at org.apache.tools.ant.Target.performTasks(Target.java:411)
	at org.apache.tools.ant.Project.executeSortedTargets(Project.java:1399)
	at org.apache.tools.ant.helper.SingleCheckExecutor.executeTargets(SingleCheckExecutor.java:38)
	at org.apache.tools.ant.Project.executeTargets(Project.java:1251)
	at org.apache.tools.ant.taskdefs.Ant.execute(Ant.java:442)
	at org.apache.tools.ant.UnknownElement.execute(UnknownElement.java:291)
	at sun.reflect.GeneratedMethodAccessor4.invoke(Unknown Source)
	at sun.reflect.DelegatingMethodAccessorImpl.invoke(DelegatingMethodAccessorImpl.java:43)
	at java.lang.reflect.Method.invoke(Method.java:601)
	at org.apache.tools.ant.dispatch.DispatchUtils.execute(DispatchUtils.java:106)
	at org.apache.tools.ant.Task.perform(Task.java:348)
	at org.apache.tools.ant.Target.execute(Target.java:390)
	at org.apache.tools.ant.Target.performTasks(Target.java:411)
	at org.apache.tools.ant.Project.executeSortedTargets(Project.java:1399)
	at org.apache.tools.ant.Project.executeTarget(Project.java:1368)
	at org.apache.tools.ant.helper.DefaultExecutor.executeTargets(DefaultExecutor.java:41)
	at org.apache.tools.ant.Project.executeTargets(Project.java:1251)
	at org.apache.tools.ant.Main.runBuild(Main.java:809)
	at org.apache.tools.ant.Main.startAnt(Main.java:217)
	at org.apache.tools.ant.launch.Launcher.run(Launcher.java:280)
	at org.apache.tools.ant.launch.Launcher.main(Launcher.java:109)
Caused by: java.text.ParseException: failed to parse report: /export/home/hudson/.ivy2/cache/org.apache.nutch-lib-regex-filter-default.xml:
Premature end of file.
	at org.apache.ivy.plugins.report.XmlReportParser.parse(XmlReportParser.java:302)
	at org.apache.ivy.core.retrieve.RetrieveEngine.determineArtifactsToCopy(RetrieveEngine.java:288)
	at org.apache.ivy.core.retrieve.RetrieveEngine.retrieve(RetrieveEngine.java:104)
	... 55 more
Caused by: org.xml.sax.SAXParseException; systemId: file:/export/home/hudson/.ivy2/cache/org.apache.nutch-lib-regex-filter-default.xml;
lineNumber: 1; columnNumber: 1; Premature end of file.
	at com.sun.org.apache.xerces.internal.util.ErrorHandlerWrapper.createSAXParseException(ErrorHandlerWrapper.java:198)
	at com.sun.org.apache.xerces.internal.util.ErrorHandlerWrapper.fatalError(ErrorHandlerWrapper.java:177)
	at com.sun.org.apache.xerces.internal.impl.XMLErrorReporter.reportError(XMLErrorReporter.java:441)
	at com.sun.org.apache.xerces.internal.impl.XMLErrorReporter.reportError(XMLErrorReporter.java:368)
	at com.sun.org.apache.xerces.internal.impl.XMLScanner.reportFatalError(XMLScanner.java:1375)
	at com.sun.org.apache.xerces.internal.impl.XMLDocumentScannerImpl$PrologDriver.next(XMLDocumentScannerImpl.java:1016)
	at com.sun.org.apache.xerces.internal.impl.XMLDocumentScannerImpl.next(XMLDocumentScannerImpl.java:607)
	at com.sun.org.apache.xerces.internal.impl.XMLDocumentFragmentScannerImpl.scanDocument(XMLDocumentFragmentScannerImpl.java:488)
	at com.sun.org.apache.xerces.internal.parsers.XML11Configuration.parse(XML11Configuration.java:835)
	at com.sun.org.apache.xerces.internal.parsers.XML11Configuration.parse(XML11Configuration.java:764)
	at com.sun.org.apache.xerces.internal.parsers.XMLParser.parse(XMLParser.java:123)
	at com.sun.org.apache.xerces.internal.parsers.AbstractSAXParser.parse(AbstractSAXParser.java:1210)
	at com.sun.org.apache.xerces.internal.jaxp.SAXParserImpl$JAXPSAXParser.parse(SAXParserImpl.java:568)
	at com.sun.org.apache.xerces.internal.jaxp.SAXParserImpl.parse(SAXParserImpl.java:302)
	at javax.xml.parsers.SAXParser.parse(SAXParser.java:328)
	at org.apache.ivy.plugins.report.XmlReportParser$SaxXmlReportParser.parse(XmlReportParser.java:258)
	at org.apache.ivy.plugins.report.XmlReportParser.parse(XmlReportParser.java:300)
	... 57 more

Total time: 44 seconds
Build step 'Invoke Ant' marked build as failure
Publishing Javadoc

Mime
View raw message