nutch-dev mailing list archives

Site index · List index
Message view « Date » · « Thread »
Top « Date » · « Thread »
From Apache Jenkins Server <jenk...@builds.apache.org>
Subject Build failed in Jenkins: Nutch-nutchgora #508
Date Tue, 26 Feb 2013 04:11:44 GMT
See <https://builds.apache.org/job/Nutch-nutchgora/508/>

------------------------------------------
[...truncated 2154 lines...]
     [echo] Compiling plugin: lib-http
    [javac] /zonestorage/hudson_solaris/home/hudson/hudson-slave/workspace/Nutch-nutchgora/2.x/src/plugin/build-plugin.xml:117:
warning: 'includeantruntime' was not set, defaulting to build.sysclasspath=last; set to false
for repeatable builds

jar:

clean-lib:

resolve-default:
[ivy:resolve] :: loading settings :: file = /zonestorage/hudson_solaris/home/hudson/hudson-slave/workspace/Nutch-nutchgora/2.x/ivy/ivysettings.xml

compile:
     [echo] Compiling plugin: protocol-httpclient
    [javac] /zonestorage/hudson_solaris/home/hudson/hudson-slave/workspace/Nutch-nutchgora/2.x/src/plugin/build-plugin.xml:117:
warning: 'includeantruntime' was not set, defaulting to build.sysclasspath=last; set to false
for repeatable builds
    [javac] Compiling 8 source files to /zonestorage/hudson_solaris/home/hudson/hudson-slave/workspace/Nutch-nutchgora/2.x/build/protocol-httpclient/classes
    [javac] warning: [options] bootstrap class path not set in conjunction with -source 1.6
    [javac] /zonestorage/hudson_solaris/home/hudson/hudson-slave/workspace/Nutch-nutchgora/2.x/src/plugin/protocol-httpclient/src/java/org/apache/nutch/protocol/httpclient/Http.java:181:
warning: [deprecation] Protocol(String,SecureProtocolSocketFactory,int) in Protocol has been
deprecated
    [javac] 		Protocol https = new Protocol("https",
    [javac] 		                 ^
    [javac] Note: Some input files use unchecked or unsafe operations.
    [javac] Note: Recompile with -Xlint:unchecked for details.
    [javac] 2 warnings

jar:
      [jar] Building jar: /zonestorage/hudson_solaris/home/hudson/hudson-slave/workspace/Nutch-nutchgora/2.x/build/protocol-httpclient/protocol-httpclient.jar

deps-test:
     [copy] Copying 2 files to /zonestorage/hudson_solaris/home/hudson/hudson-slave/workspace/Nutch-nutchgora/2.x/build/protocol-httpclient/test
     [copy] Copied 6 empty directories to 5 empty directories under /zonestorage/hudson_solaris/home/hudson/hudson-slave/workspace/Nutch-nutchgora/2.x/build/protocol-httpclient/test

deploy:
     [copy] Copying 1 file to /zonestorage/hudson_solaris/home/hudson/hudson-slave/workspace/Nutch-nutchgora/2.x/build/plugins/protocol-httpclient

copy-generated-lib:
     [copy] Copying 1 file to /zonestorage/hudson_solaris/home/hudson/hudson-slave/workspace/Nutch-nutchgora/2.x/build/plugins/protocol-httpclient

init:
    [mkdir] Created dir: /zonestorage/hudson_solaris/home/hudson/hudson-slave/workspace/Nutch-nutchgora/2.x/build/protocol-sftp
    [mkdir] Created dir: /zonestorage/hudson_solaris/home/hudson/hudson-slave/workspace/Nutch-nutchgora/2.x/build/protocol-sftp/classes
    [mkdir] Created dir: /zonestorage/hudson_solaris/home/hudson/hudson-slave/workspace/Nutch-nutchgora/2.x/build/protocol-sftp/test
    [mkdir] Created dir: /zonestorage/hudson_solaris/home/hudson/hudson-slave/workspace/Nutch-nutchgora/2.x/build/plugins/protocol-sftp

init-plugin:

deps-jar:

clean-lib:

resolve-default:
[ivy:resolve] :: loading settings :: file = /zonestorage/hudson_solaris/home/hudson/hudson-slave/workspace/Nutch-nutchgora/2.x/ivy/ivysettings.xml

compile:
     [echo] Compiling plugin: protocol-sftp
    [javac] /zonestorage/hudson_solaris/home/hudson/hudson-slave/workspace/Nutch-nutchgora/2.x/src/plugin/build-plugin.xml:117:
warning: 'includeantruntime' was not set, defaulting to build.sysclasspath=last; set to false
for repeatable builds
    [javac] Compiling 1 source file to /zonestorage/hudson_solaris/home/hudson/hudson-slave/workspace/Nutch-nutchgora/2.x/build/protocol-sftp/classes
    [javac] warning: [options] bootstrap class path not set in conjunction with -source 1.6
    [javac] Note: /zonestorage/hudson_solaris/home/hudson/hudson-slave/workspace/Nutch-nutchgora/2.x/src/plugin/protocol-sftp/src/java/org/apache/nutch/protocol/sftp/Sftp.java
uses unchecked or unsafe operations.
    [javac] Note: Recompile with -Xlint:unchecked for details.
    [javac] 1 warning

jar:
      [jar] Building jar: /zonestorage/hudson_solaris/home/hudson/hudson-slave/workspace/Nutch-nutchgora/2.x/build/protocol-sftp/protocol-sftp.jar

deps-test:

deploy:
     [copy] Copying 1 file to /zonestorage/hudson_solaris/home/hudson/hudson-slave/workspace/Nutch-nutchgora/2.x/build/plugins/protocol-sftp

copy-generated-lib:
     [copy] Copying 1 file to /zonestorage/hudson_solaris/home/hudson/hudson-slave/workspace/Nutch-nutchgora/2.x/build/plugins/protocol-sftp
    [mkdir] Created dir: /zonestorage/hudson_solaris/home/hudson/hudson-slave/workspace/Nutch-nutchgora/2.x/build/parse-js/test/data
     [copy] Copying 1 file to /zonestorage/hudson_solaris/home/hudson/hudson-slave/workspace/Nutch-nutchgora/2.x/build/parse-js/test/data

init:
    [mkdir] Created dir: /zonestorage/hudson_solaris/home/hudson/hudson-slave/workspace/Nutch-nutchgora/2.x/build/parse-js/classes
    [mkdir] Created dir: /zonestorage/hudson_solaris/home/hudson/hudson-slave/workspace/Nutch-nutchgora/2.x/build/plugins/parse-js

init-plugin:

deps-jar:

clean-lib:

resolve-default:
[ivy:resolve] :: loading settings :: file = /zonestorage/hudson_solaris/home/hudson/hudson-slave/workspace/Nutch-nutchgora/2.x/ivy/ivysettings.xml

compile:
     [echo] Compiling plugin: parse-js
    [javac] /zonestorage/hudson_solaris/home/hudson/hudson-slave/workspace/Nutch-nutchgora/2.x/src/plugin/build-plugin.xml:117:
warning: 'includeantruntime' was not set, defaulting to build.sysclasspath=last; set to false
for repeatable builds
    [javac] Compiling 1 source file to /zonestorage/hudson_solaris/home/hudson/hudson-slave/workspace/Nutch-nutchgora/2.x/build/parse-js/classes
    [javac] warning: [options] bootstrap class path not set in conjunction with -source 1.6
    [javac] 1 warning

jar:
      [jar] Building jar: /zonestorage/hudson_solaris/home/hudson/hudson-slave/workspace/Nutch-nutchgora/2.x/build/parse-js/parse-js.jar

deps-test:

init:

init-plugin:

clean-lib:

resolve-default:
[ivy:resolve] :: loading settings :: file = /zonestorage/hudson_solaris/home/hudson/hudson-slave/workspace/Nutch-nutchgora/2.x/ivy/ivysettings.xml

compile:

jar:

deps-test:

deploy:

copy-generated-lib:

init:

init-plugin:

deps-jar:

clean-lib:

resolve-default:
[ivy:resolve] :: loading settings :: file = /zonestorage/hudson_solaris/home/hudson/hudson-slave/workspace/Nutch-nutchgora/2.x/ivy/ivysettings.xml

compile:
     [echo] Compiling plugin: protocol-file
    [javac] /zonestorage/hudson_solaris/home/hudson/hudson-slave/workspace/Nutch-nutchgora/2.x/src/plugin/build-plugin.xml:117:
warning: 'includeantruntime' was not set, defaulting to build.sysclasspath=last; set to false
for repeatable builds

jar:

deps-test:

deploy:

copy-generated-lib:

deploy:
     [copy] Copying 1 file to /zonestorage/hudson_solaris/home/hudson/hudson-slave/workspace/Nutch-nutchgora/2.x/build/plugins/parse-js

copy-generated-lib:
     [copy] Copying 1 file to /zonestorage/hudson_solaris/home/hudson/hudson-slave/workspace/Nutch-nutchgora/2.x/build/plugins/parse-js

init:
    [mkdir] Created dir: /zonestorage/hudson_solaris/home/hudson/hudson-slave/workspace/Nutch-nutchgora/2.x/build/parse-html
    [mkdir] Created dir: /zonestorage/hudson_solaris/home/hudson/hudson-slave/workspace/Nutch-nutchgora/2.x/build/parse-html/classes
    [mkdir] Created dir: /zonestorage/hudson_solaris/home/hudson/hudson-slave/workspace/Nutch-nutchgora/2.x/build/parse-html/test
    [mkdir] Created dir: /zonestorage/hudson_solaris/home/hudson/hudson-slave/workspace/Nutch-nutchgora/2.x/build/plugins/parse-html

init-plugin:

deps-jar:

init:

init-plugin:

clean-lib:

resolve-default:
[ivy:resolve] :: loading settings :: file = /zonestorage/hudson_solaris/home/hudson/hudson-slave/workspace/Nutch-nutchgora/2.x/ivy/ivysettings.xml

compile:

jar:

clean-lib:

resolve-default:
[ivy:resolve] :: loading settings :: file = /zonestorage/hudson_solaris/home/hudson/hudson-slave/workspace/Nutch-nutchgora/2.x/ivy/ivysettings.xml

BUILD FAILED
/zonestorage/hudson_solaris/home/hudson/hudson-slave/workspace/Nutch-nutchgora/2.x/build.xml:104:
The following error occurred while executing this line:
/zonestorage/hudson_solaris/home/hudson/hudson-slave/workspace/Nutch-nutchgora/2.x/src/plugin/build.xml:46:
The following error occurred while executing this line:
/zonestorage/hudson_solaris/home/hudson/hudson-slave/workspace/Nutch-nutchgora/2.x/src/plugin/build-plugin.xml:214:
impossible to ivy retrieve: java.lang.RuntimeException: problem during retrieve of org.apache.nutch#parse-html:
java.text.ParseException: failed to parse report: /export/home/hudson/.ivy2/cache/org.apache.nutch-parse-html-default.xml:
The markup in the document following the root element must be well-formed.
	at org.apache.ivy.core.retrieve.RetrieveEngine.retrieve(RetrieveEngine.java:206)
	at org.apache.ivy.Ivy.retrieve(Ivy.java:540)
	at org.apache.ivy.ant.IvyRetrieve.doExecute(IvyRetrieve.java:67)
	at org.apache.ivy.ant.IvyTask.execute(IvyTask.java:277)
	at org.apache.tools.ant.UnknownElement.execute(UnknownElement.java:291)
	at sun.reflect.GeneratedMethodAccessor4.invoke(Unknown Source)
	at sun.reflect.DelegatingMethodAccessorImpl.invoke(DelegatingMethodAccessorImpl.java:43)
	at java.lang.reflect.Method.invoke(Method.java:601)
	at org.apache.tools.ant.dispatch.DispatchUtils.execute(DispatchUtils.java:106)
	at org.apache.tools.ant.Task.perform(Task.java:348)
	at org.apache.tools.ant.Target.execute(Target.java:390)
	at org.apache.tools.ant.Target.performTasks(Target.java:411)
	at org.apache.tools.ant.Project.executeSortedTargets(Project.java:1399)
	at org.apache.tools.ant.helper.SingleCheckExecutor.executeTargets(SingleCheckExecutor.java:38)
	at org.apache.tools.ant.Project.executeTargets(Project.java:1251)
	at org.apache.tools.ant.taskdefs.Ant.execute(Ant.java:442)
	at org.apache.tools.ant.UnknownElement.execute(UnknownElement.java:291)
	at sun.reflect.GeneratedMethodAccessor4.invoke(Unknown Source)
	at sun.reflect.DelegatingMethodAccessorImpl.invoke(DelegatingMethodAccessorImpl.java:43)
	at java.lang.reflect.Method.invoke(Method.java:601)
	at org.apache.tools.ant.dispatch.DispatchUtils.execute(DispatchUtils.java:106)
	at org.apache.tools.ant.Task.perform(Task.java:348)
	at org.apache.tools.ant.Target.execute(Target.java:390)
	at org.apache.tools.ant.Target.performTasks(Target.java:411)
	at org.apache.tools.ant.Project.executeSortedTargets(Project.java:1399)
	at org.apache.tools.ant.helper.SingleCheckExecutor.executeTargets(SingleCheckExecutor.java:38)
	at org.apache.tools.ant.Project.executeTargets(Project.java:1251)
	at org.apache.tools.ant.taskdefs.Ant.execute(Ant.java:442)
	at org.apache.tools.ant.UnknownElement.execute(UnknownElement.java:291)
	at sun.reflect.GeneratedMethodAccessor4.invoke(Unknown Source)
	at sun.reflect.DelegatingMethodAccessorImpl.invoke(DelegatingMethodAccessorImpl.java:43)
	at java.lang.reflect.Method.invoke(Method.java:601)
	at org.apache.tools.ant.dispatch.DispatchUtils.execute(DispatchUtils.java:106)
	at org.apache.tools.ant.Task.perform(Task.java:348)
	at org.apache.tools.ant.Target.execute(Target.java:390)
	at org.apache.tools.ant.Target.performTasks(Target.java:411)
	at org.apache.tools.ant.Project.executeSortedTargets(Project.java:1399)
	at org.apache.tools.ant.Project.executeTarget(Project.java:1368)
	at org.apache.tools.ant.helper.DefaultExecutor.executeTargets(DefaultExecutor.java:41)
	at org.apache.tools.ant.Project.executeTargets(Project.java:1251)
	at org.apache.tools.ant.Main.runBuild(Main.java:809)
	at org.apache.tools.ant.Main.startAnt(Main.java:217)
	at org.apache.tools.ant.launch.Launcher.run(Launcher.java:280)
	at org.apache.tools.ant.launch.Launcher.main(Launcher.java:109)
Caused by: java.text.ParseException: failed to parse report: /export/home/hudson/.ivy2/cache/org.apache.nutch-parse-html-default.xml:
The markup in the document following the root element must be well-formed.
	at org.apache.ivy.plugins.report.XmlReportParser.parse(XmlReportParser.java:302)
	at org.apache.ivy.core.retrieve.RetrieveEngine.determineArtifactsToCopy(RetrieveEngine.java:288)
	at org.apache.ivy.core.retrieve.RetrieveEngine.retrieve(RetrieveEngine.java:104)
	... 43 more
Caused by: org.xml.sax.SAXParseException; systemId: file:/export/home/hudson/.ivy2/cache/org.apache.nutch-parse-html-default.xml;
lineNumber: 26; columnNumber: 3; The markup in the document following the root element must
be well-formed.
	at com.sun.org.apache.xerces.internal.util.ErrorHandlerWrapper.createSAXParseException(ErrorHandlerWrapper.java:198)
	at com.sun.org.apache.xerces.internal.util.ErrorHandlerWrapper.fatalError(ErrorHandlerWrapper.java:177)
	at com.sun.org.apache.xerces.internal.impl.XMLErrorReporter.reportError(XMLErrorReporter.java:441)
	at com.sun.org.apache.xerces.internal.impl.XMLErrorReporter.reportError(XMLErrorReporter.java:368)
	at com.sun.org.apache.xerces.internal.impl.XMLScanner.reportFatalError(XMLScanner.java:1388)
	at com.sun.org.apache.xerces.internal.impl.XMLDocumentScannerImpl$TrailingMiscDriver.next(XMLDocumentScannerImpl.java:1379)
	at com.sun.org.apache.xerces.internal.impl.XMLDocumentScannerImpl.next(XMLDocumentScannerImpl.java:607)
	at com.sun.org.apache.xerces.internal.impl.XMLDocumentFragmentScannerImpl.scanDocument(XMLDocumentFragmentScannerImpl.java:489)
	at com.sun.org.apache.xerces.internal.parsers.XML11Configuration.parse(XML11Configuration.java:835)
	at com.sun.org.apache.xerces.internal.parsers.XML11Configuration.parse(XML11Configuration.java:764)
	at com.sun.org.apache.xerces.internal.parsers.XMLParser.parse(XMLParser.java:123)
	at com.sun.org.apache.xerces.internal.parsers.AbstractSAXParser.parse(AbstractSAXParser.java:1210)
	at com.sun.org.apache.xerces.internal.jaxp.SAXParserImpl$JAXPSAXParser.parse(SAXParserImpl.java:568)
	at com.sun.org.apache.xerces.internal.jaxp.SAXParserImpl.parse(SAXParserImpl.java:302)
	at javax.xml.parsers.SAXParser.parse(SAXParser.java:328)
	at org.apache.ivy.plugins.report.XmlReportParser$SaxXmlReportParser.parse(XmlReportParser.java:258)
	at org.apache.ivy.plugins.report.XmlReportParser.parse(XmlReportParser.java:300)
	... 45 more

Total time: 36 seconds
Build step 'Invoke Ant' marked build as failure
Publishing Javadoc

Mime
View raw message