nutch-dev mailing list archives

Site index · List index
Message view « Date » · « Thread »
Top « Date » · « Thread »
From Apache Jenkins Server <jenk...@builds.apache.org>
Subject Build failed in Jenkins: Nutch-nutchgora #749
Date Sun, 08 Sep 2013 04:04:08 GMT
See <https://builds.apache.org/job/Nutch-nutchgora/749/>

------------------------------------------
[...truncated 2108 lines...]
compile:
     [echo] Compiling plugin: protocol-sftp
    [javac] Compiling 1 source file to /home/hudson/jenkins-slave/workspace/Nutch-nutchgora/2.x/build/protocol-sftp/classes
    [javac] warning: [options] bootstrap class path not set in conjunction with -source 1.6
    [javac] 1 warning

jar:
      [jar] Building jar: /home/hudson/jenkins-slave/workspace/Nutch-nutchgora/2.x/build/protocol-sftp/protocol-sftp.jar

deps-test:

deploy:
     [copy] Copying 1 file to /home/hudson/jenkins-slave/workspace/Nutch-nutchgora/2.x/build/plugins/protocol-sftp

copy-generated-lib:
     [copy] Copying 1 file to /home/hudson/jenkins-slave/workspace/Nutch-nutchgora/2.x/build/plugins/protocol-sftp
    [mkdir] Created dir: /home/hudson/jenkins-slave/workspace/Nutch-nutchgora/2.x/build/parse-js/test/data
     [copy] Copying 1 file to /home/hudson/jenkins-slave/workspace/Nutch-nutchgora/2.x/build/parse-js/test/data

init:
    [mkdir] Created dir: /home/hudson/jenkins-slave/workspace/Nutch-nutchgora/2.x/build/parse-js/classes
    [mkdir] Created dir: /home/hudson/jenkins-slave/workspace/Nutch-nutchgora/2.x/build/plugins/parse-js

init-plugin:

deps-jar:

clean-lib:

resolve-default:
[ivy:resolve] :: loading settings :: file = /home/hudson/jenkins-slave/workspace/Nutch-nutchgora/2.x/ivy/ivysettings.xml

compile:
     [echo] Compiling plugin: parse-js
    [javac] Compiling 1 source file to /home/hudson/jenkins-slave/workspace/Nutch-nutchgora/2.x/build/parse-js/classes
    [javac] warning: [options] bootstrap class path not set in conjunction with -source 1.6
    [javac] 1 warning

jar:
      [jar] Building jar: /home/hudson/jenkins-slave/workspace/Nutch-nutchgora/2.x/build/parse-js/parse-js.jar

deps-test:

init:

init-plugin:

clean-lib:

resolve-default:
[ivy:resolve] :: loading settings :: file = /home/hudson/jenkins-slave/workspace/Nutch-nutchgora/2.x/ivy/ivysettings.xml

compile:

jar:

deps-test:

deploy:

copy-generated-lib:

init:

init-plugin:

deps-jar:

clean-lib:

resolve-default:
[ivy:resolve] :: loading settings :: file = /home/hudson/jenkins-slave/workspace/Nutch-nutchgora/2.x/ivy/ivysettings.xml

compile:
     [echo] Compiling plugin: protocol-file

jar:

deps-test:

deploy:

copy-generated-lib:

deploy:
     [copy] Copying 1 file to /home/hudson/jenkins-slave/workspace/Nutch-nutchgora/2.x/build/plugins/parse-js

copy-generated-lib:
     [copy] Copying 1 file to /home/hudson/jenkins-slave/workspace/Nutch-nutchgora/2.x/build/plugins/parse-js

init:
    [mkdir] Created dir: /home/hudson/jenkins-slave/workspace/Nutch-nutchgora/2.x/build/parse-html
    [mkdir] Created dir: /home/hudson/jenkins-slave/workspace/Nutch-nutchgora/2.x/build/parse-html/classes
    [mkdir] Created dir: /home/hudson/jenkins-slave/workspace/Nutch-nutchgora/2.x/build/parse-html/test
    [mkdir] Created dir: /home/hudson/jenkins-slave/workspace/Nutch-nutchgora/2.x/build/plugins/parse-html

init-plugin:

deps-jar:

init:

init-plugin:

clean-lib:

resolve-default:
[ivy:resolve] :: loading settings :: file = /home/hudson/jenkins-slave/workspace/Nutch-nutchgora/2.x/ivy/ivysettings.xml

compile:

jar:

clean-lib:

resolve-default:
[ivy:resolve] :: loading settings :: file = /home/hudson/jenkins-slave/workspace/Nutch-nutchgora/2.x/ivy/ivysettings.xml
[ivy:resolve] downloading http://repo1.maven.org/maven2/org/ccil/cowan/tagsoup/tagsoup/1.2/tagsoup-1.2.jar
...
[ivy:resolve] ............... (87kB)
[ivy:resolve] .. (0kB)
[ivy:resolve] 	[SUCCESSFUL ] org.ccil.cowan.tagsoup#tagsoup;1.2!tagsoup.jar (13ms)

compile:
     [echo] Compiling plugin: parse-html
    [javac] Compiling 5 source files to /home/hudson/jenkins-slave/workspace/Nutch-nutchgora/2.x/build/parse-html/classes
    [javac] warning: [options] bootstrap class path not set in conjunction with -source 1.6
    [javac] 1 warning

jar:
      [jar] Building jar: /home/hudson/jenkins-slave/workspace/Nutch-nutchgora/2.x/build/parse-html/parse-html.jar

deps-test:

init:

init-plugin:

clean-lib:

resolve-default:
[ivy:resolve] :: loading settings :: file = /home/hudson/jenkins-slave/workspace/Nutch-nutchgora/2.x/ivy/ivysettings.xml

compile:

jar:

deps-test:

deploy:

copy-generated-lib:

init:

init-plugin:

clean-lib:

resolve-default:
[ivy:resolve] :: loading settings :: file = /home/hudson/jenkins-slave/workspace/Nutch-nutchgora/2.x/ivy/ivysettings.xml

compile:

jar:

deps-test:

deploy:

copy-generated-lib:

deploy:
     [copy] Copying 1 file to /home/hudson/jenkins-slave/workspace/Nutch-nutchgora/2.x/build/plugins/parse-html

copy-generated-lib:
     [copy] Copying 1 file to /home/hudson/jenkins-slave/workspace/Nutch-nutchgora/2.x/build/plugins/parse-html
    [mkdir] Created dir: /home/hudson/jenkins-slave/workspace/Nutch-nutchgora/2.x/build/parse-tika/test/data
     [copy] Copying 8 files to /home/hudson/jenkins-slave/workspace/Nutch-nutchgora/2.x/build/parse-tika/test/data

init:
    [mkdir] Created dir: /home/hudson/jenkins-slave/workspace/Nutch-nutchgora/2.x/build/parse-tika/classes
    [mkdir] Created dir: /home/hudson/jenkins-slave/workspace/Nutch-nutchgora/2.x/build/plugins/parse-tika

init-plugin:

deps-jar:

clean-lib:

resolve-default:
[ivy:resolve] :: loading settings :: file = /home/hudson/jenkins-slave/workspace/Nutch-nutchgora/2.x/ivy/ivysettings.xml
[ivy:resolve] downloading http://repo1.maven.org/maven2/org/apache/tika/tika-parsers/1.4/tika-parsers-1.4.jar
...
[ivy:resolve] .........................................................................................................................
(499kB)
[ivy:resolve] .. (0kB)
[ivy:resolve] 	[SUCCESSFUL ] org.apache.tika#tika-parsers;1.4!tika-parsers.jar(bundle) (1031ms)
[ivy:resolve] downloading http://repo1.maven.org/maven2/org/apache/james/apache-mime4j-dom/0.7.2/apache-mime4j-dom-0.7.2.jar
...
[ivy:resolve] ........................................................ (297kB)
[ivy:resolve] downloading http://repo1.maven.org/maven2/org/apache/commons/commons-compress/1.5/commons-compress-1.5.jar
...
[ivy:resolve] ........................................................ (250kB)
[ivy:resolve] .. (0kB)
[ivy:resolve] downloading http://repo1.maven.org/maven2/commons-codec/commons-codec/1.5/commons-codec-1.5.jar
...
[ivy:resolve] ...... (71kB)
[ivy:resolve] .. (0kB)
[ivy:resolve] downloading http://repo1.maven.org/maven2/org/apache/pdfbox/pdfbox/1.8.1/pdfbox-1.8.1.jar
...
[ivy:resolve] ................................................................................................................................................................................................................................................................................................................................................................................................................................................................................................................................................................................................................................................................................................................................................................................................................................
(3861kB)
[ivy:resolve] downloading http://repo1.maven.org/maven2/org/bouncycastle/bcprov-jdk15/1.45/bcprov-jdk15-1.45.jar
...
[ivy:resolve] ...............................................................................................................................................................................................................................................................................................
(1624kB)
[ivy:resolve] downloading http://oss.sonatype.org/content/repositories/releases/org/bouncycastle/bcprov-jdk15/1.45/bcprov-jdk15-1.45.jar
...
[ivy:resolve] .........................................................................................................................................................................................................................................................................................................................................
(1624kB)
[ivy:resolve] .. (0kB)
[ivy:resolve] 	[SUCCESSFUL ] org.bouncycastle#bcprov-jdk15;1.45!bcprov-jdk15.jar (1993ms)
[ivy:resolve] 
[ivy:resolve] :: problems summary ::
[ivy:resolve] :::: WARNINGS
[ivy:resolve] 		[FAILED     ] org.apache.james#apache-mime4j-dom;0.7.2!apache-mime4j-dom.jar:
Downloaded file size doesn't match expected Content Length for http://repo1.maven.org/maven2/org/apache/james/apache-mime4j-dom/0.7.2/apache-mime4j-dom-0.7.2.jar.
Please retry. (13ms)
[ivy:resolve] 		[FAILED     ] org.apache.james#apache-mime4j-dom;0.7.2!apache-mime4j-dom.jar:
 (0ms)
[ivy:resolve] 	==== local: tried
[ivy:resolve] 	  /home/jenkins/.ivy2/local/org.apache.james/apache-mime4j-dom/0.7.2/jars/apache-mime4j-dom.jar
[ivy:resolve] 	==== maven2: tried
[ivy:resolve] 	  http://repo1.maven.org/maven2/org/apache/james/apache-mime4j-dom/0.7.2/apache-mime4j-dom-0.7.2.jar
[ivy:resolve] 	==== sonatype: tried
[ivy:resolve] 	  http://oss.sonatype.org/content/repositories/releases/org/apache/james/apache-mime4j-dom/0.7.2/apache-mime4j-dom-0.7.2.jar
[ivy:resolve] 		[FAILED     ] org.apache.commons#commons-compress;1.5!commons-compress.jar:
impossible to move part file to definitive one: /home/jenkins/.ivy2/cache/org.apache.commons/commons-compress/jars/commons-compress-1.5.jar.part
-> /home/jenkins/.ivy2/cache/org.apache.commons/commons-compress/jars/commons-compress-1.5.jar
(17ms)
[ivy:resolve] 		[FAILED     ] commons-codec#commons-codec;1.5!commons-codec.jar: /home/jenkins/.ivy2/cache/commons-codec/commons-codec/jars/commons-codec-1.5.jar.part
(No such file or directory) (10ms)
[ivy:resolve] 		[FAILED     ] org.apache.pdfbox#pdfbox;1.8.1!pdfbox.jar(bundle): Downloaded
file size doesn't match expected Content Length for http://repo1.maven.org/maven2/org/apache/pdfbox/pdfbox/1.8.1/pdfbox-1.8.1.jar.
Please retry. (132ms)
[ivy:resolve] 		[FAILED     ] org.bouncycastle#bcprov-jdk15;1.45!bcprov-jdk15.jar: Downloaded
file size doesn't match expected Content Length for http://repo1.maven.org/maven2/org/bouncycastle/bcprov-jdk15/1.45/bcprov-jdk15-1.45.jar.
Please retry. (72ms)
[ivy:resolve] 		::::::::::::::::::::::::::::::::::::::::::::::
[ivy:resolve] 		::              FAILED DOWNLOADS            ::
[ivy:resolve] 		:: ^ see resolution messages for details  ^ ::
[ivy:resolve] 		::::::::::::::::::::::::::::::::::::::::::::::
[ivy:resolve] 		:: org.apache.james#apache-mime4j-dom;0.7.2!apache-mime4j-dom.jar
[ivy:resolve] 		::::::::::::::::::::::::::::::::::::::::::::::
[ivy:resolve] :::: ERRORS
[ivy:resolve] 	unknown resolver m2repo
[ivy:resolve] 	unknown resolver m2repo
[ivy:resolve] 	unknown resolver m2repo
[ivy:resolve] 	unknown resolver m2repo
[ivy:resolve] 
[ivy:resolve] :: USE VERBOSE OR DEBUG MESSAGE LEVEL FOR MORE DETAILS

BUILD FAILED
/home/hudson/jenkins-slave/workspace/Nutch-nutchgora/2.x/build.xml:108: The following error
occurred while executing this line:
/home/hudson/jenkins-slave/workspace/Nutch-nutchgora/2.x/src/plugin/build.xml:47: The following
error occurred while executing this line:
/home/hudson/jenkins-slave/workspace/Nutch-nutchgora/2.x/src/plugin/build-plugin.xml:213:
impossible to resolve dependencies:
	resolve failed - see output for details

Total time: 28 seconds
Build step 'Invoke Ant' marked build as failure
Publishing Javadoc

Mime
View raw message