nutch-dev mailing list archives

Site index · List index
Message view « Date » · « Thread »
Top « Date » · « Thread »
From Apache Jenkins Server <jenk...@builds.apache.org>
Subject Build failed in Jenkins: Nutch-trunk #2345
Date Sun, 08 Sep 2013 04:04:08 GMT
See <https://builds.apache.org/job/Nutch-trunk/2345/>

------------------------------------------
[...truncated 2711 lines...]
    [mkdir] Created dir: /home/hudson/jenkins-slave/workspace/Nutch-trunk/trunk/build/plugins/parse-swf

init-plugin:

deps-jar:

clean-lib:

resolve-default:
[ivy:resolve] :: loading settings :: file = /home/hudson/jenkins-slave/workspace/Nutch-trunk/trunk/ivy/ivysettings.xml

compile:
     [echo] Compiling plugin: parse-swf
    [javac] Compiling 1 source file to /home/hudson/jenkins-slave/workspace/Nutch-trunk/trunk/build/parse-swf/classes
    [javac] warning: [options] bootstrap class path not set in conjunction with -source 1.6
    [javac] 1 warning

jar:
      [jar] Building jar: /home/hudson/jenkins-slave/workspace/Nutch-trunk/trunk/build/parse-swf/parse-swf.jar

deps-test:

init:

init-plugin:

clean-lib:

resolve-default:
[ivy:resolve] :: loading settings :: file = /home/hudson/jenkins-slave/workspace/Nutch-trunk/trunk/ivy/ivysettings.xml

compile:

jar:

deps-test:

deploy:

copy-generated-lib:

init:

init-plugin:

deps-jar:

clean-lib:

resolve-default:
[ivy:resolve] :: loading settings :: file = /home/hudson/jenkins-slave/workspace/Nutch-trunk/trunk/ivy/ivysettings.xml

compile:
     [echo] Compiling plugin: protocol-file

jar:

deps-test:

deploy:

copy-generated-lib:

deploy:
     [copy] Copying 1 file to /home/hudson/jenkins-slave/workspace/Nutch-trunk/trunk/build/plugins/parse-swf

copy-generated-lib:
     [copy] Copying 1 file to /home/hudson/jenkins-slave/workspace/Nutch-trunk/trunk/build/plugins/parse-swf
     [copy] Copying 1 file to /home/hudson/jenkins-slave/workspace/Nutch-trunk/trunk/build/plugins/parse-swf
    [mkdir] Created dir: /home/hudson/jenkins-slave/workspace/Nutch-trunk/trunk/build/parse-tika/test/data
     [copy] Copying 8 files to /home/hudson/jenkins-slave/workspace/Nutch-trunk/trunk/build/parse-tika/test/data

init:
    [mkdir] Created dir: /home/hudson/jenkins-slave/workspace/Nutch-trunk/trunk/build/parse-tika/classes
    [mkdir] Created dir: /home/hudson/jenkins-slave/workspace/Nutch-trunk/trunk/build/plugins/parse-tika

init-plugin:

deps-jar:

init:

init-plugin:

clean-lib:

resolve-default:
[ivy:resolve] :: loading settings :: file = /home/hudson/jenkins-slave/workspace/Nutch-trunk/trunk/ivy/ivysettings.xml

compile:

jar:

clean-lib:

resolve-default:
[ivy:resolve] :: loading settings :: file = /home/hudson/jenkins-slave/workspace/Nutch-trunk/trunk/ivy/ivysettings.xml
[ivy:resolve] downloading http://repo1.maven.org/maven2/org/apache/tika/tika-parsers/1.4/tika-parsers-1.4.jar
...
[ivy:resolve] ...............................................................................
(499kB)
[ivy:resolve] .. (0kB)
[ivy:resolve] 	[SUCCESSFUL ] org.apache.tika#tika-parsers;1.4!tika-parsers.jar(bundle) (19ms)
[ivy:resolve] downloading http://repo1.maven.org/maven2/org/gagravarr/vorbis-java-tika/0.1/vorbis-java-tika-0.1.jar
...
[ivy:resolve] .. (14kB)
[ivy:resolve] .. (0kB)
[ivy:resolve] 	[SUCCESSFUL ] org.gagravarr#vorbis-java-tika;0.1!vorbis-java-tika.jar (6ms)
[ivy:resolve] downloading http://repo1.maven.org/maven2/edu/ucar/netcdf/4.2-min/netcdf-4.2-min.jar
...
[ivy:resolve] ........................................................................................................................................................................................................................................................................................................................................................................................................................................................................................................................................
(4225kB)
[ivy:resolve] .. (0kB)
[ivy:resolve] 	[SUCCESSFUL ] edu.ucar#netcdf;4.2-min!netcdf.jar (88ms)
[ivy:resolve] downloading http://repo1.maven.org/maven2/org/apache/james/apache-mime4j-core/0.7.2/apache-mime4j-core-0.7.2.jar
...
[ivy:resolve] .......... (93kB)
[ivy:resolve] .. (0kB)
[ivy:resolve] 	[SUCCESSFUL ] org.apache.james#apache-mime4j-core;0.7.2!apache-mime4j-core.jar
(911ms)
[ivy:resolve] downloading http://repo1.maven.org/maven2/org/apache/james/apache-mime4j-dom/0.7.2/apache-mime4j-dom-0.7.2.jar
...
[ivy:resolve] .......................................... (297kB)
[ivy:resolve] .. (0kB)
[ivy:resolve] downloading http://repo1.maven.org/maven2/org/apache/commons/commons-compress/1.5/commons-compress-1.5.jar
...
[ivy:resolve] ................................................... (250kB)
[ivy:resolve] .. (0kB)
[ivy:resolve] 	[SUCCESSFUL ] org.apache.commons#commons-compress;1.5!commons-compress.jar
(17ms)
[ivy:resolve] downloading http://repo1.maven.org/maven2/commons-codec/commons-codec/1.5/commons-codec-1.5.jar
...
[ivy:resolve] ........ (71kB)
[ivy:resolve] .. (0kB)
[ivy:resolve] 	[SUCCESSFUL ] commons-codec#commons-codec;1.5!commons-codec.jar (8ms)
[ivy:resolve] downloading http://repo1.maven.org/maven2/org/apache/pdfbox/pdfbox/1.8.1/pdfbox-1.8.1.jar
...
[ivy:resolve] ...........................................................................................................................................................................................................................................................................................................................................................................................................................................................................................................................................................................................................................................................................
(3861kB)
[ivy:resolve] .. (0kB)
[ivy:resolve] 	[SUCCESSFUL ] org.apache.pdfbox#pdfbox;1.8.1!pdfbox.jar(bundle) (87ms)
[ivy:resolve] downloading http://repo1.maven.org/maven2/org/bouncycastle/bcmail-jdk15/1.45/bcmail-jdk15-1.45.jar
...
[ivy:resolve] ......................................... (223kB)
[ivy:resolve] .. (0kB)
[ivy:resolve] 	[SUCCESSFUL ] org.bouncycastle#bcmail-jdk15;1.45!bcmail-jdk15.jar (12ms)
[ivy:resolve] downloading http://repo1.maven.org/maven2/org/bouncycastle/bcprov-jdk15/1.45/bcprov-jdk15-1.45.jar
...
[ivy:resolve] .........................................................................................................................................................................................................................................................................................
(1624kB)
[ivy:resolve] .. (0kB)
[ivy:resolve] downloading http://repo1.maven.org/maven2/org/apache/poi/poi/3.9/poi-3.9.jar
...
[ivy:resolve] ......................................................................................................................................................................................................................................................................................................................
(1825kB)
[ivy:resolve] .. (0kB)
[ivy:resolve] 	[SUCCESSFUL ] org.apache.poi#poi;3.9!poi.jar (63ms)
[ivy:resolve] downloading http://repo1.maven.org/maven2/org/apache/poi/poi-scratchpad/3.9/poi-scratchpad-3.9.jar
...
[ivy:resolve] ..........................................................................................
(1197kB)
[ivy:resolve] .. (0kB)
[ivy:resolve] 	[SUCCESSFUL ] org.apache.poi#poi-scratchpad;3.9!poi-scratchpad.jar (34ms)
[ivy:resolve] downloading http://repo1.maven.org/maven2/org/apache/poi/poi-ooxml/3.9/poi-ooxml-3.9.jar
...
[ivy:resolve] ................................................................................................................
(914kB)
[ivy:resolve] .. (0kB)
[ivy:resolve] 	[SUCCESSFUL ] org.apache.poi#poi-ooxml;3.9!poi-ooxml.jar (24ms)
[ivy:resolve] downloading http://repo1.maven.org/maven2/org/ow2/asm/asm-debug-all/4.1/asm-debug-all-4.1.jar
...
[ivy:resolve] ................................................. (334kB)
[ivy:resolve] .. (0kB)
[ivy:resolve] 	[SUCCESSFUL ] org.ow2.asm#asm-debug-all;4.1!asm-debug-all.jar (116ms)
[ivy:resolve] downloading http://repo1.maven.org/maven2/com/googlecode/mp4parser/isoparser/1.0-RC-1/isoparser-1.0-RC-1.jar
...
[ivy:resolve] ........................................................................ (509kB)
[ivy:resolve] .. (0kB)
[ivy:resolve] 	[SUCCESSFUL ] com.googlecode.mp4parser#isoparser;1.0-RC-1!isoparser.jar (15ms)
[ivy:resolve] downloading http://repo1.maven.org/maven2/com/drewnoakes/metadata-extractor/2.6.2/metadata-extractor-2.6.2.jar
...
[ivy:resolve] ............................. (206kB)
[ivy:resolve] .. (0kB)
[ivy:resolve] 	[SUCCESSFUL ] com.drewnoakes#metadata-extractor;2.6.2!metadata-extractor.jar
(10ms)
[ivy:resolve] downloading http://repo1.maven.org/maven2/de/l3s/boilerpipe/boilerpipe/1.1.0/boilerpipe-1.1.0.jar
...
[ivy:resolve] ........... (89kB)
[ivy:resolve] .. (0kB)
[ivy:resolve] 	[SUCCESSFUL ] de.l3s.boilerpipe#boilerpipe;1.1.0!boilerpipe.jar (8ms)
[ivy:resolve] downloading http://repo1.maven.org/maven2/org/gagravarr/vorbis-java-core/0.1/vorbis-java-core-0.1.jar
...
[ivy:resolve] ... (46kB)
[ivy:resolve] .. (0kB)
[ivy:resolve] 	[SUCCESSFUL ] org.gagravarr#vorbis-java-core;0.1!vorbis-java-core.jar (8ms)
[ivy:resolve] downloading http://repo1.maven.org/maven2/org/slf4j/slf4j-api/1.5.6/slf4j-api-1.5.6.jar
...
[ivy:resolve] .. (21kB)
[ivy:resolve] .. (0kB)
[ivy:resolve] 	[SUCCESSFUL ] org.slf4j#slf4j-api;1.5.6!slf4j-api.jar (6ms)
[ivy:resolve] downloading http://repo1.maven.org/maven2/org/tukaani/xz/1.2/xz-1.2.jar ...
[ivy:resolve] ............. (92kB)
[ivy:resolve] .. (0kB)
[ivy:resolve] 	[SUCCESSFUL ] org.tukaani#xz;1.2!xz.jar (61ms)
[ivy:resolve] downloading http://repo1.maven.org/maven2/org/apache/pdfbox/fontbox/1.8.1/fontbox-1.8.1.jar
...
[ivy:resolve] ............................. (200kB)
[ivy:resolve] .. (0kB)
[ivy:resolve] 	[SUCCESSFUL ] org.apache.pdfbox#fontbox;1.8.1!fontbox.jar(bundle) (11ms)
[ivy:resolve] downloading http://repo1.maven.org/maven2/org/apache/pdfbox/jempbox/1.8.1/jempbox-1.8.1.jar
...
[ivy:resolve] ........... (49kB)
[ivy:resolve] .. (0kB)
[ivy:resolve] 	[SUCCESSFUL ] org.apache.pdfbox#jempbox;1.8.1!jempbox.jar(bundle) (8ms)
[ivy:resolve] downloading http://repo1.maven.org/maven2/org/apache/poi/poi-ooxml-schemas/3.9/poi-ooxml-schemas-3.9.jar
...
[ivy:resolve] ..........................................................................................................................................................................................................................................................................................................................................................................................................................................................................................................................................................................................................................................................................................................
(4690kB)
[ivy:resolve] .. (0kB)
[ivy:resolve] 	[SUCCESSFUL ] org.apache.poi#poi-ooxml-schemas;3.9!poi-ooxml-schemas.jar (94ms)
[ivy:resolve] downloading http://repo1.maven.org/maven2/org/apache/xmlbeans/xmlbeans/2.3.0/xmlbeans-2.3.0.jar
...
[ivy:resolve] ...................................................................................................................................................................................................................................................................................................................................................................................................
(2604kB)
[ivy:resolve] .. (0kB)
[ivy:resolve] 	[SUCCESSFUL ] org.apache.xmlbeans#xmlbeans;2.3.0!xmlbeans.jar (54ms)
[ivy:resolve] downloading http://repo1.maven.org/maven2/org/aspectj/aspectjrt/1.6.11/aspectjrt-1.6.11.jar
...
[ivy:resolve] ........... (113kB)
[ivy:resolve] .. (0kB)
[ivy:resolve] 	[SUCCESSFUL ] org.aspectj#aspectjrt;1.6.11!aspectjrt.jar (33ms)
[ivy:resolve] downloading http://repo1.maven.org/maven2/com/adobe/xmp/xmpcore/5.1.2/xmpcore-5.1.2.jar
...
[ivy:resolve] .................. (114kB)
[ivy:resolve] .. (0kB)
[ivy:resolve] 	[SUCCESSFUL ] com.adobe.xmp#xmpcore;5.1.2!xmpcore.jar (59ms)
[ivy:resolve] downloading http://repo1.maven.org/maven2/xerces/xercesImpl/2.8.1/xercesImpl-2.8.1.jar
...
[ivy:resolve] ........................................................................................................................................................................
(1184kB)
[ivy:resolve] .. (0kB)
[ivy:resolve] 	[SUCCESSFUL ] xerces#xercesImpl;2.8.1!xercesImpl.jar (31ms)
[ivy:resolve] downloading http://repo1.maven.org/maven2/xml-apis/xml-apis/1.3.03/xml-apis-1.3.03.jar
...
[ivy:resolve] ............................ (190kB)
[ivy:resolve] .. (0kB)
[ivy:resolve] 	[SUCCESSFUL ] xml-apis#xml-apis;1.3.03!xml-apis.jar (9ms)
[ivy:resolve] 
[ivy:resolve] :: problems summary ::
[ivy:resolve] :::: WARNINGS
[ivy:resolve] 	impossible to put metadata file in cache: http://repo1.maven.org/maven2/org/apache/poi/poi-ooxml/3.9/poi-ooxml-3.9.pom
(3.9). java.io.FileNotFoundException: /home/jenkins/.ivy2/cache/org.apache.poi/poi-ooxml/ivy-3.9.xml.original
(No such file or directory)
[ivy:resolve] 	impossible to put metadata file in cache: http://repo1.maven.org/maven2/org/apache/poi/poi-ooxml-schemas/3.9/poi-ooxml-schemas-3.9.pom
(3.9). java.io.FileNotFoundException: /home/jenkins/.ivy2/cache/org.apache.poi/poi-ooxml-schemas/ivy-3.9.xml.original
(No such file or directory)
[ivy:resolve] 		[FAILED     ] org.apache.james#apache-mime4j-dom;0.7.2!apache-mime4j-dom.jar:
invalid sha1: expected=1c289aa264548a0a1f1b43685a9cb2ab23f67287 computed=d4cfa7406f9c5e051a32fd02e3f4b287bbe92595
(11ms)
[ivy:resolve] 		[FAILED     ] org.apache.james#apache-mime4j-dom;0.7.2!apache-mime4j-dom.jar:
 (0ms)
[ivy:resolve] 	==== local: tried
[ivy:resolve] 	  /home/jenkins/.ivy2/local/org.apache.james/apache-mime4j-dom/0.7.2/jars/apache-mime4j-dom.jar
[ivy:resolve] 	==== maven2: tried
[ivy:resolve] 	  http://repo1.maven.org/maven2/org/apache/james/apache-mime4j-dom/0.7.2/apache-mime4j-dom-0.7.2.jar
[ivy:resolve] 		[FAILED     ] org.bouncycastle#bcprov-jdk15;1.45!bcprov-jdk15.jar: invalid
sha1: expected=7741883cb07b4634e8b5fd3337113b6ea770a9bb computed=5ac1f697008ada1d6bb497e7424910450808e059
(40ms)
[ivy:resolve] 		[FAILED     ] org.bouncycastle#bcprov-jdk15;1.45!bcprov-jdk15.jar:  (0ms)
[ivy:resolve] 	==== local: tried
[ivy:resolve] 	  /home/jenkins/.ivy2/local/org.bouncycastle/bcprov-jdk15/1.45/jars/bcprov-jdk15.jar
[ivy:resolve] 	==== maven2: tried
[ivy:resolve] 	  http://repo1.maven.org/maven2/org/bouncycastle/bcprov-jdk15/1.45/bcprov-jdk15-1.45.jar
[ivy:resolve] 		::::::::::::::::::::::::::::::::::::::::::::::
[ivy:resolve] 		::              FAILED DOWNLOADS            ::
[ivy:resolve] 		:: ^ see resolution messages for details  ^ ::
[ivy:resolve] 		::::::::::::::::::::::::::::::::::::::::::::::
[ivy:resolve] 		:: org.apache.james#apache-mime4j-dom;0.7.2!apache-mime4j-dom.jar
[ivy:resolve] 		:: org.bouncycastle#bcprov-jdk15;1.45!bcprov-jdk15.jar
[ivy:resolve] 		::::::::::::::::::::::::::::::::::::::::::::::
[ivy:resolve] :::: ERRORS
[ivy:resolve] 	unknown resolver m2repo
[ivy:resolve] 	unknown resolver m2repo
[ivy:resolve] 	unknown resolver m2repo
[ivy:resolve] 	unknown resolver m2repo
[ivy:resolve] 	unknown resolver m2repo
[ivy:resolve] 
[ivy:resolve] :: USE VERBOSE OR DEBUG MESSAGE LEVEL FOR MORE DETAILS

BUILD FAILED
/home/hudson/jenkins-slave/workspace/Nutch-trunk/trunk/build.xml:107: The following error
occurred while executing this line:
/home/hudson/jenkins-slave/workspace/Nutch-trunk/trunk/src/plugin/build.xml:55: The following
error occurred while executing this line:
/home/hudson/jenkins-slave/workspace/Nutch-trunk/trunk/src/plugin/build-plugin.xml:213: impossible
to resolve dependencies:
	resolve failed - see output for details

Total time: 42 seconds
Build step 'Invoke Ant' marked build as failure
Publishing Javadoc

Mime
View raw message